{"type":"thread.started","thread_id":"01a00722-92f7-7703-a802-fa1f6be7770e"}
{"type":"turn.started"}
{"type":"item.completed","item":{"id":"item_0","type":"agent_message","text":"I’m inspecting the existing build files and running the current scoped leaf-block checks first, then I’ll implement the parser changes and rerun the declared acceptance scope."}}
{"type":"item.started","item":{"id":"item_1","type":"command_execution","command":"/bin/bash -lc \"pwd && rg --files -g '\"'!sources/spec.txt'\"' -g '\"'!sources/spec_tests.py'\"' -g '\"'!sources/cmark.py'\"' -g '\"'!sources/normalize.py'\"' | sort && sed -n '1,240p' commonmark 2>/dev/null || true && ls -l sources\"","aggregated_output":"","exit_code":null,"status":"in_progress"}}
{"type":"item.completed","item":{"id":"item_1","type":"command_execution","command":"/bin/bash -lc \"pwd && rg --files -g '\"'!sources/spec.txt'\"' -g '\"'!sources/spec_tests.py'\"' -g '\"'!sources/cmark.py'\"' -g '\"'!sources/normalize.py'\"' | sort && sed -n '1,240p' commonmark 2>/dev/null || true && ls -l sources\"","aggregated_output":"/mnt/c/Users/barlo/projects/drydock/uat/Commonmark/runs/20260815.202344/build/commonmark\nREADME.md\ncommonmark\nsources/full_test.sh\ntests/test_interface.py\n#!/usr/bin/env python3\nimport html\nimport re\nimport sys\n\nESCAPABLE = r'!\"#$%&\\'()*+,-./:;<=>?@[\\\\]^_`{|}~'\nINLINE_TAGS = re.compile(r'<(?:[A-Za-z][A-Za-z0-9+.-]{1,31}:[^ >]+|[A-Za-z][^ >]*@[^ >]+|/?[A-Za-z][^>]*|!--[\\s\\S]*?--|\\?[\\s\\S]*?\\?|![A-Z]+\\s+[\\s\\S]*?\\s*!|![CDATA\\[[\\s\\S]*?\\]\\])>')\n\ndef esc_text(s):\n return html.escape(s, quote=False)\n\ndef normalize_source(s):\n s = s.replace('\\r\\n', '\\n').replace('\\r', '\\n').replace('\\x00', '\\ufffd')\n # Tabs are expanded to tab stops during block parsing.\n expanded=[]\n for line in s.splitlines():\n col=0; result=''\n for ch in line:\n if ch=='\\t':\n spaces=4-(col%4); result+=' '*spaces; col+=spaces\n else: result+=ch; col+=1\n expanded.append(result)\n return '\\n'.join(expanded) + ('\\n' if not s.endswith('\\n') else '')\n\nclass Document:\n def __init__(self, source):\n self.lines = normalize_source(source).splitlines()\n self.refs = {}\n\n def parse(self):\n self.collect_refs()\n return self.blocks(self.lines)\n\n def collect_refs(self):\n out=[]; i=0\n while i < len(self.lines):\n m=re.match(r' {0,3}\\[([^\\]]+)\\]:[ \\t]*(?:<([^>]+)>|(\\S+))(?:[ \\t]+(?:\"([^\"]*)\"|\\'([^\\']*)\\'|\\(([^)]*)\\)))?[ \\t]*$', self.lines[i])\n if m:\n self.refs[m.group(1).strip().casefold()] = (m.group(2) or m.group(3), m.group(4) or m.group(5) or m.group(6))\n i+=1; continue\n out.append(self.lines[i]); i+=1\n self.lines=out\n\n def inline(self, text):\n text = text.replace('\\\\\\n','<br />\\n')\n stash=[]\n def hold(v): stash.append(v); return f'\\x00{len(stash)-1}\\x00'\n # protect code spans, raw HTML, and autolinks before escaping\n def code(m):\n x=m.group(2).replace('\\n',' ')\n if x.startswith(' ') and x.endswith(' ') and x.strip(): x=x[1:-1]\n return hold('<code>'+esc_text(x)+'</code>')\n text=re.sub(r'(`+)([\\s\\S]*?)\\1',code,text)\n def raw(m):\n tag=m.group(0)\n if re.match(r'<[A-Za-z][A-Za-z0-9+.-]{1,31}:',tag):\n u=tag[1:-1]; return hold('<a href=\"'+html.escape(u,quote=True)+'\">'+esc_text(u.removeprefix('mailto:'))+'</a>')\n if re.match(r'<[^ <>]+@[^ <>]+>',tag):\n u=tag[1:-1]; return hold('<a href=\"mailto:'+html.escape(u,quote=True)+'\">'+esc_text(u)+'</a>')\n return hold(tag)\n text=INLINE_TAGS.sub(raw,text)\n text=html.escape(html.unescape(text),quote=True)\n text=re.sub(r'\\\\([!\"#$%&\\'()*+,\\-./:;<=>?@\\[\\\\\\]^_`{|}~])',r'\\1',text)\n text=re.sub(r'&(#(?:x[0-9A-Fa-f]+|[0-9]+)|[A-Za-z][A-Za-z0-9]+);',lambda m:'&'+m.group(1)+';',text)\n # images and links, including reference forms\n def image(m):\n alt= re.sub(r'[*_`]','',m.group(1)); dest=m.group(2); title=m.group(3)\n a='<img src=\"'+html.escape(dest,quote=True)+'\" alt=\"'+html.escape(alt,quote=True)+'\"'\n if title is not None: a+=' title=\"'+html.escape(title,quote=True)+'\"'\n return a+' />'\n def link(m):\n label=m.group(1); dest=m.group(2); title=m.group(3)\n a='<a href=\"'+html.escape(dest,quote=True)+'\"'\n if title is not None: a+=' title=\"'+html.escape(title,quote=True)+'\"'\n return a+'>'+self.inline(label)+'</a>'\n text=re.sub(r'!\\[([^\\]]*)\\]\\((?:<([^>]+)>|(\\S+?))(?:\\s+(?:\"([^\"]*)\"|\\'([^\\']*)\\'|\\(([^)]*)\\)))?\\)',lambda m:image(type('M',(),{'group':lambda _,n: [None,m.group(1),m.group(2) or m.group(3),m.group(4) or m.group(5) or m.group(6)][n]})()),text)\n text=re.sub(r'\\[([^\\]]+)\\]\\((?:<([^>]+)>|(\\S+?))(?:\\s+(?:\"([^\"]*)\"|\\'([^\\']*)\\'|\\(([^)]*)\\)))?\\)',lambda m:link(type('M',(),{'group':lambda _,n: [None,m.group(1),m.group(2) or m.group(3),m.group(4) or m.group(5) or m.group(6)][n]})()),text)\n def ref(m):\n key=(m.group(2) or m.group(1)).strip().casefold(); r=self.refs.get(key)\n if not r:return m.group(0)\n if m.group(0).startswith('!'):\n return '<img src=\"'+html.escape(r[0],quote=True)+'\" alt=\"'+html.escape(m.group(1),quote=True)+'\"'+((' title=\"'+html.escape(r[1],quote=True)+'\"') if r[1] else '')+' />'\n return '<a href=\"'+html.escape(r[0],quote=True)+'\"'+((' title=\"'+html.escape(r[1],quote=True)+'\"') if r[1] else '')+'>'+self.inline(m.group(1))+'</a>'\n def replace_ref(m):\n key=(m.group(3) or m.group(2)).strip().casefold()\n if key not in self.refs: return m.group(0)\n url,title=self.refs[key]\n if m.group(1):\n return '<img src=\"'+html.escape(url,quote=True)+'\" alt=\"'+html.escape(m.group(2),quote=True)+'\"'+((' title=\"'+html.escape(title,quote=True)+'\"') if title else '')+' />'\n return '<a href=\"'+html.escape(url,quote=True)+'\"'+((' title=\"'+html.escape(title,quote=True)+'\"') if title else '')+'>'+self.inline(m.group(2))+'</a>'\n text=re.sub(r'(!?)\\[([^\\]]+)\\](?:\\[([^\\]]*)\\])?',replace_ref,text)\n # emphasis (delimiters are intentionally conservative)\n text=re.sub(r'\\*\\*([^*\\n]+)\\*\\*|__([^_\\n]+)__',lambda m:'<strong>'+self.inline(m.group(1) or m.group(2))+'</strong>',text)\n text=re.sub(r'(?<!\\w)\\*([^*\\n]+)\\*|(?<!\\w)_([^_\\n]+)_(?!\\w)',lambda m:'<em>'+self.inline(m.group(1) or m.group(2))+'</em>',text)\n text=re.sub(r' {2,}\\n','<br />\\n',text)\n for i,v in enumerate(stash): text=text.replace(f'\\x00{i}\\x00',v)\n return text\n\n def blocks(self, lines):\n out=[]; i=0; n=len(lines)\n while i<n:\n line=lines[i]\n if not line.strip(): i+=1; continue\n m=re.match(r' {0,3}(`{3,}|~{3,})\\s*([^`]*)$',line)\n if m:\n fence=m.group(1); info=m.group(2).strip(); body=[]; i+=1\n while i<n and not re.match(r' {0,3}'+re.escape(fence[0])+r'{'+str(len(fence))+r',}\\s*$',lines[i]): body.append(lines[i]); i+=1\n if i<n:i+=1\n cls=' class=\"language-'+html.escape(info.split()[0],quote=True)+'\"' if info else ''\n out.append('<pre><code'+cls+'>'+esc_text('\\n'.join(body)+('\\n' if body else ''))+'</code></pre>'); continue\n m=re.match(r' {0,3}(#{1,6})(?:[ \\t]+|$)(.*)$',line)\n if m:\n content=re.sub(r'[ \\t]+#+[ \\t]*$','',m.group(2)); out.append(f'<h{len(m.group(1))}>'+self.inline(content)+f'</h{len(m.group(1))}>'); i+=1; continue\n if re.match(r' {0,3}((\\*\\s*){3,}|(-\\s*){3,}|(_\\s*){3,})$',line): out.append('<hr />'); i+=1; continue\n if re.match(r' {0,3}>',line):\n q=[]\n while i<n and (re.match(r' {0,3}>',lines[i]) or not lines[i].strip()):\n q.append(re.sub(r'^ {0,3}>[ \\t]?','',lines[i])); i+=1\n out.append('<blockquote>\\n'+self.blocks(q)+'\\n</blockquote>'); continue\n lm=re.match(r' {0,3}([-+*]|\\d+[.)])[ \\t]+(.*)$',line)\n if lm:\n marker=lm.group(1); ordered=marker[0].isdigit(); items=[]\n while i<n:\n mm=re.match(r' {0,3}([-+*]|\\d+[.)])[ \\t]+(.*)$',lines[i])\n if not mm or mm.group(1)[0].isdigit()!=ordered: break\n item=[mm.group(2)]; i+=1\n while i<n and lines[i].strip() and not re.match(r' {0,3}([-+*]|\\d+[.)])[ \\t]+',lines[i]):\n item.append(re.sub(r'^ {2,4}','',lines[i])); i+=1\n items.append(item)\n tag='ol' if ordered else 'ul'; attrs=''\n if ordered and not marker.startswith('1'): attrs=' start=\"'+re.match(r'\\d+',marker).group()+'\"'\n rendered=[]\n for item in items:\n content=self.blocks(item).strip()\n if content.startswith('<p>') and content.endswith('</p>') and '\\n' not in content:\n content=content[3:-4]\n rendered.append('<li>'+content+'</li>')\n out.append('<'+tag+attrs+'>'+''.join(rendered)+'</'+tag+'>'); continue\n if re.match(r' {4}',line):\n b=[]\n while i<n and (lines[i].startswith(' ') or not lines[i].strip()): b.append(lines[i][4:] if lines[i].startswith(' ') else ''); i+=1\n out.append('<pre><code>'+esc_text('\\n'.join(b).rstrip('\\n')+'\\n')+'</code></pre>'); continue\n # HTML blocks\n if re.match(r' {0,3}<(?:script|pre|style|div|table|ul|ol|h[1-6]|p|address|article|section|details|summary|blockquote|hr|!--|!DOCTYPE|\\?|!\\[CDATA\\[)',line,re.I):\n b=[line]; i+=1\n while i<n and lines[i].strip(): b.append(lines[i]); i+=1\n out.append('\\n'.join(b)); continue\n # paragraph, with setext heading\n b=[line]; i+=1\n while i<n and lines[i].strip():\n if re.match(r' {0,3}(#{1,6})[ \\t]| {0,3}(`{3,}|~{3,})| {0,3}>| {4}',lines[i]): break\n if re.match(r' {0,3}(=+|-+)[ \\t]*$',lines[i]) and len(b)==1:\n out.append('<h1>'+self.inline(b[0].strip())+'</h1>' if lines[i].lstrip().startswith('=') else '<h2>'+self.inline(b[0].strip())+'</h2>'); i+=1; b=None; break\n b.append(lines[i]); i+=1\n if b is not None: out.append('<p>'+self.inline('\\n'.join(b))+'</p>')\n return '\\n'.join(out)+'\\n' if out else ''\n\ndef main():\n sys.stdout.write(Document(sys.stdin.read()).parse())\nif __name__=='__main__': main()\ntotal 228\ndrwxrwxrwx 1 barlo barlo 512 Aug 15 16:34 __pycache__\n-rwxrwxrwx 1 barlo barlo 1354 Aug 15 16:23 cmark.py\n-rwxrwxrwx 1 barlo barlo 2035 Aug 15 16:23 full_test.sh\n-rwxrwxrwx 1 barlo barlo 6522 Aug 15 16:23 normalize.py\n-rwxrwxrwx 1 barlo barlo 206108 Aug 15 16:23 spec.txt\n-rwxrwxrwx 1 barlo barlo 6433 Aug 15 16:23 spec_tests.py\n","exit_code":0,"status":"completed"}}
{"type":"item.started","item":{"id":"item_2","type":"command_execution","command":"/bin/bash -lc \"python3 sources/spec_tests.py --program ./commonmark --spec sources/spec.txt --pattern '\"'^(Thematic breaks|ATX headings|Setext headings|Indented code blocks|Fenced code blocks|HTML blocks|Link reference definitions|Paragraphs|Blank lines)$'\"'\"","aggregated_output":"","exit_code":null,"status":"in_progress"}}
{"type":"item.completed","item":{"id":"item_2","type":"command_execution","command":"/bin/bash -lc \"python3 sources/spec_tests.py --program ./commonmark --spec sources/spec.txt --pattern '\"'^(Thematic breaks|ATX headings|Setext headings|Indented code blocks|Fenced code blocks|HTML blocks|Link reference definitions|Paragraphs|Blank lines)$'\"'\"","aggregated_output":"Example 49 (lines 942-948) Thematic breaks\nFoo\n ***\n\n--- expected HTML\n+++ actual HTML\n@@ -1 +1,2 @@\n-<p>Foo ***</p>\n+<p>Foo</p><pre><code>***\n+</code></pre>\n\nExample 55 (lines 994-1004) Thematic breaks\n_ _ _ _ a\n\na------\n\n---a---\n\n--- expected HTML\n+++ actual HTML\n@@ -1 +1 @@\n-<p>_ _ _ _ a</p><p>a------</p><p>---a---</p>\n+<p><em> </em> <em> </em> a</p><p>a------</p><p>---a---</p>\n\nExample 57 (lines 1019-1031) Thematic breaks\n- foo\n***\n- bar\n\n--- expected HTML\n+++ actual HTML\n@@ -1 +1 @@\n-<ul><li>foo</li></ul><hr><ul><li>bar</li></ul>\n+<ul><li><p>foo ***</p></li><li>bar</li></ul>\n\nExample 58 (lines 1036-1044) Thematic breaks\nFoo\n***\nbar\n\n--- expected HTML\n+++ actual HTML\n@@ -1 +1 @@\n-<p>Foo</p><hr><p>bar</p>\n+<p>Foo *** bar</p>\n\nExample 60 (lines 1066-1078) Thematic breaks\n* Foo\n* * *\n* Bar\n\n--- expected HTML\n+++ actual HTML\n@@ -1 +1 @@\n-<ul><li>Foo</li></ul><hr><ul><li>Bar</li></ul>\n+<ul><li>Foo</li><li><ul><li>*</li></ul></li><li>Bar</li></ul>\n\nExample 66 (lines 1167-1171) ATX headings\n# foo *bar* \\*baz\\*\n\n--- expected HTML\n+++ actual HTML\n@@ -1 +1 @@\n-<h1>foo <em>bar</em> *baz*</h1>\n+<h1>foo <em>bar</em> <em>baz</em></h1>\n\nExample 70 (lines 1206-1212) ATX headings\nfoo\n # bar\n\n--- expected HTML\n+++ actual HTML\n@@ -1 +1,2 @@\n-<p>foo # bar</p>\n+<p>foo</p><pre><code># bar\n+</code></pre>\n\nExample 79 (lines 1307-1315) ATX headings\n## \n#\n### ###\n\n--- expected HTML\n+++ actual HTML\n@@ -1 +1 @@\n-<h2></h2><h1></h1><h3></h3>\n+<h2></h2><h1></h1><h3>###</h3>\n\nExample 81 (lines 1361-1368) Setext headings\nFoo *bar\nbaz*\n====\n\n--- expected HTML\n+++ actual HTML\n@@ -1 +1 @@\n-<h1>Foo <em>bar baz</em></h1>\n+<p>Foo *bar baz* ====</p>\n\nExample 82 (lines 1375-1382) Setext headings\n Foo *bar\nbaz*\t\n====\n\n--- expected HTML\n+++ actual HTML\n@@ -1 +1 @@\n-<h1>Foo <em>bar baz</em></h1>\n+<p>Foo *bar baz*<br>====</p>\n\nExample 87 (lines 1449-1455) Setext headings\nFoo\n ---\n\n--- expected HTML\n+++ actual HTML\n@@ -1 +1,2 @@\n-<p>Foo ---</p>\n+<p>Foo</p><pre><code>---\n+</code></pre>\n\nExample 88 (lines 1460-1471) Setext headings\nFoo\n= =\n\nFoo\n--- -\n\n--- expected HTML\n+++ actual HTML\n@@ -1 +1 @@\n-<p>Foo = =</p><p>Foo</p><hr>\n+<p>Foo = =</p><p>Foo --- -</p>\n\nExample 93 (lines 1527-1537) Setext headings\n> foo\nbar\n===\n\n--- expected HTML\n+++ actual HTML\n@@ -1 +1 @@\n-<blockquote><p>foo bar ===</p></blockquote>\n+<blockquote><p>foo</p></blockquote><h1>bar</h1>\n\nExample 94 (lines 1540-1548) Setext headings\n- Foo\n---\n\n--- expected HTML\n+++ actual HTML\n@@ -1 +1 @@\n-<ul><li>Foo</li></ul><hr>\n+<ul><li><h2>Foo</h2></li></ul>\n\nExample 95 (lines 1555-1562) Setext headings\nFoo\nBar\n---\n\n--- expected HTML\n+++ actual HTML\n@@ -1 +1 @@\n-<h2>Foo Bar</h2>\n+<p>Foo Bar ---</p>\n\nExample 99 (lines 1606-1614) Setext headings\n- foo\n-----\n\n--- expected HTML\n+++ actual HTML\n@@ -1 +1 @@\n-<ul><li>foo</li></ul><hr>\n+<ul><li><h2>foo</h2></li></ul>\n\nExample 105 (lines 1706-1716) Setext headings\nFoo\nbar\n* * *\nbaz\n\n--- expected HTML\n+++ actual HTML\n@@ -1 +1 @@\n-<p>Foo bar</p><hr><p>baz</p>\n+<p>Foo bar <em> </em> * baz</p>\n\nExample 108 (lines 1763-1774) Indented code blocks\n - foo\n\n bar\n\n--- expected HTML\n+++ actual HTML\n@@ -1 +1,2 @@\n-<ul><li><p>foo</p><p>bar</p></li></ul>\n+<ul><li>foo</li></ul><pre><code>bar\n+</code></pre>\n\nExample 109 (lines 1777-1790) Indented code blocks\n1. foo\n\n - bar\n\n--- expected HTML\n+++ actual HTML\n@@ -1 +1,2 @@\n-<ol><li><p>foo</p><ul><li>bar</li></ul></li></ol>\n+<ol><li>foo</li></ol><pre><code>- bar\n+</code></pre>\n\nExample 113 (lines 1851-1858) Indented code blocks\nFoo\n bar\n\n\n--- expected HTML\n+++ actual HTML\n@@ -1 +1,2 @@\n-<p>Foo bar</p>\n+<p>Foo</p><pre><code>bar\n+</code></pre>\n\nExample 128 (lines 2091-2102) Fenced code blocks\n> ```\n> aaa\n\nbbb\n\n--- expected HTML\n+++ actual HTML\n@@ -1,2 +1,3 @@\n <blockquote><pre><code>aaa\n+\n </code></pre></blockquote><p>bbb</p>\n\nExample 131 (lines 2133-2142) Fenced code blocks\n ```\n aaa\naaa\n```\n\n--- expected HTML\n+++ actual HTML\n@@ -1,3 +1,3 @@\n-<pre><code>aaa\n+<pre><code> aaa\n aaa\n </code></pre>\n\nExample 132 (lines 2145-2156) Fenced code blocks\n ```\naaa\n aaa\naaa\n ```\n\n--- expected HTML\n+++ actual HTML\n@@ -1,4 +1,4 @@\n <pre><code>aaa\n-aaa\n+ aaa\n aaa\n </code></pre>\n\nExample 133 (lines 2159-2170) Fenced code blocks\n ```\n aaa\n aaa\n aaa\n ```\n\n--- expected HTML\n+++ actual HTML\n@@ -1,4 +1,4 @@\n-<pre><code>aaa\n- aaa\n-aaa\n+<pre><code> aaa\n+ aaa\n+ aaa\n </code></pre>\n\nExample 146 (lines 2337-2344) Fenced code blocks\n~~~ aa ``` ~~~\nfoo\n~~~\n\n--- expected HTML\n+++ actual HTML\n@@ -1,2 +1 @@\n-<pre><code class=\"language-aa\">foo\n-</code></pre>\n+<p>~~~ aa <code></code>` ~~~ foo</p><pre><code></code></pre>\n\nExample 148 (lines 2429-2444) HTML blocks\n<table><tr><td>\n<pre>\n**Hello**,\n\n_world_.\n</pre>\n</td></tr></table>\n\n--- expected HTML\n+++ actual HTML\n@@ -1,3 +1,3 @@\n <table><tr><td><pre>\n **Hello**,<p><em>world</em>.\n-</pre></p></td></tr></table>\n+</pre></td></tr></table></p>\n\nExample 151 (lines 2493-2499) HTML blocks\n</div>\n*foo*\n\n--- expected HTML\n+++ actual HTML\n@@ -1 +1 @@\n-</div>*foo*\n+<p></div><em>foo</em></p>\n\nExample 152 (lines 2504-2514) HTML blocks\n<DIV CLASS=\"foo\">\n\n*Markdown*\n\n</DIV>\n\n--- expected HTML\n+++ actual HTML\n@@ -1 +1 @@\n-<div class=\"foo\"><p><em>Markdown</em></p></div>\n+<div class=\"foo\"><p><em>Markdown</em></p><p></div></p>\n\nExample 163 (lines 2642-2650) HTML blocks\n<a href=\"foo\">\n*bar*\n</a>\n\n--- expected HTML\n+++ actual HTML\n@@ -1 +1 @@\n-<a href=\"foo\"> *bar* </a> \n+<p><a href=\"foo\"> <em>bar</em> </a></p>\n\nExample 164 (lines 2655-2663) HTML blocks\n<Warning>\n*bar*\n</Warning>\n\n--- expected HTML\n+++ actual HTML\n@@ -1 +1 @@\n-<warning> *bar* </warning> \n+<p><warning> <em>bar</em> </warning></p>\n\nExample 165 (lines 2666-2674) HTML blocks\n<i class=\"foo\">\n*bar*\n</i>\n\n--- expected HTML\n+++ actual HTML\n@@ -1 +1 @@\n-<i class=\"foo\"> *bar* </i> \n+<p><i class=\"foo\"> <em>bar</em> </i></p>\n\nExample 166 (lines 2677-2683) HTML blocks\n</ins>\n*bar*\n\n--- expected HTML\n+++ actual HTML\n@@ -1 +1 @@\n-</ins> *bar* \n+<p></ins> <em>bar</em></p>\n\nExample 167 (lines 2692-2700) HTML blocks\n<del>\n*foo*\n</del>\n\n--- expected HTML\n+++ actual HTML\n@@ -1 +1 @@\n-<del> *foo* </del> \n+<p><del> <em>foo</em> </del></p>\n\nExample 168 (lines 2707-2717) HTML blocks\n<del>\n\n*foo*\n\n</del>\n\n--- expected HTML\n+++ actual HTML\n@@ -1 +1 @@\n-<del><p><em>foo</em></p></del> \n+<p><del></p><p><em>foo</em></p><p></del></p>\n\nExample 171 (lines 2753-2769) HTML blocks\n<pre language=\"haskell\"><code>\nimport Text.HTML.TagSoup\n\nmain :: IO ()\nmain = print $ parseTags tags\n</code></pre>\nokay\n\n--- expected HTML\n+++ actual HTML\n@@ -1,6 +1,4 @@\n <pre language=\"haskell\"><code>\n-import Text.HTML.TagSoup\n-\n-main :: IO ()\n+import Text.HTML.TagSoup<p>main :: IO ()\n main = print $ parseTags tags\n-</code></pre><p>okay</p>\n+</code></pre>okay</p>\n\nExample 172 (lines 2774-2788) HTML blocks\n<script type=\"text/javascript\">\n// JavaScript example\n\ndocument.getElementById(\"demo\").innerHTML = \"Hello JavaScript!\";\n</script>\nokay\n\n--- expected HTML\n+++ actual HTML\n@@ -1 +1 @@\n-<script type=\"text/javascript\">// JavaScript example document.getElementById(\"demo\").innerHTML = \"Hello JavaScript!\";</script><p>okay</p>\n+<script type=\"text/javascript\">// JavaScript example <p>document.getElementById("demo").innerHTML = "Hello JavaScript!";</script>okay</p>\n\nExample 173 (lines 2793-2809) HTML blocks\n<textarea>\n\n*foo*\n\n_bar_\n\n</textarea>\n\n--- expected HTML\n+++ actual HTML\n@@ -1 +1 @@\n-<textarea>*foo* _bar_</textarea>\n+<p><textarea></p> <p><em>foo</em></p> <p><em>bar</em></p> <p></textarea></p>\n\nExample 174 (lines 2813-2829) HTML blocks\n<style\n type=\"text/css\">\nh1 {color:red;}\n\np {color:blue;}\n</style>\nokay\n\n--- expected HTML\n+++ actual HTML\n@@ -1 +1 @@\n-<style type=\"text/css\">h1 {color:red;} p {color:blue;}</style><p>okay</p>\n+<style type=\"text/css\">h1 {color:red;} <p>p {color:blue;}</style>okay</p>\n\nExample 175 (lines 2836-2846) HTML blocks\n<style\n type=\"text/css\">\n\nfoo\n\n--- expected HTML\n+++ actual HTML\n@@ -1 +1 @@\n-<style type=\"text/css\">foo \n+<style type=\"text/css\"><p>foo</p> \n\nExample 178 (lines 2878-2884) HTML blocks\n<style>p{color:red;}</style>\n*foo*\n\n--- expected HTML\n+++ actual HTML\n@@ -1 +1 @@\n-<style>p{color:red;}</style><p><em>foo</em></p>\n+<style>p{color:red;}</style>*foo*\n\nExample 179 (lines 2887-2893) HTML blocks\n<!-- foo -->*bar*\n*baz*\n\n--- expected HTML\n+++ actual HTML\n@@ -1 +1 @@\n-<!-- foo -->*bar*<p><em>baz</em></p>\n+<!-- foo -->*bar* *baz* \n\nExample 181 (lines 2912-2924) HTML blocks\n<!-- Foo\n\nbar\n baz -->\nokay\n\n--- expected HTML\n+++ actual HTML\n@@ -1,4 +1,5 @@\n <!-- Foo\n-\n-bar\n- baz --><p>okay</p>\n+<p>bar\n+ baz -->\n+okay</p>\n+-->\n\nExample 182 (lines 2930-2944) HTML blocks\n<?php\n\n echo '>';\n\n?>\nokay\n\n--- expected HTML\n+++ actual HTML\n@@ -1,3 +1,2 @@\n <?php\n-\n- echo '>'; ?><p>okay</p>\n+<p> echo '>';</p><p>?> okay</p>\n\nExample 184 (lines 2958-2986) HTML blocks\n<![CDATA[\nfunction matchwo(a,b)\n{\n if (a < b && a < 0) then {\n return 1;\n\n } else {\n\n return 0;\n }\n}\n]]>\nokay\n\n--- expected HTML\n+++ actual HTML\n@@ -3,10 +3,5 @@\n {\n if (a < b && a < 0) then {\n return 1;\n-\n- } else {\n-\n- return 0;\n- }\n-}\n-]]><p>okay</p>\n+<p> } else {</p><pre><code>return 0;\n+</code></pre><p>} } ]]> okay</p>\n\nExample 187 (lines 3017-3027) HTML blocks\nFoo\n<div>\nbar\n</div>\n\n--- expected HTML\n+++ actual HTML\n@@ -1 +1 @@\n-<p>Foo</p><div>bar</div>\n+<p>Foo<div>bar</div></p>\n\nExample 190 (lines 3090-3100) HTML blocks\n<div>\n\n*Emphasized* text.\n\n</div>\n\n--- expected HTML\n+++ actual HTML\n@@ -1 +1 @@\n-<div><p><em>Emphasized</em> text.</p></div>\n+<div><p><em>Emphasized</em> text.</p><p></div></p>\n\nExample 192 (lines 3125-3145) HTML blocks\n<table>\n\n<tr>\n\n<td>\nHi\n</td>\n\n</tr>\n\n</table>\n\n--- expected HTML\n+++ actual HTML\n@@ -1 +1 @@\n-<table><tr><td>Hi</td></tr></table>\n+<table><p><tr></p><p><td>Hi</td></p><p></tr></p><p></table></p>\n\nExample 193 (lines 3152-3173) HTML blocks\n<table>\n\n <tr>\n\n <td>\n Hi\n </td>\n\n </tr>\n\n</table>\n\n--- expected HTML\n+++ actual HTML\n@@ -1,4 +1,4 @@\n-<table><tr><pre><code><td>\n+<table><p><tr></p><pre><code><td>\n Hi\n </td>\n-</code></pre></tr></table>\n+</code></pre><p></tr></p><p></table></p>\n\nExample 195 (lines 3210-3218) Link reference definitions\n [foo]: \n /url \n 'the title' \n\n[foo]\n\n--- expected HTML\n+++ actual HTML\n@@ -1 +1,3 @@\n-<p><a href=\"/url\" title=\"the title\">foo</a></p>\n+<p>[foo]:</p><pre><code> /url \n+ 'the title' \n+</code></pre><p>[foo]</p>\n\nExample 196 (lines 3221-3227) Link reference definitions\n[Foo*bar\\]]:my_(url) 'title (with parens)'\n\n[Foo*bar\\]]\n\n--- expected HTML\n+++ actual HTML\n@@ -1 +1 @@\n-<p><a href=\"my_(url)\" title=\"title (with parens)\">Foo*bar]</a></p>\n+<p>[Foo*bar]]:my_(url) 'title (with parens)'</p><p>[Foo*bar]]</p>\n\nExample 197 (lines 3230-3238) Link reference definitions\n[Foo bar]:\n<my url>\n'title'\n\n[Foo bar]\n\n--- expected HTML\n+++ actual HTML\n@@ -1 +1 @@\n-<p><a href=\"my%20url\" title=\"title\">Foo bar</a></p>\n+<p>[Foo bar]: <my url> 'title'</p><p>[Foo bar]</p>\n\nExample 198 (lines 3243-3257) Link reference definitions\n[foo]: /url '\ntitle\nline1\nline2\n'\n\n[foo]\n\n--- expected HTML\n+++ actual HTML\n@@ -1,5 +1 @@\n-<p><a href=\"/url\" title=\"\n-title\n-line1\n-line2\n-\">foo</a></p>\n+<p>[foo]: /url ' title line1 line2 '</p><p>[foo]</p>\n\nExample 200 (lines 3277-3284) Link reference definitions\n[foo]:\n/url\n\n[foo]\n\n--- expected HTML\n+++ actual HTML\n@@ -1 +1 @@\n-<p><a href=\"/url\">foo</a></p>\n+<p>[foo]: /url</p><p>[foo]</p>\n\nExample 202 (lines 3301-3307) Link reference definitions\n[foo]: <>\n\n[foo]\n\n--- expected HTML\n+++ actual HTML\n@@ -1 +1 @@\n-<p><a href=\"\">foo</a></p>\n+<p><a href=\"<>\">foo</a></p>\n\nExample 203 (lines 3312-3319) Link reference definitions\n[foo]: <bar>(baz)\n\n[foo]\n\n--- expected HTML\n+++ actual HTML\n@@ -1 +1 @@\n-<p>[foo]: <bar>(baz)</p><p>[foo]</p>\n+<p><a href=\"<bar>(baz)\">foo</a></p>\n\nExample 204 (lines 3325-3331) Link reference definitions\n[foo]: /url\\bar\\*baz \"foo\\\"bar\\baz\"\n\n[foo]\n\n--- expected HTML\n+++ actual HTML\n@@ -1 +1 @@\n-<p><a href=\"/url%5Cbar*baz\" title=\"foo"bar\\baz\">foo</a></p>\n+<p>[foo]: /url\\bar*baz "foo"bar\\baz"</p><p>[foo]</p>\n\nExample 206 (lines 3348-3355) Link reference definitions\n[foo]\n\n[foo]: first\n[foo]: second\n\n--- expected HTML\n+++ actual HTML\n@@ -1 +1 @@\n-<p><a href=\"first\">foo</a></p>\n+<p><a href=\"second\">foo</a></p>\n\nExample 208 (lines 3370-3376) Link reference definitions\n[ΑΓΩ]: /φου\n\n[αγω]\n\n--- expected HTML\n+++ actual HTML\n@@ -1 +1 @@\n-<p><a href=\"/%CF%86%CE%BF%CF%85\">αγω</a></p>\n+<p><a href=\"/φου\">αγω</a></p>\n\nExample 210 (lines 3393-3400) Link reference definitions\n[\nfoo\n]: /url\nbar\n\n--- expected HTML\n+++ actual HTML\n@@ -1 +1 @@\n-<p>bar</p>\n+<p>[ foo ]: /url bar</p>\n\nExample 213 (lines 3426-3434) Link reference definitions\n [foo]: /url \"title\"\n\n[foo]\n\n--- expected HTML\n+++ actual HTML\n@@ -1,2 +1,2 @@\n-<pre><code>[foo]: /url "title"\n+<pre><code>[foo]: /url \"title\"\n </code></pre><p>[foo]</p>\n\nExample 214 (lines 3440-3450) Link reference definitions\n```\n[foo]: /url\n```\n\n[foo]\n\n--- expected HTML\n+++ actual HTML\n@@ -1,2 +1 @@\n-<pre><code>[foo]: /url\n-</code></pre><p>[foo]</p>\n+<pre><code></code></pre><p><a href=\"/url\">foo</a></p>\n\nExample 215 (lines 3455-3464) Link reference definitions\nFoo\n[bar]: /baz\n\n[bar]\n\n--- expected HTML\n+++ actual HTML\n@@ -1 +1 @@\n-<p>Foo [bar]: /baz</p><p>[bar]</p>\n+<p>Foo</p><p><a href=\"/baz\">bar</a></p>\n\nExample 219 (lines 3504-3517) Link reference definitions\n[foo]: /foo-url \"foo\"\n[bar]: /bar-url\n \"bar\"\n[baz]: /baz-url\n\n[foo],\n[bar],\n[baz]\n\n--- expected HTML\n+++ actual HTML\n@@ -1 +1 @@\n-<p><a href=\"/foo-url\" title=\"foo\">foo</a>, <a href=\"/bar-url\" title=\"bar\">bar</a>, <a href=\"/baz-url\">baz</a></p>\n+<p>"bar"</p><p><a href=\"/foo-url\" title=\"foo\">foo</a>, <a href=\"/bar-url\">bar</a>, <a href=\"/baz-url\">baz</a></p>\n\nExample 220 (lines 3525-3533) Link reference definitions\n[foo]\n\n> [foo]: /url\n\n--- expected HTML\n+++ actual HTML\n@@ -1 +1 @@\n-<p><a href=\"/url\">foo</a></p><blockquote></blockquote>\n+<p>[foo]</p><blockquote><p>[foo]: /url</p></blockquote>\n\nExample 225 (lines 3600-3608) Paragraphs\naaa\n bbb\n ccc\n\n--- expected HTML\n+++ actual HTML\n@@ -1 +1,3 @@\n-<p>aaa bbb ccc</p>\n+<p>aaa</p><pre><code> bbb\n+ ccc\n+</code></pre>\n\n122 passed, 65 failed, 0 errored, 468 skipped\n","exit_code":65,"status":"failed"}}
{"type":"item.completed","item":{"id":"item_3","type":"agent_message","text":"The baseline has 122/187 scoped leaf examples passing. The failures cluster around block precedence, multiline/setext handling, fence indentation, HTML block termination, and reference-definition parsing; I’m addressing those parser-level causes together so the fixes generalize across examples."}}
{"type":"item.started","item":{"id":"item_4","type":"file_change","changes":[{"path":"/mnt/c/Users/barlo/projects/drydock/uat/Commonmark/runs/20260815.202344/build/commonmark/commonmark","kind":"update"}],"status":"in_progress"}}
{"type":"item.completed","item":{"id":"item_4","type":"file_change","changes":[{"path":"/mnt/c/Users/barlo/projects/drydock/uat/Commonmark/runs/20260815.202344/build/commonmark/commonmark","kind":"update"}],"status":"completed"}}
{"type":"item.started","item":{"id":"item_5","type":"file_change","changes":[{"path":"/mnt/c/Users/barlo/projects/drydock/uat/Commonmark/runs/20260815.202344/build/commonmark/commonmark","kind":"update"}],"status":"in_progress"}}
{"type":"item.completed","item":{"id":"item_5","type":"file_change","changes":[{"path":"/mnt/c/Users/barlo/projects/drydock/uat/Commonmark/runs/20260815.202344/build/commonmark/commonmark","kind":"update"}],"status":"completed"}}
{"type":"item.started","item":{"id":"item_6","type":"command_execution","command":"/bin/bash -lc 'python3 -m py_compile commonmark'","aggregated_output":"","exit_code":null,"status":"in_progress"}}
{"type":"item.completed","item":{"id":"item_6","type":"command_execution","command":"/bin/bash -lc 'python3 -m py_compile commonmark'","aggregated_output":"","exit_code":0,"status":"completed"}}
{"type":"item.started","item":{"id":"item_7","type":"command_execution","command":"/bin/bash -lc \"nl -ba commonmark | sed -n '190,330p'\"","aggregated_output":"","exit_code":null,"status":"in_progress"}}
{"type":"item.completed","item":{"id":"item_7","type":"command_execution","command":"/bin/bash -lc \"nl -ba commonmark | sed -n '190,330p'\"","aggregated_output":" 190\t marker=lm.group(1); ordered=marker[0].isdigit(); items=[]\n 191\t while i<n:\n 192\t mm=re.match(r' {0,3}([-+*]|\\d+[.)])[ \\t]+(.*)$',lines[i])\n 193\t if not mm or mm.group(1)[0].isdigit()!=ordered: break\n 194\t item=[mm.group(2)]; i+=1\n 195\t while i<n and lines[i].strip() and not re.match(r' {0,3}([-+*]|\\d+[.)])[ \\t]+',lines[i]):\n 196\t item.append(re.sub(r'^ {2,4}','',lines[i])); i+=1\n 197\t items.append(item)\n 198\t tag='ol' if ordered else 'ul'; attrs=''\n 199\t if ordered and not marker.startswith('1'): attrs=' start=\"'+re.match(r'\\d+',marker).group()+'\"'\n 200\t rendered=[]\n 201\t for item in items:\n 202\t content=self.blocks(item).strip()\n 203\t if content.startswith('<p>') and content.endswith('</p>') and '\\n' not in content:\n 204\t content=content[3:-4]\n 205\t rendered.append('<li>'+content+'</li>')\n 206\t out.append('<'+tag+attrs+'>'+''.join(rendered)+'</'+tag+'>'); continue\n 207\t if re.match(r' {4}',line):\n 208\t b=[]\n 209\t while i<n and (lines[i].startswith(' ') or not lines[i].strip()): b.append(lines[i][4:] if lines[i].startswith(' ') else ''); i+=1\n 210\t out.append('<pre><code>'+esc_text('\\n'.join(b).rstrip('\\n')+'\\n')+'</code></pre>'); continue\n 211\t # HTML blocks\n 212\t if re.match(r' {0,3}<(?:script|pre|style|div|table|ul|ol|h[1-6]|p|address|article|section|details|summary|blockquote|hr|!--|!DOCTYPE|\\?|!\\[CDATA\\[)',line,re.I):\n 213\t b=[line]; i+=1\n 214\t while i<n and lines[i].strip(): b.append(lines[i]); i+=1\n 215\t out.append('\\n'.join(b)); continue\n 216\t # paragraph, with setext heading\n 217\t b=[line]; i+=1\n 218\t while i<n and lines[i].strip():\n 219\t if re.match(r' {0,3}(#{1,6})[ \\t]| {0,3}(`{3,}|~{3,})| {0,3}>| {4}',lines[i]): break\n 220\t if re.match(r' {0,3}(=+|-+)[ \\t]*$',lines[i]) and len(b)==1:\n 221\t out.append('<h1>'+self.inline(b[0].strip())+'</h1>' if lines[i].lstrip().startswith('=') else '<h2>'+self.inline(b[0].strip())+'</h2>'); i+=1; b=None; break\n 222\t b.append(lines[i]); i+=1\n 223\t if b is not None: out.append('<p>'+self.inline('\\n'.join(b))+'</p>')\n 224\t return '\\n'.join(out)+'\\n' if out else ''\n 225\t\n 226\tdef main():\n 227\t sys.stdout.write(Document(sys.stdin.read()).parse())\n 228\tif __name__=='__main__': main()\n","exit_code":0,"status":"completed"}}
{"type":"item.started","item":{"id":"item_8","type":"command_execution","command":"/bin/bash -lc \"nl -ba commonmark | sed -n '125,230p'\"","aggregated_output":"","exit_code":null,"status":"in_progress"}}
{"type":"item.completed","item":{"id":"item_8","type":"command_execution","command":"/bin/bash -lc \"nl -ba commonmark | sed -n '125,230p'\"","aggregated_output":" 125\t u=tag[1:-1]; return hold('<a href=\"'+html.escape(u,quote=True)+'\">'+esc_text(u.removeprefix('mailto:'))+'</a>')\n 126\t if re.match(r'<[^ <>]+@[^ <>]+>',tag):\n 127\t u=tag[1:-1]; return hold('<a href=\"mailto:'+html.escape(u,quote=True)+'\">'+esc_text(u)+'</a>')\n 128\t return hold(tag)\n 129\t text=INLINE_TAGS.sub(raw,text)\n 130\t text=html.escape(html.unescape(text),quote=True)\n 131\t text=re.sub(r'\\\\([!\"#$%&\\'()*+,\\-./:;<=>?@\\[\\\\\\]^_`{|}~])',r'\\1',text)\n 132\t text=re.sub(r'&(#(?:x[0-9A-Fa-f]+|[0-9]+)|[A-Za-z][A-Za-z0-9]+);',lambda m:'&'+m.group(1)+';',text)\n 133\t # images and links, including reference forms\n 134\t def image(m):\n 135\t alt= re.sub(r'[*_`]','',m.group(1)); dest=m.group(2); title=m.group(3)\n 136\t a='<img src=\"'+html.escape(dest,quote=True)+'\" alt=\"'+html.escape(alt,quote=True)+'\"'\n 137\t if title is not None: a+=' title=\"'+html.escape(title,quote=True)+'\"'\n 138\t return a+' />'\n 139\t def link(m):\n 140\t label=m.group(1); dest=m.group(2); title=m.group(3)\n 141\t a='<a href=\"'+html.escape(dest,quote=True)+'\"'\n 142\t if title is not None: a+=' title=\"'+html.escape(title,quote=True)+'\"'\n 143\t return a+'>'+self.inline(label)+'</a>'\n 144\t text=re.sub(r'!\\[([^\\]]*)\\]\\((?:<([^>]+)>|(\\S+?))(?:\\s+(?:\"([^\"]*)\"|\\'([^\\']*)\\'|\\(([^)]*)\\)))?\\)',lambda m:image(type('M',(),{'group':lambda _,n: [None,m.group(1),m.group(2) or m.group(3),m.group(4) or m.group(5) or m.group(6)][n]})()),text)\n 145\t text=re.sub(r'\\[([^\\]]+)\\]\\((?:<([^>]+)>|(\\S+?))(?:\\s+(?:\"([^\"]*)\"|\\'([^\\']*)\\'|\\(([^)]*)\\)))?\\)',lambda m:link(type('M',(),{'group':lambda _,n: [None,m.group(1),m.group(2) or m.group(3),m.group(4) or m.group(5) or m.group(6)][n]})()),text)\n 146\t def ref(m):\n 147\t key=(m.group(2) or m.group(1)).strip().casefold(); r=self.refs.get(key)\n 148\t if not r:return m.group(0)\n 149\t if m.group(0).startswith('!'):\n 150\t return '<img src=\"'+html.escape(r[0],quote=True)+'\" alt=\"'+html.escape(m.group(1),quote=True)+'\"'+((' title=\"'+html.escape(r[1],quote=True)+'\"') if r[1] else '')+' />'\n 151\t return '<a href=\"'+html.escape(r[0],quote=True)+'\"'+((' title=\"'+html.escape(r[1],quote=True)+'\"') if r[1] else '')+'>'+self.inline(m.group(1))+'</a>'\n 152\t def replace_ref(m):\n 153\t key=(m.group(3) or m.group(2)).strip().casefold()\n 154\t if key not in self.refs: return m.group(0)\n 155\t url,title=self.refs[key]\n 156\t if m.group(1):\n 157\t return '<img src=\"'+html.escape(url,quote=True)+'\" alt=\"'+html.escape(m.group(2),quote=True)+'\"'+((' title=\"'+html.escape(title,quote=True)+'\"') if title else '')+' />'\n 158\t return '<a href=\"'+html.escape(url,quote=True)+'\"'+((' title=\"'+html.escape(title,quote=True)+'\"') if title else '')+'>'+self.inline(m.group(2))+'</a>'\n 159\t text=re.sub(r'(!?)\\[([^\\]]+)\\](?:\\[([^\\]]*)\\])?',replace_ref,text)\n 160\t # emphasis (delimiters are intentionally conservative)\n 161\t text=re.sub(r'\\*\\*([^*\\n]+)\\*\\*|__([^_\\n]+)__',lambda m:'<strong>'+self.inline(m.group(1) or m.group(2))+'</strong>',text)\n 162\t text=re.sub(r'(?<!\\w)\\*([^*\\n]+)\\*|(?<!\\w)_([^_\\n]+)_(?!\\w)',lambda m:'<em>'+self.inline(m.group(1) or m.group(2))+'</em>',text)\n 163\t text=re.sub(r' {2,}\\n','<br />\\n',text)\n 164\t for i,v in enumerate(stash): text=text.replace(f'\\x00{i}\\x00',v)\n 165\t return text\n 166\t\n 167\t def blocks(self, lines):\n 168\t out=[]; i=0; n=len(lines)\n 169\t while i<n:\n 170\t line=lines[i]\n 171\t if not line.strip(): i+=1; continue\n 172\t m=re.match(r' {0,3}(`{3,}|~{3,})\\s*([^`]*)$',line)\n 173\t if m:\n 174\t fence=m.group(1); info=m.group(2).strip(); body=[]; i+=1\n 175\t while i<n and not re.match(r' {0,3}'+re.escape(fence[0])+r'{'+str(len(fence))+r',}\\s*$',lines[i]): body.append(lines[i]); i+=1\n 176\t if i<n:i+=1\n 177\t cls=' class=\"language-'+html.escape(info.split()[0],quote=True)+'\"' if info else ''\n 178\t out.append('<pre><code'+cls+'>'+esc_text('\\n'.join(body)+('\\n' if body else ''))+'</code></pre>'); continue\n 179\t m=re.match(r' {0,3}(#{1,6})(?:[ \\t]+|$)(.*)$',line)\n 180\t if m:\n 181\t content=re.sub(r'[ \\t]+#+[ \\t]*$','',m.group(2)); out.append(f'<h{len(m.group(1))}>'+self.inline(content)+f'</h{len(m.group(1))}>'); i+=1; continue\n 182\t if re.match(r' {0,3}((\\*\\s*){3,}|(-\\s*){3,}|(_\\s*){3,})$',line): out.append('<hr />'); i+=1; continue\n 183\t if re.match(r' {0,3}>',line):\n 184\t q=[]\n 185\t while i<n and (re.match(r' {0,3}>',lines[i]) or not lines[i].strip()):\n 186\t q.append(re.sub(r'^ {0,3}>[ \\t]?','',lines[i])); i+=1\n 187\t out.append('<blockquote>\\n'+self.blocks(q)+'\\n</blockquote>'); continue\n 188\t lm=re.match(r' {0,3}([-+*]|\\d+[.)])[ \\t]+(.*)$',line)\n 189\t if lm:\n 190\t marker=lm.group(1); ordered=marker[0].isdigit(); items=[]\n 191\t while i<n:\n 192\t mm=re.match(r' {0,3}([-+*]|\\d+[.)])[ \\t]+(.*)$',lines[i])\n 193\t if not mm or mm.group(1)[0].isdigit()!=ordered: break\n 194\t item=[mm.group(2)]; i+=1\n 195\t while i<n and lines[i].strip() and not re.match(r' {0,3}([-+*]|\\d+[.)])[ \\t]+',lines[i]):\n 196\t item.append(re.sub(r'^ {2,4}','',lines[i])); i+=1\n 197\t items.append(item)\n 198\t tag='ol' if ordered else 'ul'; attrs=''\n 199\t if ordered and not marker.startswith('1'): attrs=' start=\"'+re.match(r'\\d+',marker).group()+'\"'\n 200\t rendered=[]\n 201\t for item in items:\n 202\t content=self.blocks(item).strip()\n 203\t if content.startswith('<p>') and content.endswith('</p>') and '\\n' not in content:\n 204\t content=content[3:-4]\n 205\t rendered.append('<li>'+content+'</li>')\n 206\t out.append('<'+tag+attrs+'>'+''.join(rendered)+'</'+tag+'>'); continue\n 207\t if re.match(r' {4}',line):\n 208\t b=[]\n 209\t while i<n and (lines[i].startswith(' ') or not lines[i].strip()): b.append(lines[i][4:] if lines[i].startswith(' ') else ''); i+=1\n 210\t out.append('<pre><code>'+esc_text('\\n'.join(b).rstrip('\\n')+'\\n')+'</code></pre>'); continue\n 211\t # HTML blocks\n 212\t if re.match(r' {0,3}<(?:script|pre|style|div|table|ul|ol|h[1-6]|p|address|article|section|details|summary|blockquote|hr|!--|!DOCTYPE|\\?|!\\[CDATA\\[)',line,re.I):\n 213\t b=[line]; i+=1\n 214\t while i<n and lines[i].strip(): b.append(lines[i]); i+=1\n 215\t out.append('\\n'.join(b)); continue\n 216\t # paragraph, with setext heading\n 217\t b=[line]; i+=1\n 218\t while i<n and lines[i].strip():\n 219\t if re.match(r' {0,3}(#{1,6})[ \\t]| {0,3}(`{3,}|~{3,})| {0,3}>| {4}',lines[i]): break\n 220\t if re.match(r' {0,3}(=+|-+)[ \\t]*$',lines[i]) and len(b)==1:\n 221\t out.append('<h1>'+self.inline(b[0].strip())+'</h1>' if lines[i].lstrip().startswith('=') else '<h2>'+self.inline(b[0].strip())+'</h2>'); i+=1; b=None; break\n 222\t b.append(lines[i]); i+=1\n 223\t if b is not None: out.append('<p>'+self.inline('\\n'.join(b))+'</p>')\n 224\t return '\\n'.join(out)+'\\n' if out else ''\n 225\t\n 226\tdef main():\n 227\t sys.stdout.write(Document(sys.stdin.read()).parse())\n 228\tif __name__=='__main__': main()\n","exit_code":0,"status":"completed"}}
{"type":"item.started","item":{"id":"item_9","type":"file_change","changes":[{"path":"/mnt/c/Users/barlo/projects/drydock/uat/Commonmark/runs/20260815.202344/build/commonmark/commonmark","kind":"update"}],"status":"in_progress"}}
{"type":"item.completed","item":{"id":"item_9","type":"file_change","changes":[{"path":"/mnt/c/Users/barlo/projects/drydock/uat/Commonmark/runs/20260815.202344/build/commonmark/commonmark","kind":"update"}],"status":"completed"}}
{"type":"item.started","item":{"id":"item_10","type":"command_execution","command":"/bin/bash -lc \"python3 -m py_compile commonmark && python3 sources/spec_tests.py --program ./commonmark --spec sources/spec.txt --pattern '\"'^(Thematic breaks|ATX headings|Setext headings|Indented code blocks|Fenced code blocks|HTML blocks|Link reference definitions|Paragraphs|Blank lines)$'\"'\"","aggregated_output":"","exit_code":null,"status":"in_progress"}}
{"type":"item.completed","item":{"id":"item_10","type":"command_execution","command":"/bin/bash -lc \"python3 -m py_compile commonmark && python3 sources/spec_tests.py --program ./commonmark --spec sources/spec.txt --pattern '\"'^(Thematic breaks|ATX headings|Setext headings|Indented code blocks|Fenced code blocks|HTML blocks|Link reference definitions|Paragraphs|Blank lines)$'\"'\"","aggregated_output":"Example 48 (lines 934-939) Thematic breaks\n ***\n\n--- expected HTML\n+++ actual HTML\n@@ -1,2 +1 @@\n-<pre><code>***\n-</code></pre>\n+<hr>\n\nExample 55 (lines 994-1004) Thematic breaks\n_ _ _ _ a\n\na------\n\n---a---\n\n--- expected HTML\n+++ actual HTML\n@@ -1 +1 @@\n-<p>_ _ _ _ a</p><p>a------</p><p>---a---</p>\n+<p><em> </em> <em> </em> a</p><p>a------</p><p>---a---</p>\n\nExample 57 (lines 1019-1031) Thematic breaks\n- foo\n***\n- bar\n\n--- expected HTML\n+++ actual HTML\n@@ -1 +1 @@\n-<ul><li>foo</li></ul><hr><ul><li>bar</li></ul>\n+<ul><li><p>foo ***</p></li><li>bar</li></ul>\n\nExample 58 (lines 1036-1044) Thematic breaks\nFoo\n***\nbar\n\n--- expected HTML\n+++ actual HTML\n@@ -1 +1 @@\n-<p>Foo</p><hr><p>bar</p>\n+<p>Foo *** bar</p>\n\nExample 60 (lines 1066-1078) Thematic breaks\n* Foo\n* * *\n* Bar\n\n--- expected HTML\n+++ actual HTML\n@@ -1 +1 @@\n-<ul><li>Foo</li></ul><hr><ul><li>Bar</li></ul>\n+<ul><li>Foo</li><li><ul><li>*</li></ul></li><li>Bar</li></ul>\n\nExample 66 (lines 1167-1171) ATX headings\n# foo *bar* \\*baz\\*\n\n--- expected HTML\n+++ actual HTML\n@@ -1 +1 @@\n-<h1>foo <em>bar</em> *baz*</h1>\n+<h1>foo <em>bar</em> <em>baz</em></h1>\n\nExample 79 (lines 1307-1315) ATX headings\n## \n#\n### ###\n\n--- expected HTML\n+++ actual HTML\n@@ -1 +1 @@\n-<h2></h2><h1></h1><h3></h3>\n+<h2></h2><h1></h1><h3>###</h3>\n\nExample 81 (lines 1361-1368) Setext headings\nFoo *bar\nbaz*\n====\n\n--- expected HTML\n+++ actual HTML\n@@ -1 +1 @@\n-<h1>Foo <em>bar baz</em></h1>\n+<h1>Foo *bar baz*</h1>\n\nExample 82 (lines 1375-1382) Setext headings\n Foo *bar\nbaz*\t\n====\n\n--- expected HTML\n+++ actual HTML\n@@ -1 +1 @@\n-<h1>Foo <em>bar baz</em></h1>\n+<h1>Foo *bar baz*</h1>\n\nExample 88 (lines 1460-1471) Setext headings\nFoo\n= =\n\nFoo\n--- -\n\n--- expected HTML\n+++ actual HTML\n@@ -1 +1 @@\n-<p>Foo = =</p><p>Foo</p><hr>\n+<p>Foo = =</p><p>Foo --- -</p>\n\nExample 93 (lines 1527-1537) Setext headings\n> foo\nbar\n===\n\n--- expected HTML\n+++ actual HTML\n@@ -1 +1 @@\n-<blockquote><p>foo bar ===</p></blockquote>\n+<blockquote><p>foo</p></blockquote><h1>bar</h1>\n\nExample 94 (lines 1540-1548) Setext headings\n- Foo\n---\n\n--- expected HTML\n+++ actual HTML\n@@ -1 +1 @@\n-<ul><li>Foo</li></ul><hr>\n+<ul><li><h2>Foo</h2></li></ul>\n\nExample 99 (lines 1606-1614) Setext headings\n- foo\n-----\n\n--- expected HTML\n+++ actual HTML\n@@ -1 +1 @@\n-<ul><li>foo</li></ul><hr>\n+<ul><li><h2>foo</h2></li></ul>\n\nExample 105 (lines 1706-1716) Setext headings\nFoo\nbar\n* * *\nbaz\n\n--- expected HTML\n+++ actual HTML\n@@ -1 +1 @@\n-<p>Foo bar</p><hr><p>baz</p>\n+<p>Foo bar <em> </em> * baz</p>\n\nExample 108 (lines 1763-1774) Indented code blocks\n - foo\n\n bar\n\n--- expected HTML\n+++ actual HTML\n@@ -1 +1,2 @@\n-<ul><li><p>foo</p><p>bar</p></li></ul>\n+<ul><li>foo</li></ul><pre><code>bar\n+</code></pre>\n\nExample 109 (lines 1777-1790) Indented code blocks\n1. foo\n\n - bar\n\n--- expected HTML\n+++ actual HTML\n@@ -1 +1,2 @@\n-<ol><li><p>foo</p><ul><li>bar</li></ul></li></ol>\n+<ol><li>foo</li></ol><pre><code>- bar\n+</code></pre>\n\nExample 128 (lines 2091-2102) Fenced code blocks\n> ```\n> aaa\n\nbbb\n\n--- expected HTML\n+++ actual HTML\n@@ -1,2 +1,3 @@\n <blockquote><pre><code>aaa\n+\n </code></pre></blockquote><p>bbb</p>\n\nExample 133 (lines 2159-2170) Fenced code blocks\n ```\n aaa\n aaa\n aaa\n ```\n\n--- expected HTML\n+++ actual HTML\n@@ -1,4 +1,4 @@\n <pre><code>aaa\n aaa\n-aaa\n+ aaa\n </code></pre>\n\nExample 146 (lines 2337-2344) Fenced code blocks\n~~~ aa ``` ~~~\nfoo\n~~~\n\n--- expected HTML\n+++ actual HTML\n@@ -1,2 +1 @@\n-<pre><code class=\"language-aa\">foo\n-</code></pre>\n+<p>~~~ aa <code></code>` ~~~ foo</p><pre><code></code></pre>\n\nExample 148 (lines 2429-2444) HTML blocks\n<table><tr><td>\n<pre>\n**Hello**,\n\n_world_.\n</pre>\n</td></tr></table>\n\n--- expected HTML\n+++ actual HTML\n@@ -1,3 +1,3 @@\n <table><tr><td><pre>\n-**Hello**,<p><em>world</em>.\n-</pre></p></td></tr></table>\n+**Hello**,<p><em>world</em>.</p>\n+</pre></td></tr></table>\n\nExample 163 (lines 2642-2650) HTML blocks\n<a href=\"foo\">\n*bar*\n</a>\n\n--- expected HTML\n+++ actual HTML\n@@ -1 +1 @@\n-<a href=\"foo\"> *bar* </a> \n+<p><a href=\"foo\"> <em>bar</em></p></a> \n\nExample 165 (lines 2666-2674) HTML blocks\n<i class=\"foo\">\n*bar*\n</i>\n\n--- expected HTML\n+++ actual HTML\n@@ -1 +1 @@\n-<i class=\"foo\"> *bar* </i> \n+<p><i class=\"foo\"> <em>bar</em></p></i> \n\nExample 170 (lines 2731-2741) HTML blocks\n<del\nclass=\"foo\">\n*foo*\n</del>\n\n--- expected HTML\n+++ actual HTML\n@@ -1 +1 @@\n-<p><del class=\"foo\"> <em>foo</em> </del></p>\n+<p><del class=\"foo\"> <em>foo</em></p></del> \n\nExample 194 (lines 3201-3207) Link reference definitions\nprogram returned error code 1\nTraceback (most recent call last):\n File \"/mnt/c/Users/barlo/projects/drydock/uat/Commonmark/runs/20260815.202344/build/commonmark/./commonmark\", line 270, in <module>\n if __name__=='__main__': main()\n ^^^^^^\n File \"/mnt/c/Users/barlo/projects/drydock/uat/Commonmark/runs/20260815.202344/build/commonmark/./commonmark\", line 269, in main\n sys.stdout.write(Document(sys.stdin.read()).parse())\n ^^^^^^^^^^^^^^^^^^^^^^^^^^^^^^^^^^\n File \"/mnt/c/Users/barlo/projects/drydock/uat/Commonmark/runs/20260815.202344/build/commonmark/./commonmark\", line 34, in parse\n self.collect_refs()\n File \"/mnt/c/Users/barlo/projects/drydock/uat/Commonmark/runs/20260815.202344/build/commonmark/./commonmark\", line 65, in collect_refs\n parsed=self.parse_reference(rest)\n ^^^^^^^^^^^^^^^^^^^^^^^^^^\n File \"/mnt/c/Users/barlo/projects/drydock/uat/Commonmark/runs/20260815.202344/build/commonmark/./commonmark\", line 85, in parse_reference\n m=re.match(r'((?:\\\\.|[^\\\\ \\t\\n()])*?(?:\\\\\\([^)]*\\\\)|[^\\\\ \\t\\n()]*)?)(.*)$',rest,re.S)\n ^^^^^^^^^^^^^^^^^^^^^^^^^^^^^^^^^^^^^^^^^^^^^^^^^^^^^^^^^^^^^^^^^^^^^^^^^^^^^^^^^^^\n File \"/home/barlo/.local/share/uv/python/cpython-3.12.13-linux-x86_64-gnu/lib/python3.12/re/__init__.py\", line 167, in match\n return _compile(pattern, flags).match(string)\n ^^^^^^^^^^^^^^^^^^^^^^^^\n File \"/home/barlo/.local/share/uv/python/cpython-3.12.13-linux-x86_64-gnu/lib/python3.12/re/__init__.py\", line 307, in _compile\n p = _compiler.compile(pattern, flags)\n ^^^^^^^^^^^^^^^^^^^^^^^^^^^^^^^^^\n File \"/home/barlo/.local/share/uv/python/cpython-3.12.13-linux-x86_64-gnu/lib/python3.12/re/_compiler.py\", line 750, in compile\n p = _parser.parse(p, flags)\n ^^^^^^^^^^^^^^^^^^^^^^^\n File \"/home/barlo/.local/share/uv/python/cpython-3.12.13-linux-x86_64-gnu/lib/python3.12/re/_parser.py\", line 984, in parse\n raise source.error(\"unbalanced parenthesis\")\nre.error: unbalanced parenthesis at position 54\nExample 195 (lines 3210-3218) Link reference definitions\nprogram returned error code 1\nTraceback (most recent call last):\n File \"/mnt/c/Users/barlo/projects/drydock/uat/Commonmark/runs/20260815.202344/build/commonmark/./commonmark\", line 270, in <module>\n if __name__=='__main__': main()\n ^^^^^^\n File \"/mnt/c/Users/barlo/projects/drydock/uat/Commonmark/runs/20260815.202344/build/commonmark/./commonmark\", line 269, in main\n sys.stdout.write(Document(sys.stdin.read()).parse())\n ^^^^^^^^^^^^^^^^^^^^^^^^^^^^^^^^^^\n File \"/mnt/c/Users/barlo/projects/drydock/uat/Commonmark/runs/20260815.202344/build/commonmark/./commonmark\", line 34, in parse\n self.collect_refs()\n File \"/mnt/c/Users/barlo/projects/drydock/uat/Commonmark/runs/20260815.202344/build/commonmark/./commonmark\", line 65, in collect_refs\n parsed=self.parse_reference(rest)\n ^^^^^^^^^^^^^^^^^^^^^^^^^^\n File \"/mnt/c/Users/barlo/projects/drydock/uat/Commonmark/runs/20260815.202344/build/commonmark/./commonmark\", line 85, in parse_reference\n m=re.match(r'((?:\\\\.|[^\\\\ \\t\\n()])*?(?:\\\\\\([^)]*\\\\)|[^\\\\ \\t\\n()]*)?)(.*)$',rest,re.S)\n ^^^^^^^^^^^^^^^^^^^^^^^^^^^^^^^^^^^^^^^^^^^^^^^^^^^^^^^^^^^^^^^^^^^^^^^^^^^^^^^^^^^\n File \"/home/barlo/.local/share/uv/python/cpython-3.12.13-linux-x86_64-gnu/lib/python3.12/re/__init__.py\", line 167, in match\n return _compile(pattern, flags).match(string)\n ^^^^^^^^^^^^^^^^^^^^^^^^\n File \"/home/barlo/.local/share/uv/python/cpython-3.12.13-linux-x86_64-gnu/lib/python3.12/re/__init__.py\", line 307, in _compile\n p = _compiler.compile(pattern, flags)\n ^^^^^^^^^^^^^^^^^^^^^^^^^^^^^^^^^\n File \"/home/barlo/.local/share/uv/python/cpython-3.12.13-linux-x86_64-gnu/lib/python3.12/re/_compiler.py\", line 750, in compile\n p = _parser.parse(p, flags)\n ^^^^^^^^^^^^^^^^^^^^^^^\n File \"/home/barlo/.local/share/uv/python/cpython-3.12.13-linux-x86_64-gnu/lib/python3.12/re/_parser.py\", line 984, in parse\n raise source.error(\"unbalanced parenthesis\")\nre.error: unbalanced parenthesis at position 54\nExample 196 (lines 3221-3227) Link reference definitions\n[Foo*bar\\]]:my_(url) 'title (with parens)'\n\n[Foo*bar\\]]\n\n--- expected HTML\n+++ actual HTML\n@@ -1 +1 @@\n-<p><a href=\"my_(url)\" title=\"title (with parens)\">Foo*bar]</a></p>\n+<p>[Foo*bar]]:my_(url) 'title (with parens)'</p><p>[Foo*bar]]</p>\n\nExample 197 (lines 3230-3238) Link reference definitions\nprogram returned error code 1\nTraceback (most recent call last):\n File \"/mnt/c/Users/barlo/projects/drydock/uat/Commonmark/runs/20260815.202344/build/commonmark/./commonmark\", line 270, in <module>\n if __name__=='__main__': main()\n ^^^^^^\n File \"/mnt/c/Users/barlo/projects/drydock/uat/Commonmark/runs/20260815.202344/build/commonmark/./commonmark\", line 269, in main\n sys.stdout.write(Document(sys.stdin.read()).parse())\n ^^^^^^^^^^^^^^^^^^^^^^^^^^^^^^^^^^\n File \"/mnt/c/Users/barlo/projects/drydock/uat/Commonmark/runs/20260815.202344/build/commonmark/./commonmark\", line 34, in parse\n self.collect_refs()\n File \"/mnt/c/Users/barlo/projects/drydock/uat/Commonmark/runs/20260815.202344/build/commonmark/./commonmark\", line 65, in collect_refs\n parsed=self.parse_reference(rest)\n ^^^^^^^^^^^^^^^^^^^^^^^^^^\n File \"/mnt/c/Users/barlo/projects/drydock/uat/Commonmark/runs/20260815.202344/build/commonmark/./commonmark\", line 85, in parse_reference\n m=re.match(r'((?:\\\\.|[^\\\\ \\t\\n()])*?(?:\\\\\\([^)]*\\\\)|[^\\\\ \\t\\n()]*)?)(.*)$',rest,re.S)\n ^^^^^^^^^^^^^^^^^^^^^^^^^^^^^^^^^^^^^^^^^^^^^^^^^^^^^^^^^^^^^^^^^^^^^^^^^^^^^^^^^^^\n File \"/home/barlo/.local/share/uv/python/cpython-3.12.13-linux-x86_64-gnu/lib/python3.12/re/__init__.py\", line 167, in match\n return _compile(pattern, flags).match(string)\n ^^^^^^^^^^^^^^^^^^^^^^^^\n File \"/home/barlo/.local/share/uv/python/cpython-3.12.13-linux-x86_64-gnu/lib/python3.12/re/__init__.py\", line 307, in _compile\n p = _compiler.compile(pattern, flags)\n ^^^^^^^^^^^^^^^^^^^^^^^^^^^^^^^^^\n File \"/home/barlo/.local/share/uv/python/cpython-3.12.13-linux-x86_64-gnu/lib/python3.12/re/_compiler.py\", line 750, in compile\n p = _parser.parse(p, flags)\n ^^^^^^^^^^^^^^^^^^^^^^^\n File \"/home/barlo/.local/share/uv/python/cpython-3.12.13-linux-x86_64-gnu/lib/python3.12/re/_parser.py\", line 984, in parse\n raise source.error(\"unbalanced parenthesis\")\nre.error: unbalanced parenthesis at position 54\nExample 198 (lines 3243-3257) Link reference definitions\nprogram returned error code 1\nTraceback (most recent call last):\n File \"/mnt/c/Users/barlo/projects/drydock/uat/Commonmark/runs/20260815.202344/build/commonmark/./commonmark\", line 270, in <module>\n if __name__=='__main__': main()\n ^^^^^^\n File \"/mnt/c/Users/barlo/projects/drydock/uat/Commonmark/runs/20260815.202344/build/commonmark/./commonmark\", line 269, in main\n sys.stdout.write(Document(sys.stdin.read()).parse())\n ^^^^^^^^^^^^^^^^^^^^^^^^^^^^^^^^^^\n File \"/mnt/c/Users/barlo/projects/drydock/uat/Commonmark/runs/20260815.202344/build/commonmark/./commonmark\", line 34, in parse\n self.collect_refs()\n File \"/mnt/c/Users/barlo/projects/drydock/uat/Commonmark/runs/20260815.202344/build/commonmark/./commonmark\", line 65, in collect_refs\n parsed=self.parse_reference(rest)\n ^^^^^^^^^^^^^^^^^^^^^^^^^^\n File \"/mnt/c/Users/barlo/projects/drydock/uat/Commonmark/runs/20260815.202344/build/commonmark/./commonmark\", line 85, in parse_reference\n m=re.match(r'((?:\\\\.|[^\\\\ \\t\\n()])*?(?:\\\\\\([^)]*\\\\)|[^\\\\ \\t\\n()]*)?)(.*)$',rest,re.S)\n ^^^^^^^^^^^^^^^^^^^^^^^^^^^^^^^^^^^^^^^^^^^^^^^^^^^^^^^^^^^^^^^^^^^^^^^^^^^^^^^^^^^\n File \"/home/barlo/.local/share/uv/python/cpython-3.12.13-linux-x86_64-gnu/lib/python3.12/re/__init__.py\", line 167, in match\n return _compile(pattern, flags).match(string)\n ^^^^^^^^^^^^^^^^^^^^^^^^\n File \"/home/barlo/.local/share/uv/python/cpython-3.12.13-linux-x86_64-gnu/lib/python3.12/re/__init__.py\", line 307, in _compile\n p = _compiler.compile(pattern, flags)\n ^^^^^^^^^^^^^^^^^^^^^^^^^^^^^^^^^\n File \"/home/barlo/.local/share/uv/python/cpython-3.12.13-linux-x86_64-gnu/lib/python3.12/re/_compiler.py\", line 750, in compile\n p = _parser.parse(p, flags)\n ^^^^^^^^^^^^^^^^^^^^^^^\n File \"/home/barlo/.local/share/uv/python/cpython-3.12.13-linux-x86_64-gnu/lib/python3.12/re/_parser.py\", line 984, in parse\n raise source.error(\"unbalanced parenthesis\")\nre.error: unbalanced parenthesis at position 54\nExample 199 (lines 3262-3272) Link reference definitions\nprogram returned error code 1\nTraceback (most recent call last):\n File \"/mnt/c/Users/barlo/projects/drydock/uat/Commonmark/runs/20260815.202344/build/commonmark/./commonmark\", line 270, in <module>\n if __name__=='__main__': main()\n ^^^^^^\n File \"/mnt/c/Users/barlo/projects/drydock/uat/Commonmark/runs/20260815.202344/build/commonmark/./commonmark\", line 269, in main\n sys.stdout.write(Document(sys.stdin.read()).parse())\n ^^^^^^^^^^^^^^^^^^^^^^^^^^^^^^^^^^\n File \"/mnt/c/Users/barlo/projects/drydock/uat/Commonmark/runs/20260815.202344/build/commonmark/./commonmark\", line 34, in parse\n self.collect_refs()\n File \"/mnt/c/Users/barlo/projects/drydock/uat/Commonmark/runs/20260815.202344/build/commonmark/./commonmark\", line 65, in collect_refs\n parsed=self.parse_reference(rest)\n ^^^^^^^^^^^^^^^^^^^^^^^^^^\n File \"/mnt/c/Users/barlo/projects/drydock/uat/Commonmark/runs/20260815.202344/build/commonmark/./commonmark\", line 85, in parse_reference\n m=re.match(r'((?:\\\\.|[^\\\\ \\t\\n()])*?(?:\\\\\\([^)]*\\\\)|[^\\\\ \\t\\n()]*)?)(.*)$',rest,re.S)\n ^^^^^^^^^^^^^^^^^^^^^^^^^^^^^^^^^^^^^^^^^^^^^^^^^^^^^^^^^^^^^^^^^^^^^^^^^^^^^^^^^^^\n File \"/home/barlo/.local/share/uv/python/cpython-3.12.13-linux-x86_64-gnu/lib/python3.12/re/__init__.py\", line 167, in match\n return _compile(pattern, flags).match(string)\n ^^^^^^^^^^^^^^^^^^^^^^^^\n File \"/home/barlo/.local/share/uv/python/cpython-3.12.13-linux-x86_64-gnu/lib/python3.12/re/__init__.py\", line 307, in _compile\n p = _compiler.compile(pattern, flags)\n ^^^^^^^^^^^^^^^^^^^^^^^^^^^^^^^^^\n File \"/home/barlo/.local/share/uv/python/cpython-3.12.13-linux-x86_64-gnu/lib/python3.12/re/_compiler.py\", line 750, in compile\n p = _parser.parse(p, flags)\n ^^^^^^^^^^^^^^^^^^^^^^^\n File \"/home/barlo/.local/share/uv/python/cpython-3.12.13-linux-x86_64-gnu/lib/python3.12/re/_parser.py\", line 984, in parse\n raise source.error(\"unbalanced parenthesis\")\nre.error: unbalanced parenthesis at position 54\nExample 200 (lines 3277-3284) Link reference definitions\nprogram returned error code 1\nTraceback (most recent call last):\n File \"/mnt/c/Users/barlo/projects/drydock/uat/Commonmark/runs/20260815.202344/build/commonmark/./commonmark\", line 270, in <module>\n if __name__=='__main__': main()\n ^^^^^^\n File \"/mnt/c/Users/barlo/projects/drydock/uat/Commonmark/runs/20260815.202344/build/commonmark/./commonmark\", line 269, in main\n sys.stdout.write(Document(sys.stdin.read()).parse())\n ^^^^^^^^^^^^^^^^^^^^^^^^^^^^^^^^^^\n File \"/mnt/c/Users/barlo/projects/drydock/uat/Commonmark/runs/20260815.202344/build/commonmark/./commonmark\", line 34, in parse\n self.collect_refs()\n File \"/mnt/c/Users/barlo/projects/drydock/uat/Commonmark/runs/20260815.202344/build/commonmark/./commonmark\", line 65, in collect_refs\n parsed=self.parse_reference(rest)\n ^^^^^^^^^^^^^^^^^^^^^^^^^^\n File \"/mnt/c/Users/barlo/projects/drydock/uat/Commonmark/runs/20260815.202344/build/commonmark/./commonmark\", line 85, in parse_reference\n m=re.match(r'((?:\\\\.|[^\\\\ \\t\\n()])*?(?:\\\\\\([^)]*\\\\)|[^\\\\ \\t\\n()]*)?)(.*)$',rest,re.S)\n ^^^^^^^^^^^^^^^^^^^^^^^^^^^^^^^^^^^^^^^^^^^^^^^^^^^^^^^^^^^^^^^^^^^^^^^^^^^^^^^^^^^\n File \"/home/barlo/.local/share/uv/python/cpython-3.12.13-linux-x86_64-gnu/lib/python3.12/re/__init__.py\", line 167, in match\n return _compile(pattern, flags).match(string)\n ^^^^^^^^^^^^^^^^^^^^^^^^\n File \"/home/barlo/.local/share/uv/python/cpython-3.12.13-linux-x86_64-gnu/lib/python3.12/re/__init__.py\", line 307, in _compile\n p = _compiler.compile(pattern, flags)\n ^^^^^^^^^^^^^^^^^^^^^^^^^^^^^^^^^\n File \"/home/barlo/.local/share/uv/python/cpython-3.12.13-linux-x86_64-gnu/lib/python3.12/re/_compiler.py\", line 750, in compile\n p = _parser.parse(p, flags)\n ^^^^^^^^^^^^^^^^^^^^^^^\n File \"/home/barlo/.local/share/uv/python/cpython-3.12.13-linux-x86_64-gnu/lib/python3.12/re/_parser.py\", line 984, in parse\n raise source.error(\"unbalanced parenthesis\")\nre.error: unbalanced parenthesis at position 54\nExample 201 (lines 3289-3296) Link reference definitions\nprogram returned error code 1\nTraceback (most recent call last):\n File \"/mnt/c/Users/barlo/projects/drydock/uat/Commonmark/runs/20260815.202344/build/commonmark/./commonmark\", line 270, in <module>\n if __name__=='__main__': main()\n ^^^^^^\n File \"/mnt/c/Users/barlo/projects/drydock/uat/Commonmark/runs/20260815.202344/build/commonmark/./commonmark\", line 269, in main\n sys.stdout.write(Document(sys.stdin.read()).parse())\n ^^^^^^^^^^^^^^^^^^^^^^^^^^^^^^^^^^\n File \"/mnt/c/Users/barlo/projects/drydock/uat/Commonmark/runs/20260815.202344/build/commonmark/./commonmark\", line 34, in parse\n self.collect_refs()\n File \"/mnt/c/Users/barlo/projects/drydock/uat/Commonmark/runs/20260815.202344/build/commonmark/./commonmark\", line 65, in collect_refs\n parsed=self.parse_reference(rest)\n ^^^^^^^^^^^^^^^^^^^^^^^^^^\n File \"/mnt/c/Users/barlo/projects/drydock/uat/Commonmark/runs/20260815.202344/build/commonmark/./commonmark\", line 85, in parse_reference\n m=re.match(r'((?:\\\\.|[^\\\\ \\t\\n()])*?(?:\\\\\\([^)]*\\\\)|[^\\\\ \\t\\n()]*)?)(.*)$',rest,re.S)\n ^^^^^^^^^^^^^^^^^^^^^^^^^^^^^^^^^^^^^^^^^^^^^^^^^^^^^^^^^^^^^^^^^^^^^^^^^^^^^^^^^^^\n File \"/home/barlo/.local/share/uv/python/cpython-3.12.13-linux-x86_64-gnu/lib/python3.12/re/__init__.py\", line 167, in match\n return _compile(pattern, flags).match(string)\n ^^^^^^^^^^^^^^^^^^^^^^^^\n File \"/home/barlo/.local/share/uv/python/cpython-3.12.13-linux-x86_64-gnu/lib/python3.12/re/__init__.py\", line 307, in _compile\n p = _compiler.compile(pattern, flags)\n ^^^^^^^^^^^^^^^^^^^^^^^^^^^^^^^^^\n File \"/home/barlo/.local/share/uv/python/cpython-3.12.13-linux-x86_64-gnu/lib/python3.12/re/_compiler.py\", line 750, in compile\n p = _parser.parse(p, flags)\n ^^^^^^^^^^^^^^^^^^^^^^^\n File \"/home/barlo/.local/share/uv/python/cpython-3.12.13-linux-x86_64-gnu/lib/python3.12/re/_parser.py\", line 984, in parse\n raise source.error(\"unbalanced parenthesis\")\nre.error: unbalanced parenthesis at position 54\nExample 204 (lines 3325-3331) Link reference definitions\nprogram returned error code 1\nTraceback (most recent call last):\n File \"/mnt/c/Users/barlo/projects/drydock/uat/Commonmark/runs/20260815.202344/build/commonmark/./commonmark\", line 270, in <module>\n if __name__=='__main__': main()\n ^^^^^^\n File \"/mnt/c/Users/barlo/projects/drydock/uat/Commonmark/runs/20260815.202344/build/commonmark/./commonmark\", line 269, in main\n sys.stdout.write(Document(sys.stdin.read()).parse())\n ^^^^^^^^^^^^^^^^^^^^^^^^^^^^^^^^^^\n File \"/mnt/c/Users/barlo/projects/drydock/uat/Commonmark/runs/20260815.202344/build/commonmark/./commonmark\", line 34, in parse\n self.collect_refs()\n File \"/mnt/c/Users/barlo/projects/drydock/uat/Commonmark/runs/20260815.202344/build/commonmark/./commonmark\", line 65, in collect_refs\n parsed=self.parse_reference(rest)\n ^^^^^^^^^^^^^^^^^^^^^^^^^^\n File \"/mnt/c/Users/barlo/projects/drydock/uat/Commonmark/runs/20260815.202344/build/commonmark/./commonmark\", line 85, in parse_reference\n m=re.match(r'((?:\\\\.|[^\\\\ \\t\\n()])*?(?:\\\\\\([^)]*\\\\)|[^\\\\ \\t\\n()]*)?)(.*)$',rest,re.S)\n ^^^^^^^^^^^^^^^^^^^^^^^^^^^^^^^^^^^^^^^^^^^^^^^^^^^^^^^^^^^^^^^^^^^^^^^^^^^^^^^^^^^\n File \"/home/barlo/.local/share/uv/python/cpython-3.12.13-linux-x86_64-gnu/lib/python3.12/re/__init__.py\", line 167, in match\n return _compile(pattern, flags).match(string)\n ^^^^^^^^^^^^^^^^^^^^^^^^\n File \"/home/barlo/.local/share/uv/python/cpython-3.12.13-linux-x86_64-gnu/lib/python3.12/re/__init__.py\", line 307, in _compile\n p = _compiler.compile(pattern, flags)\n ^^^^^^^^^^^^^^^^^^^^^^^^^^^^^^^^^\n File \"/home/barlo/.local/share/uv/python/cpython-3.12.13-linux-x86_64-gnu/lib/python3.12/re/_compiler.py\", line 750, in compile\n p = _parser.parse(p, flags)\n ^^^^^^^^^^^^^^^^^^^^^^^\n File \"/home/barlo/.local/share/uv/python/cpython-3.12.13-linux-x86_64-gnu/lib/python3.12/re/_parser.py\", line 984, in parse\n raise source.error(\"unbalanced parenthesis\")\nre.error: unbalanced parenthesis at position 54\nExample 205 (lines 3336-3342) Link reference definitions\nprogram returned error code 1\nTraceback (most recent call last):\n File \"/mnt/c/Users/barlo/projects/drydock/uat/Commonmark/runs/20260815.202344/build/commonmark/./commonmark\", line 270, in <module>\n if __name__=='__main__': main()\n ^^^^^^\n File \"/mnt/c/Users/barlo/projects/drydock/uat/Commonmark/runs/20260815.202344/build/commonmark/./commonmark\", line 269, in main\n sys.stdout.write(Document(sys.stdin.read()).parse())\n ^^^^^^^^^^^^^^^^^^^^^^^^^^^^^^^^^^\n File \"/mnt/c/Users/barlo/projects/drydock/uat/Commonmark/runs/20260815.202344/build/commonmark/./commonmark\", line 34, in parse\n self.collect_refs()\n File \"/mnt/c/Users/barlo/projects/drydock/uat/Commonmark/runs/20260815.202344/build/commonmark/./commonmark\", line 65, in collect_refs\n parsed=self.parse_reference(rest)\n ^^^^^^^^^^^^^^^^^^^^^^^^^^\n File \"/mnt/c/Users/barlo/projects/drydock/uat/Commonmark/runs/20260815.202344/build/commonmark/./commonmark\", line 85, in parse_reference\n m=re.match(r'((?:\\\\.|[^\\\\ \\t\\n()])*?(?:\\\\\\([^)]*\\\\)|[^\\\\ \\t\\n()]*)?)(.*)$',rest,re.S)\n ^^^^^^^^^^^^^^^^^^^^^^^^^^^^^^^^^^^^^^^^^^^^^^^^^^^^^^^^^^^^^^^^^^^^^^^^^^^^^^^^^^^\n File \"/home/barlo/.local/share/uv/python/cpython-3.12.13-linux-x86_64-gnu/lib/python3.12/re/__init__.py\", line 167, in match\n return _compile(pattern, flags).match(string)\n ^^^^^^^^^^^^^^^^^^^^^^^^\n File \"/home/barlo/.local/share/uv/python/cpython-3.12.13-linux-x86_64-gnu/lib/python3.12/re/__init__.py\", line 307, in _compile\n p = _compiler.compile(pattern, flags)\n ^^^^^^^^^^^^^^^^^^^^^^^^^^^^^^^^^\n File \"/home/barlo/.local/share/uv/python/cpython-3.12.13-linux-x86_64-gnu/lib/python3.12/re/_compiler.py\", line 750, in compile\n p = _parser.parse(p, flags)\n ^^^^^^^^^^^^^^^^^^^^^^^\n File \"/home/barlo/.local/share/uv/python/cpython-3.12.13-linux-x86_64-gnu/lib/python3.12/re/_parser.py\", line 984, in parse\n raise source.error(\"unbalanced parenthesis\")\nre.error: unbalanced parenthesis at position 54\nExample 206 (lines 3348-3355) Link reference definitions\nprogram returned error code 1\nTraceback (most recent call last):\n File \"/mnt/c/Users/barlo/projects/drydock/uat/Commonmark/runs/20260815.202344/build/commonmark/./commonmark\", line 270, in <module>\n if __name__=='__main__': main()\n ^^^^^^\n File \"/mnt/c/Users/barlo/projects/drydock/uat/Commonmark/runs/20260815.202344/build/commonmark/./commonmark\", line 269, in main\n sys.stdout.write(Document(sys.stdin.read()).parse())\n ^^^^^^^^^^^^^^^^^^^^^^^^^^^^^^^^^^\n File \"/mnt/c/Users/barlo/projects/drydock/uat/Commonmark/runs/20260815.202344/build/commonmark/./commonmark\", line 34, in parse\n self.collect_refs()\n File \"/mnt/c/Users/barlo/projects/drydock/uat/Commonmark/runs/20260815.202344/build/commonmark/./commonmark\", line 65, in collect_refs\n parsed=self.parse_reference(rest)\n ^^^^^^^^^^^^^^^^^^^^^^^^^^\n File \"/mnt/c/Users/barlo/projects/drydock/uat/Commonmark/runs/20260815.202344/build/commonmark/./commonmark\", line 85, in parse_reference\n m=re.match(r'((?:\\\\.|[^\\\\ \\t\\n()])*?(?:\\\\\\([^)]*\\\\)|[^\\\\ \\t\\n()]*)?)(.*)$',rest,re.S)\n ^^^^^^^^^^^^^^^^^^^^^^^^^^^^^^^^^^^^^^^^^^^^^^^^^^^^^^^^^^^^^^^^^^^^^^^^^^^^^^^^^^^\n File \"/home/barlo/.local/share/uv/python/cpython-3.12.13-linux-x86_64-gnu/lib/python3.12/re/__init__.py\", line 167, in match\n return _compile(pattern, flags).match(string)\n ^^^^^^^^^^^^^^^^^^^^^^^^\n File \"/home/barlo/.local/share/uv/python/cpython-3.12.13-linux-x86_64-gnu/lib/python3.12/re/__init__.py\", line 307, in _compile\n p = _compiler.compile(pattern, flags)\n ^^^^^^^^^^^^^^^^^^^^^^^^^^^^^^^^^\n File \"/home/barlo/.local/share/uv/python/cpython-3.12.13-linux-x86_64-gnu/lib/python3.12/re/_compiler.py\", line 750, in compile\n p = _parser.parse(p, flags)\n ^^^^^^^^^^^^^^^^^^^^^^^\n File \"/home/barlo/.local/share/uv/python/cpython-3.12.13-linux-x86_64-gnu/lib/python3.12/re/_parser.py\", line 984, in parse\n raise source.error(\"unbalanced parenthesis\")\nre.error: unbalanced parenthesis at position 54\nExample 207 (lines 3361-3367) Link reference definitions\nprogram returned error code 1\nTraceback (most recent call last):\n File \"/mnt/c/Users/barlo/projects/drydock/uat/Commonmark/runs/20260815.202344/build/commonmark/./commonmark\", line 270, in <module>\n if __name__=='__main__': main()\n ^^^^^^\n File \"/mnt/c/Users/barlo/projects/drydock/uat/Commonmark/runs/20260815.202344/build/commonmark/./commonmark\", line 269, in main\n sys.stdout.write(Document(sys.stdin.read()).parse())\n ^^^^^^^^^^^^^^^^^^^^^^^^^^^^^^^^^^\n File \"/mnt/c/Users/barlo/projects/drydock/uat/Commonmark/runs/20260815.202344/build/commonmark/./commonmark\", line 34, in parse\n self.collect_refs()\n File \"/mnt/c/Users/barlo/projects/drydock/uat/Commonmark/runs/20260815.202344/build/commonmark/./commonmark\", line 65, in collect_refs\n parsed=self.parse_reference(rest)\n ^^^^^^^^^^^^^^^^^^^^^^^^^^\n File \"/mnt/c/Users/barlo/projects/drydock/uat/Commonmark/runs/20260815.202344/build/commonmark/./commonmark\", line 85, in parse_reference\n m=re.match(r'((?:\\\\.|[^\\\\ \\t\\n()])*?(?:\\\\\\([^)]*\\\\)|[^\\\\ \\t\\n()]*)?)(.*)$',rest,re.S)\n ^^^^^^^^^^^^^^^^^^^^^^^^^^^^^^^^^^^^^^^^^^^^^^^^^^^^^^^^^^^^^^^^^^^^^^^^^^^^^^^^^^^\n File \"/home/barlo/.local/share/uv/python/cpython-3.12.13-linux-x86_64-gnu/lib/python3.12/re/__init__.py\", line 167, in match\n return _compile(pattern, flags).match(string)\n ^^^^^^^^^^^^^^^^^^^^^^^^\n File \"/home/barlo/.local/share/uv/python/cpython-3.12.13-linux-x86_64-gnu/lib/python3.12/re/__init__.py\", line 307, in _compile\n p = _compiler.compile(pattern, flags)\n ^^^^^^^^^^^^^^^^^^^^^^^^^^^^^^^^^\n File \"/home/barlo/.local/share/uv/python/cpython-3.12.13-linux-x86_64-gnu/lib/python3.12/re/_compiler.py\", line 750, in compile\n p = _parser.parse(p, flags)\n ^^^^^^^^^^^^^^^^^^^^^^^\n File \"/home/barlo/.local/share/uv/python/cpython-3.12.13-linux-x86_64-gnu/lib/python3.12/re/_parser.py\", line 984, in parse\n raise source.error(\"unbalanced parenthesis\")\nre.error: unbalanced parenthesis at position 54\nExample 208 (lines 3370-3376) Link reference definitions\nprogram returned error code 1\nTraceback (most recent call last):\n File \"/mnt/c/Users/barlo/projects/drydock/uat/Commonmark/runs/20260815.202344/build/commonmark/./commonmark\", line 270, in <module>\n if __name__=='__main__': main()\n ^^^^^^\n File \"/mnt/c/Users/barlo/projects/drydock/uat/Commonmark/runs/20260815.202344/build/commonmark/./commonmark\", line 269, in main\n sys.stdout.write(Document(sys.stdin.read()).parse())\n ^^^^^^^^^^^^^^^^^^^^^^^^^^^^^^^^^^\n File \"/mnt/c/Users/barlo/projects/drydock/uat/Commonmark/runs/20260815.202344/build/commonmark/./commonmark\", line 34, in parse\n self.collect_refs()\n File \"/mnt/c/Users/barlo/projects/drydock/uat/Commonmark/runs/20260815.202344/build/commonmark/./commonmark\", line 65, in collect_refs\n parsed=self.parse_reference(rest)\n ^^^^^^^^^^^^^^^^^^^^^^^^^^\n File \"/mnt/c/Users/barlo/projects/drydock/uat/Commonmark/runs/20260815.202344/build/commonmark/./commonmark\", line 85, in parse_reference\n m=re.match(r'((?:\\\\.|[^\\\\ \\t\\n()])*?(?:\\\\\\([^)]*\\\\)|[^\\\\ \\t\\n()]*)?)(.*)$',rest,re.S)\n ^^^^^^^^^^^^^^^^^^^^^^^^^^^^^^^^^^^^^^^^^^^^^^^^^^^^^^^^^^^^^^^^^^^^^^^^^^^^^^^^^^^\n File \"/home/barlo/.local/share/uv/python/cpython-3.12.13-linux-x86_64-gnu/lib/python3.12/re/__init__.py\", line 167, in match\n return _compile(pattern, flags).match(string)\n ^^^^^^^^^^^^^^^^^^^^^^^^\n File \"/home/barlo/.local/share/uv/python/cpython-3.12.13-linux-x86_64-gnu/lib/python3.12/re/__init__.py\", line 307, in _compile\n p = _compiler.compile(pattern, flags)\n ^^^^^^^^^^^^^^^^^^^^^^^^^^^^^^^^^\n File \"/home/barlo/.local/share/uv/python/cpython-3.12.13-linux-x86_64-gnu/lib/python3.12/re/_compiler.py\", line 750, in compile\n p = _parser.parse(p, flags)\n ^^^^^^^^^^^^^^^^^^^^^^^\n File \"/home/barlo/.local/share/uv/python/cpython-3.12.13-linux-x86_64-gnu/lib/python3.12/re/_parser.py\", line 984, in parse\n raise source.error(\"unbalanced parenthesis\")\nre.error: unbalanced parenthesis at position 54\nExample 209 (lines 3385-3388) Link reference definitions\nprogram returned error code 1\nTraceback (most recent call last):\n File \"/mnt/c/Users/barlo/projects/drydock/uat/Commonmark/runs/20260815.202344/build/commonmark/./commonmark\", line 270, in <module>\n if __name__=='__main__': main()\n ^^^^^^\n File \"/mnt/c/Users/barlo/projects/drydock/uat/Commonmark/runs/20260815.202344/build/commonmark/./commonmark\", line 269, in main\n sys.stdout.write(Document(sys.stdin.read()).parse())\n ^^^^^^^^^^^^^^^^^^^^^^^^^^^^^^^^^^\n File \"/mnt/c/Users/barlo/projects/drydock/uat/Commonmark/runs/20260815.202344/build/commonmark/./commonmark\", line 34, in parse\n self.collect_refs()\n File \"/mnt/c/Users/barlo/projects/drydock/uat/Commonmark/runs/20260815.202344/build/commonmark/./commonmark\", line 65, in collect_refs\n parsed=self.parse_reference(rest)\n ^^^^^^^^^^^^^^^^^^^^^^^^^^\n File \"/mnt/c/Users/barlo/projects/drydock/uat/Commonmark/runs/20260815.202344/build/commonmark/./commonmark\", line 85, in parse_reference\n m=re.match(r'((?:\\\\.|[^\\\\ \\t\\n()])*?(?:\\\\\\([^)]*\\\\)|[^\\\\ \\t\\n()]*)?)(.*)$',rest,re.S)\n ^^^^^^^^^^^^^^^^^^^^^^^^^^^^^^^^^^^^^^^^^^^^^^^^^^^^^^^^^^^^^^^^^^^^^^^^^^^^^^^^^^^\n File \"/home/barlo/.local/share/uv/python/cpython-3.12.13-linux-x86_64-gnu/lib/python3.12/re/__init__.py\", line 167, in match\n return _compile(pattern, flags).match(string)\n ^^^^^^^^^^^^^^^^^^^^^^^^\n File \"/home/barlo/.local/share/uv/python/cpython-3.12.13-linux-x86_64-gnu/lib/python3.12/re/__init__.py\", line 307, in _compile\n p = _compiler.compile(pattern, flags)\n ^^^^^^^^^^^^^^^^^^^^^^^^^^^^^^^^^\n File \"/home/barlo/.local/share/uv/python/cpython-3.12.13-linux-x86_64-gnu/lib/python3.12/re/_compiler.py\", line 750, in compile\n p = _parser.parse(p, flags)\n ^^^^^^^^^^^^^^^^^^^^^^^\n File \"/home/barlo/.local/share/uv/python/cpython-3.12.13-linux-x86_64-gnu/lib/python3.12/re/_parser.py\", line 984, in parse\n raise source.error(\"unbalanced parenthesis\")\nre.error: unbalanced parenthesis at position 54\nExample 210 (lines 3393-3400) Link reference definitions\nprogram returned error code 1\nTraceback (most recent call last):\n File \"/mnt/c/Users/barlo/projects/drydock/uat/Commonmark/runs/20260815.202344/build/commonmark/./commonmark\", line 270, in <module>\n if __name__=='__main__': main()\n ^^^^^^\n File \"/mnt/c/Users/barlo/projects/drydock/uat/Commonmark/runs/20260815.202344/build/commonmark/./commonmark\", line 269, in main\n sys.stdout.write(Document(sys.stdin.read()).parse())\n ^^^^^^^^^^^^^^^^^^^^^^^^^^^^^^^^^^\n File \"/mnt/c/Users/barlo/projects/drydock/uat/Commonmark/runs/20260815.202344/build/commonmark/./commonmark\", line 34, in parse\n self.collect_refs()\n File \"/mnt/c/Users/barlo/projects/drydock/uat/Commonmark/runs/20260815.202344/build/commonmark/./commonmark\", line 65, in collect_refs\n parsed=self.parse_reference(rest)\n ^^^^^^^^^^^^^^^^^^^^^^^^^^\n File \"/mnt/c/Users/barlo/projects/drydock/uat/Commonmark/runs/20260815.202344/build/commonmark/./commonmark\", line 85, in parse_reference\n m=re.match(r'((?:\\\\.|[^\\\\ \\t\\n()])*?(?:\\\\\\([^)]*\\\\)|[^\\\\ \\t\\n()]*)?)(.*)$',rest,re.S)\n ^^^^^^^^^^^^^^^^^^^^^^^^^^^^^^^^^^^^^^^^^^^^^^^^^^^^^^^^^^^^^^^^^^^^^^^^^^^^^^^^^^^\n File \"/home/barlo/.local/share/uv/python/cpython-3.12.13-linux-x86_64-gnu/lib/python3.12/re/__init__.py\", line 167, in match\n return _compile(pattern, flags).match(string)\n ^^^^^^^^^^^^^^^^^^^^^^^^\n File \"/home/barlo/.local/share/uv/python/cpython-3.12.13-linux-x86_64-gnu/lib/python3.12/re/__init__.py\", line 307, in _compile\n p = _compiler.compile(pattern, flags)\n ^^^^^^^^^^^^^^^^^^^^^^^^^^^^^^^^^\n File \"/home/barlo/.local/share/uv/python/cpython-3.12.13-linux-x86_64-gnu/lib/python3.12/re/_compiler.py\", line 750, in compile\n p = _parser.parse(p, flags)\n ^^^^^^^^^^^^^^^^^^^^^^^\n File \"/home/barlo/.local/share/uv/python/cpython-3.12.13-linux-x86_64-gnu/lib/python3.12/re/_parser.py\", line 984, in parse\n raise source.error(\"unbalanced parenthesis\")\nre.error: unbalanced parenthesis at position 54\nExample 211 (lines 3406-3410) Link reference definitions\nprogram returned error code 1\nTraceback (most recent call last):\n File \"/mnt/c/Users/barlo/projects/drydock/uat/Commonmark/runs/20260815.202344/build/commonmark/./commonmark\", line 270, in <module>\n if __name__=='__main__': main()\n ^^^^^^\n File \"/mnt/c/Users/barlo/projects/drydock/uat/Commonmark/runs/20260815.202344/build/commonmark/./commonmark\", line 269, in main\n sys.stdout.write(Document(sys.stdin.read()).parse())\n ^^^^^^^^^^^^^^^^^^^^^^^^^^^^^^^^^^\n File \"/mnt/c/Users/barlo/projects/drydock/uat/Commonmark/runs/20260815.202344/build/commonmark/./commonmark\", line 34, in parse\n self.collect_refs()\n File \"/mnt/c/Users/barlo/projects/drydock/uat/Commonmark/runs/20260815.202344/build/commonmark/./commonmark\", line 65, in collect_refs\n parsed=self.parse_reference(rest)\n ^^^^^^^^^^^^^^^^^^^^^^^^^^\n File \"/mnt/c/Users/barlo/projects/drydock/uat/Commonmark/runs/20260815.202344/build/commonmark/./commonmark\", line 85, in parse_reference\n m=re.match(r'((?:\\\\.|[^\\\\ \\t\\n()])*?(?:\\\\\\([^)]*\\\\)|[^\\\\ \\t\\n()]*)?)(.*)$',rest,re.S)\n ^^^^^^^^^^^^^^^^^^^^^^^^^^^^^^^^^^^^^^^^^^^^^^^^^^^^^^^^^^^^^^^^^^^^^^^^^^^^^^^^^^^\n File \"/home/barlo/.local/share/uv/python/cpython-3.12.13-linux-x86_64-gnu/lib/python3.12/re/__init__.py\", line 167, in match\n return _compile(pattern, flags).match(string)\n ^^^^^^^^^^^^^^^^^^^^^^^^\n File \"/home/barlo/.local/share/uv/python/cpython-3.12.13-linux-x86_64-gnu/lib/python3.12/re/__init__.py\", line 307, in _compile\n p = _compiler.compile(pattern, flags)\n ^^^^^^^^^^^^^^^^^^^^^^^^^^^^^^^^^\n File \"/home/barlo/.local/share/uv/python/cpython-3.12.13-linux-x86_64-gnu/lib/python3.12/re/_compiler.py\", line 750, in compile\n p = _parser.parse(p, flags)\n ^^^^^^^^^^^^^^^^^^^^^^^\n File \"/home/barlo/.local/share/uv/python/cpython-3.12.13-linux-x86_64-gnu/lib/python3.12/re/_parser.py\", line 984, in parse\n raise source.error(\"unbalanced parenthesis\")\nre.error: unbalanced parenthesis at position 54\nExample 212 (lines 3415-3420) Link reference definitions\nprogram returned error code 1\nTraceback (most recent call last):\n File \"/mnt/c/Users/barlo/projects/drydock/uat/Commonmark/runs/20260815.202344/build/commonmark/./commonmark\", line 270, in <module>\n if __name__=='__main__': main()\n ^^^^^^\n File \"/mnt/c/Users/barlo/projects/drydock/uat/Commonmark/runs/20260815.202344/build/commonmark/./commonmark\", line 269, in main\n sys.stdout.write(Document(sys.stdin.read()).parse())\n ^^^^^^^^^^^^^^^^^^^^^^^^^^^^^^^^^^\n File \"/mnt/c/Users/barlo/projects/drydock/uat/Commonmark/runs/20260815.202344/build/commonmark/./commonmark\", line 34, in parse\n self.collect_refs()\n File \"/mnt/c/Users/barlo/projects/drydock/uat/Commonmark/runs/20260815.202344/build/commonmark/./commonmark\", line 65, in collect_refs\n parsed=self.parse_reference(rest)\n ^^^^^^^^^^^^^^^^^^^^^^^^^^\n File \"/mnt/c/Users/barlo/projects/drydock/uat/Commonmark/runs/20260815.202344/build/commonmark/./commonmark\", line 85, in parse_reference\n m=re.match(r'((?:\\\\.|[^\\\\ \\t\\n()])*?(?:\\\\\\([^)]*\\\\)|[^\\\\ \\t\\n()]*)?)(.*)$',rest,re.S)\n ^^^^^^^^^^^^^^^^^^^^^^^^^^^^^^^^^^^^^^^^^^^^^^^^^^^^^^^^^^^^^^^^^^^^^^^^^^^^^^^^^^^\n File \"/home/barlo/.local/share/uv/python/cpython-3.12.13-linux-x86_64-gnu/lib/python3.12/re/__init__.py\", line 167, in match\n return _compile(pattern, flags).match(string)\n ^^^^^^^^^^^^^^^^^^^^^^^^\n File \"/home/barlo/.local/share/uv/python/cpython-3.12.13-linux-x86_64-gnu/lib/python3.12/re/__init__.py\", line 307, in _compile\n p = _compiler.compile(pattern, flags)\n ^^^^^^^^^^^^^^^^^^^^^^^^^^^^^^^^^\n File \"/home/barlo/.local/share/uv/python/cpython-3.12.13-linux-x86_64-gnu/lib/python3.12/re/_compiler.py\", line 750, in compile\n p = _parser.parse(p, flags)\n ^^^^^^^^^^^^^^^^^^^^^^^\n File \"/home/barlo/.local/share/uv/python/cpython-3.12.13-linux-x86_64-gnu/lib/python3.12/re/_parser.py\", line 984, in parse\n raise source.error(\"unbalanced parenthesis\")\nre.error: unbalanced parenthesis at position 54\nExample 213 (lines 3426-3434) Link reference definitions\n [foo]: /url \"title\"\n\n[foo]\n\n--- expected HTML\n+++ actual HTML\n@@ -1,2 +1,2 @@\n-<pre><code>[foo]: /url "title"\n+<pre><code>[foo]: /url \"title\"\n </code></pre><p>[foo]</p>\n\nExample 215 (lines 3455-3464) Link reference definitions\nprogram returned error code 1\nTraceback (most recent call last):\n File \"/mnt/c/Users/barlo/projects/drydock/uat/Commonmark/runs/20260815.202344/build/commonmark/./commonmark\", line 270, in <module>\n if __name__=='__main__': main()\n ^^^^^^\n File \"/mnt/c/Users/barlo/projects/drydock/uat/Commonmark/runs/20260815.202344/build/commonmark/./commonmark\", line 269, in main\n sys.stdout.write(Document(sys.stdin.read()).parse())\n ^^^^^^^^^^^^^^^^^^^^^^^^^^^^^^^^^^\n File \"/mnt/c/Users/barlo/projects/drydock/uat/Commonmark/runs/20260815.202344/build/commonmark/./commonmark\", line 34, in parse\n self.collect_refs()\n File \"/mnt/c/Users/barlo/projects/drydock/uat/Commonmark/runs/20260815.202344/build/commonmark/./commonmark\", line 65, in collect_refs\n parsed=self.parse_reference(rest)\n ^^^^^^^^^^^^^^^^^^^^^^^^^^\n File \"/mnt/c/Users/barlo/projects/drydock/uat/Commonmark/runs/20260815.202344/build/commonmark/./commonmark\", line 85, in parse_reference\n m=re.match(r'((?:\\\\.|[^\\\\ \\t\\n()])*?(?:\\\\\\([^)]*\\\\)|[^\\\\ \\t\\n()]*)?)(.*)$',rest,re.S)\n ^^^^^^^^^^^^^^^^^^^^^^^^^^^^^^^^^^^^^^^^^^^^^^^^^^^^^^^^^^^^^^^^^^^^^^^^^^^^^^^^^^^\n File \"/home/barlo/.local/share/uv/python/cpython-3.12.13-linux-x86_64-gnu/lib/python3.12/re/__init__.py\", line 167, in match\n return _compile(pattern, flags).match(string)\n ^^^^^^^^^^^^^^^^^^^^^^^^\n File \"/home/barlo/.local/share/uv/python/cpython-3.12.13-linux-x86_64-gnu/lib/python3.12/re/__init__.py\", line 307, in _compile\n p = _compiler.compile(pattern, flags)\n ^^^^^^^^^^^^^^^^^^^^^^^^^^^^^^^^^\n File \"/home/barlo/.local/share/uv/python/cpython-3.12.13-linux-x86_64-gnu/lib/python3.12/re/_compiler.py\", line 750, in compile\n p = _parser.parse(p, flags)\n ^^^^^^^^^^^^^^^^^^^^^^^\n File \"/home/barlo/.local/share/uv/python/cpython-3.12.13-linux-x86_64-gnu/lib/python3.12/re/_parser.py\", line 984, in parse\n raise source.error(\"unbalanced parenthesis\")\nre.error: unbalanced parenthesis at position 54\nExample 216 (lines 3470-3479) Link reference definitions\nprogram returned error code 1\nTraceback (most recent call last):\n File \"/mnt/c/Users/barlo/projects/drydock/uat/Commonmark/runs/20260815.202344/build/commonmark/./commonmark\", line 270, in <module>\n if __name__=='__main__': main()\n ^^^^^^\n File \"/mnt/c/Users/barlo/projects/drydock/uat/Commonmark/runs/20260815.202344/build/commonmark/./commonmark\", line 269, in main\n sys.stdout.write(Document(sys.stdin.read()).parse())\n ^^^^^^^^^^^^^^^^^^^^^^^^^^^^^^^^^^\n File \"/mnt/c/Users/barlo/projects/drydock/uat/Commonmark/runs/20260815.202344/build/commonmark/./commonmark\", line 34, in parse\n self.collect_refs()\n File \"/mnt/c/Users/barlo/projects/drydock/uat/Commonmark/runs/20260815.202344/build/commonmark/./commonmark\", line 65, in collect_refs\n parsed=self.parse_reference(rest)\n ^^^^^^^^^^^^^^^^^^^^^^^^^^\n File \"/mnt/c/Users/barlo/projects/drydock/uat/Commonmark/runs/20260815.202344/build/commonmark/./commonmark\", line 85, in parse_reference\n m=re.match(r'((?:\\\\.|[^\\\\ \\t\\n()])*?(?:\\\\\\([^)]*\\\\)|[^\\\\ \\t\\n()]*)?)(.*)$',rest,re.S)\n ^^^^^^^^^^^^^^^^^^^^^^^^^^^^^^^^^^^^^^^^^^^^^^^^^^^^^^^^^^^^^^^^^^^^^^^^^^^^^^^^^^^\n File \"/home/barlo/.local/share/uv/python/cpython-3.12.13-linux-x86_64-gnu/lib/python3.12/re/__init__.py\", line 167, in match\n return _compile(pattern, flags).match(string)\n ^^^^^^^^^^^^^^^^^^^^^^^^\n File \"/home/barlo/.local/share/uv/python/cpython-3.12.13-linux-x86_64-gnu/lib/python3.12/re/__init__.py\", line 307, in _compile\n p = _compiler.compile(pattern, flags)\n ^^^^^^^^^^^^^^^^^^^^^^^^^^^^^^^^^\n File \"/home/barlo/.local/share/uv/python/cpython-3.12.13-linux-x86_64-gnu/lib/python3.12/re/_compiler.py\", line 750, in compile\n p = _parser.parse(p, flags)\n ^^^^^^^^^^^^^^^^^^^^^^^\n File \"/home/barlo/.local/share/uv/python/cpython-3.12.13-linux-x86_64-gnu/lib/python3.12/re/_parser.py\", line 984, in parse\n raise source.error(\"unbalanced parenthesis\")\nre.error: unbalanced parenthesis at position 54\nExample 217 (lines 3481-3489) Link reference definitions\nprogram returned error code 1\nTraceback (most recent call last):\n File \"/mnt/c/Users/barlo/projects/drydock/uat/Commonmark/runs/20260815.202344/build/commonmark/./commonmark\", line 270, in <module>\n if __name__=='__main__': main()\n ^^^^^^\n File \"/mnt/c/Users/barlo/projects/drydock/uat/Commonmark/runs/20260815.202344/build/commonmark/./commonmark\", line 269, in main\n sys.stdout.write(Document(sys.stdin.read()).parse())\n ^^^^^^^^^^^^^^^^^^^^^^^^^^^^^^^^^^\n File \"/mnt/c/Users/barlo/projects/drydock/uat/Commonmark/runs/20260815.202344/build/commonmark/./commonmark\", line 34, in parse\n self.collect_refs()\n File \"/mnt/c/Users/barlo/projects/drydock/uat/Commonmark/runs/20260815.202344/build/commonmark/./commonmark\", line 65, in collect_refs\n parsed=self.parse_reference(rest)\n ^^^^^^^^^^^^^^^^^^^^^^^^^^\n File \"/mnt/c/Users/barlo/projects/drydock/uat/Commonmark/runs/20260815.202344/build/commonmark/./commonmark\", line 85, in parse_reference\n m=re.match(r'((?:\\\\.|[^\\\\ \\t\\n()])*?(?:\\\\\\([^)]*\\\\)|[^\\\\ \\t\\n()]*)?)(.*)$',rest,re.S)\n ^^^^^^^^^^^^^^^^^^^^^^^^^^^^^^^^^^^^^^^^^^^^^^^^^^^^^^^^^^^^^^^^^^^^^^^^^^^^^^^^^^^\n File \"/home/barlo/.local/share/uv/python/cpython-3.12.13-linux-x86_64-gnu/lib/python3.12/re/__init__.py\", line 167, in match\n return _compile(pattern, flags).match(string)\n ^^^^^^^^^^^^^^^^^^^^^^^^\n File \"/home/barlo/.local/share/uv/python/cpython-3.12.13-linux-x86_64-gnu/lib/python3.12/re/__init__.py\", line 307, in _compile\n p = _compiler.compile(pattern, flags)\n ^^^^^^^^^^^^^^^^^^^^^^^^^^^^^^^^^\n File \"/home/barlo/.local/share/uv/python/cpython-3.12.13-linux-x86_64-gnu/lib/python3.12/re/_compiler.py\", line 750, in compile\n p = _parser.parse(p, flags)\n ^^^^^^^^^^^^^^^^^^^^^^^\n File \"/home/barlo/.local/share/uv/python/cpython-3.12.13-linux-x86_64-gnu/lib/python3.12/re/_parser.py\", line 984, in parse\n raise source.error(\"unbalanced parenthesis\")\nre.error: unbalanced parenthesis at position 54\nExample 218 (lines 3491-3498) Link reference definitions\nprogram returned error code 1\nTraceback (most recent call last):\n File \"/mnt/c/Users/barlo/projects/drydock/uat/Commonmark/runs/20260815.202344/build/commonmark/./commonmark\", line 270, in <module>\n if __name__=='__main__': main()\n ^^^^^^\n File \"/mnt/c/Users/barlo/projects/drydock/uat/Commonmark/runs/20260815.202344/build/commonmark/./commonmark\", line 269, in main\n sys.stdout.write(Document(sys.stdin.read()).parse())\n ^^^^^^^^^^^^^^^^^^^^^^^^^^^^^^^^^^\n File \"/mnt/c/Users/barlo/projects/drydock/uat/Commonmark/runs/20260815.202344/build/commonmark/./commonmark\", line 34, in parse\n self.collect_refs()\n File \"/mnt/c/Users/barlo/projects/drydock/uat/Commonmark/runs/20260815.202344/build/commonmark/./commonmark\", line 65, in collect_refs\n parsed=self.parse_reference(rest)\n ^^^^^^^^^^^^^^^^^^^^^^^^^^\n File \"/mnt/c/Users/barlo/projects/drydock/uat/Commonmark/runs/20260815.202344/build/commonmark/./commonmark\", line 85, in parse_reference\n m=re.match(r'((?:\\\\.|[^\\\\ \\t\\n()])*?(?:\\\\\\([^)]*\\\\)|[^\\\\ \\t\\n()]*)?)(.*)$',rest,re.S)\n ^^^^^^^^^^^^^^^^^^^^^^^^^^^^^^^^^^^^^^^^^^^^^^^^^^^^^^^^^^^^^^^^^^^^^^^^^^^^^^^^^^^\n File \"/home/barlo/.local/share/uv/python/cpython-3.12.13-linux-x86_64-gnu/lib/python3.12/re/__init__.py\", line 167, in match\n return _compile(pattern, flags).match(string)\n ^^^^^^^^^^^^^^^^^^^^^^^^\n File \"/home/barlo/.local/share/uv/python/cpython-3.12.13-linux-x86_64-gnu/lib/python3.12/re/__init__.py\", line 307, in _compile\n p = _compiler.compile(pattern, flags)\n ^^^^^^^^^^^^^^^^^^^^^^^^^^^^^^^^^\n File \"/home/barlo/.local/share/uv/python/cpython-3.12.13-linux-x86_64-gnu/lib/python3.12/re/_compiler.py\", line 750, in compile\n p = _parser.parse(p, flags)\n ^^^^^^^^^^^^^^^^^^^^^^^\n File \"/home/barlo/.local/share/uv/python/cpython-3.12.13-linux-x86_64-gnu/lib/python3.12/re/_parser.py\", line 984, in parse\n raise source.error(\"unbalanced parenthesis\")\nre.error: unbalanced parenthesis at position 54\nExample 219 (lines 3504-3517) Link reference definitions\nprogram returned error code 1\nTraceback (most recent call last):\n File \"/mnt/c/Users/barlo/projects/drydock/uat/Commonmark/runs/20260815.202344/build/commonmark/./commonmark\", line 270, in <module>\n if __name__=='__main__': main()\n ^^^^^^\n File \"/mnt/c/Users/barlo/projects/drydock/uat/Commonmark/runs/20260815.202344/build/commonmark/./commonmark\", line 269, in main\n sys.stdout.write(Document(sys.stdin.read()).parse())\n ^^^^^^^^^^^^^^^^^^^^^^^^^^^^^^^^^^\n File \"/mnt/c/Users/barlo/projects/drydock/uat/Commonmark/runs/20260815.202344/build/commonmark/./commonmark\", line 34, in parse\n self.collect_refs()\n File \"/mnt/c/Users/barlo/projects/drydock/uat/Commonmark/runs/20260815.202344/build/commonmark/./commonmark\", line 65, in collect_refs\n parsed=self.parse_reference(rest)\n ^^^^^^^^^^^^^^^^^^^^^^^^^^\n File \"/mnt/c/Users/barlo/projects/drydock/uat/Commonmark/runs/20260815.202344/build/commonmark/./commonmark\", line 85, in parse_reference\n m=re.match(r'((?:\\\\.|[^\\\\ \\t\\n()])*?(?:\\\\\\([^)]*\\\\)|[^\\\\ \\t\\n()]*)?)(.*)$',rest,re.S)\n ^^^^^^^^^^^^^^^^^^^^^^^^^^^^^^^^^^^^^^^^^^^^^^^^^^^^^^^^^^^^^^^^^^^^^^^^^^^^^^^^^^^\n File \"/home/barlo/.local/share/uv/python/cpython-3.12.13-linux-x86_64-gnu/lib/python3.12/re/__init__.py\", line 167, in match\n return _compile(pattern, flags).match(string)\n ^^^^^^^^^^^^^^^^^^^^^^^^\n File \"/home/barlo/.local/share/uv/python/cpython-3.12.13-linux-x86_64-gnu/lib/python3.12/re/__init__.py\", line 307, in _compile\n p = _compiler.compile(pattern, flags)\n ^^^^^^^^^^^^^^^^^^^^^^^^^^^^^^^^^\n File \"/home/barlo/.local/share/uv/python/cpython-3.12.13-linux-x86_64-gnu/lib/python3.12/re/_compiler.py\", line 750, in compile\n p = _parser.parse(p, flags)\n ^^^^^^^^^^^^^^^^^^^^^^^\n File \"/home/barlo/.local/share/uv/python/cpython-3.12.13-linux-x86_64-gnu/lib/python3.12/re/_parser.py\", line 984, in parse\n raise source.error(\"unbalanced parenthesis\")\nre.error: unbalanced parenthesis at position 54\nExample 220 (lines 3525-3533) Link reference definitions\n[foo]\n\n> [foo]: /url\n\n--- expected HTML\n+++ actual HTML\n@@ -1 +1 @@\n-<p><a href=\"/url\">foo</a></p><blockquote></blockquote>\n+<p>[foo]</p><blockquote><p>[foo]: /url</p></blockquote>\n\n140 passed, 26 failed, 21 errored, 468 skipped\n","exit_code":47,"status":"failed"}}
{"type":"item.started","item":{"id":"item_11","type":"file_change","changes":[{"path":"/mnt/c/Users/barlo/projects/drydock/uat/Commonmark/runs/20260815.202344/build/commonmark/commonmark","kind":"update"}],"status":"in_progress"}}
{"type":"item.completed","item":{"id":"item_11","type":"file_change","changes":[{"path":"/mnt/c/Users/barlo/projects/drydock/uat/Commonmark/runs/20260815.202344/build/commonmark/commonmark","kind":"update"}],"status":"completed"}}
{"type":"item.started","item":{"id":"item_12","type":"file_change","changes":[{"path":"/mnt/c/Users/barlo/projects/drydock/uat/Commonmark/runs/20260815.202344/build/commonmark/commonmark","kind":"update"}],"status":"in_progress"}}
{"type":"item.completed","item":{"id":"item_12","type":"file_change","changes":[{"path":"/mnt/c/Users/barlo/projects/drydock/uat/Commonmark/runs/20260815.202344/build/commonmark/commonmark","kind":"update"}],"status":"completed"}}
{"type":"item.started","item":{"id":"item_13","type":"file_change","changes":[{"path":"/mnt/c/Users/barlo/projects/drydock/uat/Commonmark/runs/20260815.202344/build/commonmark/commonmark","kind":"update"}],"status":"in_progress"}}
{"type":"item.completed","item":{"id":"item_13","type":"file_change","changes":[{"path":"/mnt/c/Users/barlo/projects/drydock/uat/Commonmark/runs/20260815.202344/build/commonmark/commonmark","kind":"update"}],"status":"completed"}}
{"type":"item.started","item":{"id":"item_14","type":"command_execution","command":"/bin/bash -lc \"sed -n '250,275p' commonmark\"","aggregated_output":"","exit_code":null,"status":"in_progress"}}
{"type":"item.completed","item":{"id":"item_14","type":"command_execution","command":"/bin/bash -lc \"sed -n '250,275p' commonmark\"","aggregated_output":" low=s.lower()\n if not s: return None\n for tag in ('pre','script','style','textarea'):\n if re.match(r'<'+tag+r'(?:[ \\t>]|$)',low): return tag\n if low.startswith('<!--'): return 'comment'\n if low.startswith('<?'): return 'pi'\n if re.match(r'<![a-z]',low): return 'decl'\n if low.startswith('<![cdata['): return 'cdata'\n block=r'(?:address|article|aside|base|basefont|blockquote|body|caption|center|col|colgroup|dd|details|dialog|dir|div|dl|dt|fieldset|figcaption|figure|footer|form|frame|frameset|h[1-6]|head|header|hr|html|iframe|legend|li|link|main|menu|nav|ol|p|param|section|summary|table|tbody|td|tfoot|th|thead|title|tr|track|ul)'\n if re.match(r'</?'+block+r'(?:[ \\t/>]|$)',low): return 'block'\n if re.match(r'</?[A-Za-z][A-Za-z0-9-]*(?:[ \\t]|/?>)[ \\t]*$',s): return 'tag'\n return None\n\n def _paragraph_fallback(self, lines, out, start):\n b=[lines[start]]; i=start+1\n while i<len(lines) and lines[i].strip(): b.append(lines[i]); i+=1\n out.append('<p>'+self.inline('\\n'.join(b))+'</p>')\n return '\\n'.join(out)+'\\n'\n\ndef main():\n sys.stdout.write(Document(sys.stdin.read()).parse())\nif __name__=='__main__': main()\n","exit_code":0,"status":"completed"}}
{"type":"item.started","item":{"id":"item_15","type":"command_execution","command":"/bin/bash -lc \"sed -n '190,215p' commonmark\"","aggregated_output":"","exit_code":null,"status":"in_progress"}}
{"type":"item.completed","item":{"id":"item_15","type":"command_execution","command":"/bin/bash -lc \"sed -n '190,215p' commonmark\"","aggregated_output":" out.append('<blockquote>\\n'+self.blocks(q)+'\\n</blockquote>'); continue\n lm=re.match(r' {0,3}([-+*]|\\d+[.)])[ \\t]+(.*)$',line)\n if lm:\n marker=lm.group(1); ordered=marker[0].isdigit(); items=[]\n while i<n:\n mm=re.match(r' {0,3}([-+*]|\\d+[.)])[ \\t]+(.*)$',lines[i])\n if not mm or mm.group(1)[0].isdigit()!=ordered: break\n item=[mm.group(2)]; i+=1\n while i<n and lines[i].strip() and not re.match(r' {0,3}([-+*]|\\d+[.)])[ \\t]+',lines[i]):\n item.append(re.sub(r'^ {2,4}','',lines[i])); i+=1\n items.append(item)\n tag='ol' if ordered else 'ul'; attrs=''\n if ordered and not marker.startswith('1'): attrs=' start=\"'+re.match(r'\\d+',marker).group()+'\"'\n rendered=[]\n for item in items:\n content=self.blocks(item).strip()\n if content.startswith('<p>') and content.endswith('</p>') and '\\n' not in content:\n content=content[3:-4]\n rendered.append('<li>'+content+'</li>')\n out.append('<'+tag+attrs+'>'+''.join(rendered)+'</'+tag+'>'); continue\n if re.match(r' {4}',line):\n b=[]\n while i<n and (lines[i].startswith(' ') or not lines[i].strip()): b.append(lines[i][4:] if lines[i].startswith(' ') else ''); i+=1\n out.append('<pre><code>'+esc_text('\\n'.join(b).rstrip('\\n')+'\\n')+'</code></pre>'); continue\n # HTML blocks are emitted verbatim and therefore never become paragraphs.\n html_kind=self.html_block_kind(line)\n","exit_code":0,"status":"completed"}}
{"type":"item.started","item":{"id":"item_16","type":"file_change","changes":[{"path":"/mnt/c/Users/barlo/projects/drydock/uat/Commonmark/runs/20260815.202344/build/commonmark/commonmark","kind":"update"}],"status":"in_progress"}}
{"type":"item.completed","item":{"id":"item_16","type":"file_change","changes":[{"path":"/mnt/c/Users/barlo/projects/drydock/uat/Commonmark/runs/20260815.202344/build/commonmark/commonmark","kind":"update"}],"status":"completed"}}
{"type":"item.started","item":{"id":"item_17","type":"command_execution","command":"/bin/bash -lc \"python3 -m py_compile commonmark && python3 sources/spec_tests.py --program ./commonmark --spec sources/spec.txt --pattern '\"'^(Thematic breaks|ATX headings|Setext headings|Indented code blocks|Fenced code blocks|HTML blocks|Link reference definitions|Paragraphs|Blank lines)$'\"' > /tmp/commonmark-leaf.out 2>&1; rc=\"'$?; tail -40 /tmp/commonmark-leaf.out; exit $rc'","aggregated_output":"","exit_code":null,"status":"in_progress"}}
{"type":"item.started","item":{"id":"item_18","type":"command_execution","command":"/bin/bash -lc \"tail -60 /tmp/commonmark-leaf.out; wc -l /tmp/commonmark-leaf.out; grep -E 'passed|failed|errored' /tmp/commonmark-leaf.out | tail -3; python3 - <<'PY'\nimport subprocess\np=subprocess.run(['python3','sources/spec_tests.py','--program','./commonmark','--spec','sources/spec.txt','--pattern','\"'^(Thematic breaks|ATX headings|Setext headings|Indented code blocks|Fenced code blocks|HTML blocks|Link reference definitions|Paragraphs|Blank lines)$'\"'],capture_output=True,text=True)\nprint('RC',p.returncode)\nprint(p.stdout[-200:])\nPY\"","aggregated_output":"","exit_code":null,"status":"in_progress"}}
{"type":"item.completed","item":{"id":"item_17","type":"command_execution","command":"/bin/bash -lc \"python3 -m py_compile commonmark && python3 sources/spec_tests.py --program ./commonmark --spec sources/spec.txt --pattern '\"'^(Thematic breaks|ATX headings|Setext headings|Indented code blocks|Fenced code blocks|HTML blocks|Link reference definitions|Paragraphs|Blank lines)$'\"' > /tmp/commonmark-leaf.out 2>&1; rc=\"'$?; tail -40 /tmp/commonmark-leaf.out; exit $rc'","aggregated_output":"\nExample 218 (lines 3491-3498) Link reference definitions\n[foo]: /url\n===\n[foo]\n\n--- expected HTML\n+++ actual HTML\n@@ -1 +1 @@\n-<p>=== <a href=\"/url\">foo</a></p>\n+<h1>[foo]: /url</h1><p>[foo]</p>\n\nExample 219 (lines 3504-3517) Link reference definitions\n[foo]: /foo-url \"foo\"\n[bar]: /bar-url\n \"bar\"\n[baz]: /baz-url\n\n[foo],\n[bar],\n[baz]\n\n--- expected HTML\n+++ actual HTML\n@@ -1 +1 @@\n-<p><a href=\"/foo-url\" title=\"foo\">foo</a>, <a href=\"/bar-url\" title=\"bar\">bar</a>, <a href=\"/baz-url\">baz</a></p>\n+<p>[foo]: /foo-url "foo" [bar]: /bar-url "bar" [baz]: /baz-url</p><p>[foo], [bar], [baz]</p>\n\nExample 220 (lines 3525-3533) Link reference definitions\n[foo]\n\n> [foo]: /url\n\n--- expected HTML\n+++ actual HTML\n@@ -1 +1 @@\n-<p><a href=\"/url\">foo</a></p><blockquote></blockquote>\n+<p>[foo]</p><blockquote><p>[foo]: /url</p></blockquote>\n\n150 passed, 37 failed, 0 errored, 468 skipped\n","exit_code":37,"status":"failed"}}
{"type":"item.started","item":{"id":"item_19","type":"command_execution","command":"/bin/bash -lc \"tail -5 /tmp/commonmark-leaf.out; grep -c '\"'^Example'\"' /tmp/commonmark-leaf.out; timeout 60s python3 sources/spec_tests.py --program ./commonmark --spec sources/spec.txt --pattern '\"'^Link reference definitions$'\"' | tail -3; echo rc:\"'${PIPESTATUS[0]}'","aggregated_output":"","exit_code":null,"status":"in_progress"}}
{"type":"item.completed","item":{"id":"item_19","type":"command_execution","command":"/bin/bash -lc \"tail -5 /tmp/commonmark-leaf.out; grep -c '\"'^Example'\"' /tmp/commonmark-leaf.out; timeout 60s python3 sources/spec_tests.py --program ./commonmark --spec sources/spec.txt --pattern '\"'^Link reference definitions$'\"' | tail -3; echo rc:\"'${PIPESTATUS[0]}'","aggregated_output":"+<p>[foo]</p><blockquote><p>[foo]: /url</p></blockquote>\n\n6 passed, 21 failed, 0 errored, 628 skipped\nrc:21\n","exit_code":0,"status":"completed"}}
{"type":"item.started","item":{"id":"item_20","type":"command_execution","command":"/bin/bash -lc \"./commonmark <<'EOF'\n<a href=\\\"foo\\\">\n*bar*\n</a>\nEOF\npython3 - <<'PY'\nimport importlib.util\ns=importlib.util.spec_from_file_location('x','commonmark'); m=importlib.util.module_from_spec(s); s.loader.exec_module(m)\nfor x in ['<a href=\\\"foo\\\">','<Warning>','</div>','<del>']:\n print(x,m.Document('').html_block_kind(x))\nPY\"","aggregated_output":"","exit_code":null,"status":"in_progress"}}
{"type":"item.completed","item":{"id":"item_20","type":"command_execution","command":"/bin/bash -lc \"./commonmark <<'EOF'\n<a href=\\\"foo\\\">\n*bar*\n</a>\nEOF\npython3 - <<'PY'\nimport importlib.util\ns=importlib.util.spec_from_file_location('x','commonmark'); m=importlib.util.module_from_spec(s); s.loader.exec_module(m)\nfor x in ['<a href=\\\"foo\\\">','<Warning>','</div>','<del>']:\n print(x,m.Document('').html_block_kind(x))\nPY\"","aggregated_output":"<p><a href=\"foo\">\n<em>bar</em></p>\n</a>\nTraceback (most recent call last):\n File \"<stdin>\", line 2, in <module>\n File \"<frozen importlib._bootstrap>\", line 810, in module_from_spec\nAttributeError: 'NoneType' object has no attribute 'loader'\n","exit_code":1,"status":"failed"}}
{"type":"item.started","item":{"id":"item_21","type":"command_execution","command":"/bin/bash -lc \"python3 - <<'PY'\nns={}; exec(open('commonmark').read().split('def main():')[0],ns)\nd=ns['Document']('')\nfor x in ['<a href=\\\"foo\\\">','<Warning>','</div>','<del>']:\n print(x,d.html_block_kind(x))\nPY\"","aggregated_output":"","exit_code":null,"status":"in_progress"}}
{"type":"item.completed","item":{"id":"item_21","type":"command_execution","command":"/bin/bash -lc \"python3 - <<'PY'\nns={}; exec(open('commonmark').read().split('def main():')[0],ns)\nd=ns['Document']('')\nfor x in ['<a href=\\\"foo\\\">','<Warning>','</div>','<del>']:\n print(x,d.html_block_kind(x))\nPY\"","aggregated_output":"<a href=\"foo\"> None\n<Warning> tag\n</div> block\n<del> tag\n","exit_code":0,"status":"completed"}}
{"type":"item.started","item":{"id":"item_22","type":"file_change","changes":[{"path":"/mnt/c/Users/barlo/projects/drydock/uat/Commonmark/runs/20260815.202344/build/commonmark/commonmark","kind":"update"}],"status":"in_progress"}}
{"type":"item.completed","item":{"id":"item_22","type":"file_change","changes":[{"path":"/mnt/c/Users/barlo/projects/drydock/uat/Commonmark/runs/20260815.202344/build/commonmark/commonmark","kind":"update"}],"status":"completed"}}
{"type":"item.completed","item":{"id":"item_23","type":"agent_message","text":"The revised parser now reaches 150/187 scoped examples with no execution errors. I’m doing a final focused pass on the remaining leaf cases, then I’ll run the declared interface and scoped conformance checks and report any residual failures explicitly."}}
{"type":"item.started","item":{"id":"item_24","type":"command_execution","command":"/bin/bash -lc \"python3 -m py_compile commonmark && python3 sources/spec_tests.py --program ./commonmark --spec sources/spec.txt --pattern '\"'^(Thematic breaks|ATX headings|Setext headings|Indented code blocks|Fenced code blocks|HTML blocks|Link reference definitions|Paragraphs|Blank lines)$'\"' 2>&1 | tail -3\"","aggregated_output":"","exit_code":null,"status":"in_progress"}}
{"type":"item.completed","item":{"id":"item_18","type":"command_execution","command":"/bin/bash -lc \"tail -60 /tmp/commonmark-leaf.out; wc -l /tmp/commonmark-leaf.out; grep -E 'passed|failed|errored' /tmp/commonmark-leaf.out | tail -3; python3 - <<'PY'\nimport subprocess\np=subprocess.run(['python3','sources/spec_tests.py','--program','./commonmark','--spec','sources/spec.txt','--pattern','\"'^(Thematic breaks|ATX headings|Setext headings|Indented code blocks|Fenced code blocks|HTML blocks|Link reference definitions|Paragraphs|Blank lines)$'\"'],capture_output=True,text=True)\nprint('RC',p.returncode)\nprint(p.stdout[-200:])\nPY\"","aggregated_output":"RC 37\npected HTML\n+++ actual HTML\n@@ -1 +1 @@\n-<p><a href=\"/url\">foo</a></p><blockquote></blockquote>\n+<p>[foo]</p><blockquote><p>[foo]: /url</p></blockquote>\n\n150 passed, 37 failed, 0 errored, 468 skipped\n\n","exit_code":0,"status":"completed"}}
{"type":"item.started","item":{"id":"item_25","type":"command_execution","command":"/bin/bash -lc \"timeout 90s python3 sources/spec_tests.py --program ./commonmark --spec sources/spec.txt --pattern '\"'^(Thematic breaks|ATX headings|Setext headings|Indented code blocks|Fenced code blocks|HTML blocks|Link reference definitions|Paragraphs|Blank lines)$'\"' > /tmp/leaf-final 2>&1; rc=\"'$?; grep -E '\"'[0-9]+ passed' /tmp/leaf-final | tail -1; echo rc=\"'$rc; python3 -m py_compile commonmark'","aggregated_output":"","exit_code":null,"status":"in_progress"}}
{"type":"item.completed","item":{"id":"item_24","type":"command_execution","command":"/bin/bash -lc \"python3 -m py_compile commonmark && python3 sources/spec_tests.py --program ./commonmark --spec sources/spec.txt --pattern '\"'^(Thematic breaks|ATX headings|Setext headings|Indented code blocks|Fenced code blocks|HTML blocks|Link reference definitions|Paragraphs|Blank lines)$'\"' 2>&1 | tail -3\"","aggregated_output":"+<p>[foo]</p><blockquote><p>[foo]: /url</p></blockquote>\n\n155 passed, 32 failed, 0 errored, 468 skipped\n","exit_code":0,"status":"completed"}}
{"type":"item.started","item":{"id":"item_26","type":"command_execution","command":"/bin/bash -lc \"grep -E '[0-9]+ passed' /tmp/leaf-final | tail -1; tail -2 /tmp/leaf-final; git diff --stat -- commonmark README.md tests/test_interface.py; ./commonmark <<'EOF'\n# heading\n\n code\nEOF\"","aggregated_output":"","exit_code":null,"status":"in_progress"}}
{"type":"item.completed","item":{"id":"item_26","type":"command_execution","command":"/bin/bash -lc \"grep -E '[0-9]+ passed' /tmp/leaf-final | tail -1; tail -2 /tmp/leaf-final; git diff --stat -- commonmark README.md tests/test_interface.py; ./commonmark <<'EOF'\n# heading\n\n code\nEOF\"","aggregated_output":"<h1>heading</h1>\n<pre><code>code\n</code></pre>\n","exit_code":0,"status":"completed"}}
{"type":"item.started","item":{"id":"item_27","type":"command_execution","command":"/bin/bash -lc \"wc -l /tmp/leaf-final; grep -c '\"'^Example'\"' /tmp/leaf-final; timeout 20s ./commonmark <<'EOF'\n[label]: /destination\n\n[label]\nEOF\nprintf 'interface_rc='; ./commonmark <<'EOF' >/tmp/cm-interface\n# heading\n\n code\nEOF\necho \"'$?'","aggregated_output":"","exit_code":null,"status":"in_progress"}}
{"type":"item.completed","item":{"id":"item_27","type":"command_execution","command":"/bin/bash -lc \"wc -l /tmp/leaf-final; grep -c '\"'^Example'\"' /tmp/leaf-final; timeout 20s ./commonmark <<'EOF'\n[label]: /destination\n\n[label]\nEOF\nprintf 'interface_rc='; ./commonmark <<'EOF' >/tmp/cm-interface\n# heading\n\n code\nEOF\necho \"'$?'","aggregated_output":"<p>[label]: /destination</p>\n<p>[label]</p>\ninterface_rc=0\n","exit_code":0,"status":"completed"}}
{"type":"item.started","item":{"id":"item_28","type":"file_change","changes":[{"path":"/mnt/c/Users/barlo/projects/drydock/uat/Commonmark/runs/20260815.202344/build/commonmark/commonmark","kind":"update"}],"status":"in_progress"}}
{"type":"item.completed","item":{"id":"item_28","type":"file_change","changes":[{"path":"/mnt/c/Users/barlo/projects/drydock/uat/Commonmark/runs/20260815.202344/build/commonmark/commonmark","kind":"update"}],"status":"completed"}}
{"type":"item.started","item":{"id":"item_29","type":"command_execution","command":"/bin/bash -lc \"./commonmark <<'EOF'\n[label]: /destination\n\n[label]\nEOF\npython3 -m py_compile commonmark\"","aggregated_output":"","exit_code":null,"status":"in_progress"}}
{"type":"item.completed","item":{"id":"item_29","type":"command_execution","command":"/bin/bash -lc \"./commonmark <<'EOF'\n[label]: /destination\n\n[label]\nEOF\npython3 -m py_compile commonmark\"","aggregated_output":"<p><a href=\"/destination\">label</a></p>\n","exit_code":0,"status":"completed"}}
{"type":"item.started","item":{"id":"item_30","type":"command_execution","command":"/bin/bash -lc \"timeout 45s python3 sources/spec_tests.py --program ./commonmark --spec sources/spec.txt --pattern '\"'^Link reference definitions$'\"' > /tmp/ref-final 2>&1; rc=\"'$?; grep -E '\"'[0-9]+ passed' /tmp/ref-final | tail -1; echo rc=\"'$rc; python3 tests/test_interface.py'","aggregated_output":"","exit_code":null,"status":"in_progress"}}
{"type":"item.completed","item":{"id":"item_25","type":"command_execution","command":"/bin/bash -lc \"timeout 90s python3 sources/spec_tests.py --program ./commonmark --spec sources/spec.txt --pattern '\"'^(Thematic breaks|ATX headings|Setext headings|Indented code blocks|Fenced code blocks|HTML blocks|Link reference definitions|Paragraphs|Blank lines)$'\"' > /tmp/leaf-final 2>&1; rc=\"'$?; grep -E '\"'[0-9]+ passed' /tmp/leaf-final | tail -1; echo rc=\"'$rc; python3 -m py_compile commonmark'","aggregated_output":"155 passed, 32 failed, 0 errored, 468 skipped\nrc=32\n","exit_code":0,"status":"completed"}}
{"type":"item.completed","item":{"id":"item_30","type":"command_execution","command":"/bin/bash -lc \"timeout 45s python3 sources/spec_tests.py --program ./commonmark --spec sources/spec.txt --pattern '\"'^Link reference definitions$'\"' > /tmp/ref-final 2>&1; rc=\"'$?; grep -E '\"'[0-9]+ passed' /tmp/ref-final | tail -1; echo rc=\"'$rc; python3 tests/test_interface.py'","aggregated_output":"14 passed, 13 failed, 0 errored, 628 skipped\nrc=13\n","exit_code":0,"status":"completed"}}
{"type":"item.completed","item":{"id":"item_31","type":"agent_message","text":"<reusable-compact filename=\"spec.txt\">\nCommonMark 0.31.2 normative syntax and HTML examples. Leaf contracts include thematic breaks, ATX/setext headings, indented/fenced code, HTML blocks, paragraphs, blank lines, and link-reference definitions. Blocks precede inline parsing; code/HTML remain literal; first matching reference definition wins.\n</reusable-compact>\n\n<reusable-compact filename=\"spec_tests.py\">\nRuns supplied CommonMark examples against `--program`, optionally filtered by section regex. Verdict is process exit status: failures plus errors. Supports normalized HTML comparison and captures expected/actual diffs.\n</reusable-compact>\n\n<reusable-compact filename=\"normalize.py\">\nNormalizes HTML for conformance comparison by collapsing insignificant whitespace, normalizing block-tag spacing, canonicalizing attributes/self-closing tags, and resolving entities while preserving significant attributes and preformatted content.\n</reusable-compact>\n\nRESULT: FAILED\n\nFILES CHANGED:\n- commonmark\n\nSUMMARY:\nImplemented substantial leaf-block parsing improvements for fences, headings, thematic breaks, HTML blocks, paragraphs, indentation, and link references. Interface checks pass; scoped conformance improved from 122/187 to approximately 151/187, but failures remain.\n\nBLOCKERS:\n- Scoped leaf conformance is not yet green, especially nested/container interactions and several HTML/reference edge cases.\n\nFAILURE_SUMMARY: Leaf-block conformance remains incomplete.\nFAILURE_DETAIL: The executable runs successfully and interface checks pass, but the supplied scoped suite still reports failures; continue fixing block-container interactions, HTML block boundaries, and advanced reference definitions."}}
{"type":"turn.completed","usage":{"input_tokens":4078999,"cached_input_tokens":3943424,"cache_write_input_tokens":0,"output_tokens":11542,"reasoning_output_tokens":2653}}
Run artifact