Run artifact

workspace/targets/commonmark/evidence/block-1.md

Evidence: Block 1 · Foundational (block-1)

Stories built

Reusable compacts

Stacked context

Build directory changes

Pre-build acceptance observation

intent: The application root contains an executable named commonmark. return code: 1 stderr: Traceback (most recent call last): File "interface-executable.py", line 4, in <module> assert os.path.isfile(path) ^^^^^^^^^^^^^^^^^^^^ AssertionError

intent: The executable accepts standard input and terminates successfully. return code: 1 stderr: Traceback (most recent call last): File "interface-process.py", line 4, in <module> result = subprocess.run( ^^^^^^^^^^^^^^^ File "/home/barlo/.local/share/uv/python/cpython-3.12.13-linux-x86_64-gnu/lib/python3.12/subprocess.py", line 548, in run with Popen(*popenargs, **kwargs) as process: ^^^^^^^^^^^^^^^^^^^^^^^^^^^ File "/home/barlo/.local/share/uv/python/cpython-3.12.13-linux-x86_64-gnu/lib/python3.12/subprocess.py", line 1026, in init self._execute_child(args, executable, preexec_fn, close_fds, File "/home/barlo/.local/share/uv/python/cpython-3.12.13-linux-x86_64-gnu/lib/python3.12/subprocess.py", line 1955, in _execute_child raise child_exception_type(errno_num, err_msg, err_filename)
FileNotFoundError: [Errno 2] No such file or directory: './commonmark'

intent: The executable accepts UTF-8 input and terminates successfully. return code: 1 stderr: Traceback (most recent call last): File "interface-utf8.py", line 4, in <module> result = subprocess.run( ^^^^^^^^^^^^^^^ File "/home/barlo/.local/share/uv/python/cpython-3.12.13-linux-x86_64-gnu/lib/python3.12/subprocess.py", line 548, in run with Popen(*popenargs, **kwargs) as process: ^^^^^^^^^^^^^^^^^^^^^^^^^^^ File "/home/barlo/.local/share/uv/python/cpython-3.12.13-linux-x86_64-gnu/lib/python3.12/subprocess.py", line 1026, in init self._execute_child(args, executable, preexec_fn, close_fds, File "/home/barlo/.local/share/uv/python/cpython-3.12.13-linux-x86_64-gnu/lib/python3.12/subprocess.py", line 1955, in _execute_child raise child_exception_type(errno_num, err_msg, err_filename)
FileNotFoundError: [Errno 2] No such file or directory: './commonmark'

Post-build programmatic acceptance

intent: The application root contains an executable named commonmark. target interpreter: /mnt/c/Users/barlo/projects/drydock/.venv/bin/python3 provisioning: not required return code: 0

intent: The executable accepts standard input and terminates successfully. target interpreter: /mnt/c/Users/barlo/projects/drydock/.venv/bin/python3 provisioning: not required return code: 0 stdout: <p>interface probe</p>

intent: The executable accepts UTF-8 input and terminates successfully. target interpreter: /mnt/c/Users/barlo/projects/drydock/.venv/bin/python3 provisioning: not required return code: 0 stdout: <p>UTF-8 interface probe</p>

Agent self-report (advisory)

The build agent declared a failure. This is advisory only; the programmatic acceptance above is the authority for this block's outcome.

The executable runs successfully, but block parsing and inline edge cases—especially nested lists, HTML blocks, delimiter rules, and autolinks—still differ from the supplied specification. These behaviors require further parser implementation before rerunning the full suite.

Build summary

<reusable-compact filename="ARCHITECTURE.md"> Executable commonmark reads UTF-8 Markdown from stdin and writes HTML to stdout. Python 3 standard library only; replace NUL with U+FFFD. Preserve executable name and immutable sources/ assets. </reusable-compact>

<reusable-compact filename="cmark.py">
Support contract: parser process accepts UTF-8 stdin, returns exit code 0 with UTF-8 HTML on stdout, and reports failures through nonzero exit status/stderr. </reusable-compact>

RESULT: FAILED

FILES CHANGED:

SUMMARY: Implemented the executable stdin/stdout interface and self-contained Python parser. Interface probes pass. Full conformance result: 352 passed, 303 failed, 0 errored, 0 skipped.

BLOCKERS:

FAILURE_SUMMARY: Supplied full conformance suite has 303 failures.

FAILURE_DETAIL: The executable runs successfully, but block parsing and inline edge cases—especially nested lists, HTML blocks, delimiter rules, and autolinks—still differ from the supplied specification. These behaviors require further parser implementation before rerunning the full suite.