RESULT: FAILED FILES CHANGED: - jq_interpreter/evaluator.py SUMMARY: - Fixed optional slicing, recursive function closures, parameter binding, pattern initialization, numeric handling, and several runtime diagnostics. - Project tests pass: 32 passed. - PARSE-003 remains failing: 386 passed, 69 failed, 0 errored. - PARSE-004 remains incomplete; prior run showed 175 passed, 36 failed, 0 errored. BLOCKERS: - Scoped conformance still has substantial evaluator/path-assignment failures requiring further implementation. FAILURE_SUMMARY: Scoped conformance assertions remain red. FAILURE_DETAIL: The implementation improved but did not satisfy both declared acceptance criteria; continue repairing path assignment, deletion, control evaluation, and remaining runtime semantics.