{"type":"thread.started","thread_id":"01a02b14-d884-79d3-928e-aa6ccb5c9181"}
{"type":"turn.started"}
{"type":"item.completed","item":{"id":"item_0","type":"agent_message","text":"I’m inspecting the existing build directory first, then I’ll implement the parser/evaluator surface that is actually present and run the two declared scoped conformance checks."}}
{"type":"item.started","item":{"id":"item_1","type":"command_execution","command":"/bin/bash -lc \"pwd && rg --files -g '\"'!sources/**'\"' -g '\"'!*.pyc'\"' | sort && printf '\\\\nSources:\\\\n' && rg --files sources | sort | head -20\"","aggregated_output":"","exit_code":null,"status":"in_progress"}}
{"type":"item.completed","item":{"id":"item_1","type":"command_execution","command":"/bin/bash -lc \"pwd && rg --files -g '\"'!sources/**'\"' -g '\"'!*.pyc'\"' | sort && printf '\\\\nSources:\\\\n' && rg --files sources | sort | head -20\"","aggregated_output":"sources/builtin.jq\nsources/exclusions.txt\nsources/full_test.sh\nsources/jq-manual.txt\nsources/jq.test\nsources/lexer.l\nsources/parser.y\nsources/run_conformance.py\n","exit_code":0,"status":"completed"}}
{"type":"item.started","item":{"id":"item_2","type":"command_execution","command":"/bin/bash -lc \"sed -n '1,240p' jq_interpreter/ast.py; sed -n '1,280p' jq_interpreter/parser.py; sed -n '1,220p' jq_interpreter/lexer.py; sed -n '1,180p' jq_interpreter/interpreter.py; sed -n '1,140p' jq_interpreter/evaluator.py\"","aggregated_output":"","exit_code":null,"status":"in_progress"}}
{"type":"item.completed","item":{"id":"item_2","type":"command_execution","command":"/bin/bash -lc \"sed -n '1,240p' jq_interpreter/ast.py; sed -n '1,280p' jq_interpreter/parser.py; sed -n '1,220p' jq_interpreter/lexer.py; sed -n '1,180p' jq_interpreter/interpreter.py; sed -n '1,140p' jq_interpreter/evaluator.py\"","aggregated_output":"\"\"\"Syntax tree types shared by the lexer, parser, and evaluator.\"\"\"\n\nfrom dataclasses import dataclass\n\n\n@dataclass(frozen=True)\nclass Filter:\n    \"\"\"Base type for compiled jq filters.\"\"\"\n\n\n@dataclass(frozen=True)\nclass Identity(Filter):\n    \"\"\"The ``.`` filter, yielding its input unchanged.\"\"\"\n\n\n@dataclass(frozen=True)\nclass Iterate(Filter):\n    \"\"\"The ``.[]`` filter, yielding array or object members in order.\"\"\"\n\n\n@dataclass(frozen=True)\nclass Literal(Filter):\n    \"\"\"A JSON literal filter.\"\"\"\n\n    value: object\n\n\n@dataclass(frozen=True)\nclass Comma(Filter):\n    \"\"\"Concatenate the output streams of two filters.\"\"\"\n\n    left: Filter\n    right: Filter\n\n\n@dataclass(frozen=True)\nclass Raise(Filter):\n    \"\"\"Raise a jq runtime error when evaluated.\"\"\"\n\n    message: str = \"error\"\n\n\n@dataclass(frozen=True)\nclass Array(Filter):\n    \"\"\"Collect a filter's generated values into an array.\"\"\"\n\n    expression: Filter\n\n\n@dataclass(frozen=True)\nclass Limit(Filter):\n    \"\"\"Keep at most ``count`` values from a filter stream.\"\"\"\n\n    count: int\n    expression: Filter\n\n@dataclass(frozen=True)\nclass Pipe(Filter):\n    left: Filter\n    right: Filter\n\n@dataclass(frozen=True)\nclass StringTemplate(Filter):\n    parts: tuple[str | Filter, ...]\n\n@dataclass(frozen=True)\nclass Format(Filter):\n    name: str\n    template: StringTemplate | None = None\n\n@dataclass(frozen=True)\nclass Add(Filter):\n    left: Filter\n    right: Filter\n\"\"\"Parser boundary: source tokens become an immutable intermediate form.\"\"\"\n\nimport json\nimport re\n\nfrom .ast import Add, Array, Comma, Filter, Format, Identity, Iterate, Limit, Literal, Pipe, Raise, StringTemplate\nfrom .errors import CompileError\nfrom .lexer import tokenize\n\n\ndef parse(source: str) -> Filter:\n    \"\"\"Compile source into a filter or raise :class:`CompileError`.\"\"\"\n    tokenize(source)\n    text = _without_comments(source).strip()\n    if not text:\n        raise CompileError(\"empty program\")\n    if text.startswith(\"(\") and text.endswith(\")\") and _matching_outer_parens(text):\n        return parse(text[1:-1])\n    if text == \".\":\n        return Identity()\n    if text == \".[]\":\n        return Iterate()\n    if text == \"error\":\n        return Raise()\n    pipe = _top_level_separator(text, \"|\")\n    if pipe is not None:\n        return Pipe(parse(text[:pipe]), parse(text[pipe + 1:]))\n    if text.startswith(\"@\"):\n        match = re.fullmatch(r\"@([A-Za-z_][A-Za-z_0-9]*)(?:\\s+(.*))?\", text, re.DOTALL)\n        if match:\n            return Format(match.group(1), _parse_template(match.group(2)) if match.group(2) else None)\n    if text.startswith(\"strflocaltime(\") and text.endswith(\")\"):\n        return parse(text[len(\"strflocaltime(\"):-1])\n    plus = _top_level_separator(text, \"+\")\n    if plus is not None:\n        return Add(parse(text[:plus]), parse(text[plus + 1:]))\n    if text.startswith(\"[\") and text.endswith(\"]\"):\n        return Array(parse(text[1:-1]))\n    if text.startswith(\"limit(\") and text.endswith(\")\"):\n        body = text[6:-1]\n        separator = _top_level_separator(body, \";\")\n        if separator is not None:\n            count_text, expression = body[:separator], body[separator + 1 :]\n            if count_text.strip().isdigit():\n                return Limit(int(count_text.strip()), parse(expression))\n    comma = _top_level_comma(text)\n    if comma is not None:\n        return Comma(parse(text[:comma]), parse(text[comma + 1 :]))\n    if text in {\"nan\", \"infinite\", \"-infinite\", \"-nan\"}:\n        return Literal({\"nan\": float(\"nan\"), \"infinite\": float(\"inf\"),\n                        \"-infinite\": float(\"-inf\"), \"-nan\": float(\"nan\")}[text])\n    if text.startswith('\"') and text.endswith('\"'):\n        return _parse_template(text)\n    if re.fullmatch(r\"(?:-?(?:0|[1-9]\\d*)(?:\\.\\d+)?(?:[eE][+-]?\\d+)?)|true|false|null\", text):\n        try:\n            return Literal(json.loads(text))\n        except json.JSONDecodeError as error:\n            raise CompileError(f\"invalid literal: {error.msg}\") from error\n    raise CompileError(\"unsupported program in foundational parser\")\n\ndef _parse_template(text: str) -> StringTemplate:\n    if not text or text[0] != '\"' or text[-1] != '\"': raise CompileError(\"invalid string\")\n    parts: list[str | Filter] = []\n    start = position = 1\n    while position < len(text) - 1:\n        if text[position:position + 2] == \"\\\\(\":\n            if start < position: parts.append(json.loads('\"' + text[start:position] + '\"'))\n            end = _matching_paren(text, position + 1)\n            parts.append(parse(text[position + 2:end]))\n            position = end + 1; start = position\n        else: position += 1\n    if start < len(text) - 1: parts.append(json.loads('\"' + text[start:-1] + '\"'))\n    return StringTemplate(tuple(parts))\n\ndef _matching_paren(text: str, opening: int) -> int:\n    depth = 0; quoted = escaped = False\n    for position in range(opening + 1, len(text)):\n        character = text[position]\n        if quoted:\n            if escaped: escaped = False\n            elif character == \"\\\\\": escaped = True\n            elif character == '\"': quoted = False\n        elif character == '\"': quoted = True\n        elif character == \"(\": depth += 1\n        elif character == \")\":\n            if depth == 0: return position\n            depth -= 1\n    raise CompileError(\"unterminated interpolation\")\n\ndef _matching_outer_parens(text: str) -> bool:\n    depth = 0; quoted = escaped = False\n    for position, character in enumerate(text):\n        if quoted:\n            if escaped: escaped = False\n            elif character == \"\\\\\": escaped = True\n            elif character == '\"': quoted = False\n        elif character == '\"': quoted = True\n        elif character == \"(\": depth += 1\n        elif character == \")\":\n            depth -= 1\n            if depth == 0: return position == len(text) - 1\n    return False\n\n\ndef _without_comments(source: str) -> str:\n    \"\"\"Remove comments while preserving hashes inside JSON strings.\"\"\"\n    result: list[str] = []\n    quoted = False\n    escaped = False\n    in_comment = False\n    for character in source:\n        if in_comment:\n            if character == \"\\n\":\n                in_comment = False\n                result.append(character)\n            continue\n        if quoted:\n            result.append(character)\n            if escaped:\n                escaped = False\n            elif character == \"\\\\\":\n                escaped = True\n            elif character == '\"':\n                quoted = False\n        elif character == '\"':\n            quoted = True\n            result.append(character)\n        elif character == '#':\n            in_comment = True\n            result.append('\\n')\n        else:\n            result.append(character)\n    return \"\".join(result)\n\n\ndef _top_level_comma(text: str) -> int | None:\n    return _top_level_separator(text, \",\")\n\n\ndef _top_level_separator(text: str, separator: str) -> int | None:\n    depth = 0\n    quoted = False\n    escaped = False\n    for position, character in enumerate(text):\n        if quoted:\n            if escaped:\n                escaped = False\n            elif character == \"\\\\\":\n                escaped = True\n            elif character == '\"':\n                quoted = False\n        elif character == '\"':\n            quoted = True\n        elif character in \"[{(\":\n            depth += 1\n        elif character in \"]})\":\n            depth -= 1\n        elif character == separator and depth == 0:\n            return position\n    if quoted or depth != 0:\n        raise CompileError(\"incomplete program\")\n    return None\n\"\"\"Lexical scanner for jq source text.\"\"\"\n\nfrom dataclasses import dataclass\nfrom enum import Enum, auto\nimport re\n\nfrom .errors import CompileError\n\n\nclass TokenKind(Enum):\n    IDENTIFIER = auto()\n    NUMBER = auto()\n    STRING = auto()\n    FIELD = auto()\n    BINDING = auto()\n    FORMAT = auto()\n    KEYWORD = auto()\n    OPERATOR = auto()\n    DELIMITER = auto()\n    INTERPOLATION_START = auto()\n    INTERPOLATION_END = auto()\n    END = auto()\n    IDENTITY = auto()\n\n\n@dataclass(frozen=True)\nclass Token:\n    kind: TokenKind\n    text: str\n    position: int\n\n\n_KEYWORDS = {\"as\", \"def\", \"module\", \"import\", \"include\", \"if\", \"then\", \"else\", \"elif\", \"and\", \"or\", \"end\", \"reduce\", \"foreach\", \"try\", \"catch\", \"label\", \"break\"}\n_OPERATORS = (\"//=\", \"?//\", \"!=\", \"==\", \"|=\", \"+=\", \"-=\", \"*=\", \"/=\", \"%=\", \"<=\", \">=\", \"..\", \"//\")\n_DELIMITERS = set(\".?!=;,,:|+-*/%$<>{}[]()\")\n_NUMBER = re.compile(r\"(?:[0-9]+(?:\\.[0-9]*)?|\\.[0-9]+)(?:[eE][+-]?[0-9]+)?\")\n_NAME = re.compile(r\"[A-Za-z_][A-Za-z_0-9]*\")\n_QUALIFIED_NAME = re.compile(r\"(?:[A-Za-z_][A-Za-z_0-9]*::)*[A-Za-z_][A-Za-z_0-9]*\")\n\n\ndef _error(source: str, position: int, message: str) -> CompileError:\n    line = source.count(\"\\n\", 0, position) + 1\n    line_start = source.rfind(\"\\n\", 0, position) + 1\n    return CompileError(f\"{message} at line {line}, column {position - line_start + 1}\")\n\n\ndef _scan_string(source: str, start: int) -> tuple[list[Token], int]:\n    tokens = [Token(TokenKind.STRING, '\"', start)]\n    position = start + 1\n    text_start = position\n    while position < len(source):\n        character = source[position]\n        if character == \"\\\\\":\n            if position + 1 >= len(source):\n                raise _error(source, position, \"unterminated string\")\n            if source[position + 1] == \"(\":\n                if text_start < position:\n                    tokens.append(Token(TokenKind.STRING, source[text_start:position], text_start))\n                tokens.append(Token(TokenKind.INTERPOLATION_START, \"\\\\(\", position))\n                expression_start = position + 2\n                cursor = expression_start\n                depth = 1\n                quoted_expression = False\n                escaped_expression = False\n                while cursor < len(source):\n                    current = source[cursor]\n                    if quoted_expression:\n                        if escaped_expression:\n                            escaped_expression = False\n                        elif current == \"\\\\\":\n                            escaped_expression = True\n                        elif current == '\"':\n                            quoted_expression = False\n                    elif current == '\"':\n                        quoted_expression = True\n                    elif current == \"(\":\n                        depth += 1\n                    elif current == \")\":\n                        depth -= 1\n                        if depth == 0:\n                            inner = tokenize(source[expression_start:cursor])\n                            tokens.extend(inner[:-1])\n                            tokens.append(Token(TokenKind.INTERPOLATION_END, \")\", cursor))\n                            position = cursor + 1\n                            text_start = position\n                            break\n                    cursor += 1\n                else:\n                    raise _error(source, position, \"unterminated interpolation\")\n                continue\n            if source[position + 1] == \"u\":\n                escape = source[position + 2:position + 6]\n                if len(escape) != 4 or not re.fullmatch(r\"[0-9A-Fa-f]{4}\", escape):\n                    raise _error(source, position, \"invalid unicode escape\")\n                position += 6\n            else:\n                if source[position + 1] not in '\"\\\\/bfnrt':\n                    raise _error(source, position, \"invalid escape\")\n                position += 2\n            continue\n        if character == '\"':\n            if text_start < position:\n                tokens.append(Token(TokenKind.STRING, source[text_start:position], text_start))\n            tokens.append(Token(TokenKind.STRING, '\"', position))\n            return tokens, position + 1\n        if ord(character) < 0x20:\n            raise _error(source, position, \"control character in string\")\n        position += 1\n    raise _error(source, start, \"unterminated string\")\n\n\ndef tokenize(source: str) -> list[Token]:\n    \"\"\"Tokenize jq source, retaining offsets and rejecting lexical errors.\"\"\"\n    tokens: list[Token] = []\n    position = 0\n    while position < len(source):\n        character = source[position]\n        if character.isspace():\n            position += 1\n            continue\n        if character == \"#\":\n            newline = source.find(\"\\n\", position)\n            position = len(source) if newline < 0 else newline + 1\n            continue\n        if character == '\"':\n            string_tokens, position = _scan_string(source, position)\n            tokens.extend(string_tokens)\n            continue\n        number = _NUMBER.match(source, position)\n        if number:\n            tokens.append(Token(TokenKind.NUMBER, number.group(), position))\n            position = number.end()\n            continue\n        if character == \".\" and position + 1 < len(source) and source[position + 1].isalpha():\n            name = _NAME.match(source, position + 1)\n            assert name is not None\n            tokens.append(Token(TokenKind.FIELD, source[position:name.end()], position))\n            position = name.end()\n            continue\n        if character == \"$\":\n            name = _QUALIFIED_NAME.match(source, position + 1)\n            if not name:\n                raise _error(source, position, \"invalid binding\")\n            tokens.append(Token(TokenKind.BINDING, source[position:name.end()], position))\n            position = name.end()\n            continue\n        if character == \"@\":\n            name = _NAME.match(source, position + 1)\n            if not name:\n                raise _error(source, position, \"invalid format\")\n            tokens.append(Token(TokenKind.FORMAT, source[position:name.end()], position))\n            position = name.end()\n            continue\n        qualified = _QUALIFIED_NAME.match(source, position)\n        if qualified:\n            text = qualified.group()\n            kind = TokenKind.KEYWORD if text in _KEYWORDS else TokenKind.IDENTIFIER\n            tokens.append(Token(kind, text, position))\n            position = qualified.end()\n            continue\n        operator = next((value for value in _OPERATORS if source.startswith(value, position)), None)\n        if operator:\n            tokens.append(Token(TokenKind.OPERATOR, operator, position))\n            position += len(operator)\n            continue\n        if character in _DELIMITERS:\n            kind = TokenKind.IDENTITY if character == \".\" else TokenKind.DELIMITER\n            tokens.append(Token(kind, character, position))\n            position += 1\n            continue\n        raise _error(source, position, \"unexpected character\")\n    tokens.append(Token(TokenKind.END, \"\", len(source)))\n    return tokens\n\"\"\"Application-facing interpreter orchestration.\"\"\"\n\nimport json\nfrom collections.abc import Iterable, Iterator\n\nfrom .evaluator import evaluate\nfrom .parser import parse\nfrom .runtime import JsonValue\n\n\nclass Interpreter:\n    \"\"\"Compile once, then evaluate each JSON input in order.\"\"\"\n\n    def __init__(self, program: str) -> None:\n        self._compiled = parse(program)\n\n    def run(self, inputs: Iterable[JsonValue]) -> Iterator[JsonValue]:\n        \"\"\"Yield every output, preserving input and generator ordering.\"\"\"\n        for value in inputs:\n            yield from evaluate(self._compiled, value)\n\n\ndef parse_input(line: str) -> JsonValue:\n    \"\"\"Decode one JSON input value.\"\"\"\n    return json.loads(line.lstrip(\"\\ufeff\"), parse_constant=_parse_json_constant)\n\n\ndef parse_inputs(text: str) -> Iterator[JsonValue]:\n    \"\"\"Decode every whitespace-separated JSON value in an input stream.\n\n    ``jq`` accepts JSON values separated by arbitrary whitespace, so a value may\n    span multiple physical lines.  ``raw_decode`` preserves the boundary\n    between successive values without requiring a non-standard JSON parser.\n    \"\"\"\n    decoder = json.JSONDecoder(parse_constant=_parse_json_constant)\n    position = 0\n    while True:\n        while position < len(text) and text[position].isspace():\n            position += 1\n        if position >= len(text):\n            return\n        if position == 0 and text.startswith(\"\\ufeff\"):\n            position += 1\n            continue\n        value, position = decoder.raw_decode(text, position)\n        yield value\n\n\ndef _parse_json_constant(value: str) -> float:\n    \"\"\"Decode jq's accepted non-standard numeric constants.\"\"\"\n    return {\"NaN\": float(\"nan\"), \"Infinity\": float(\"inf\"),\n            \"-Infinity\": float(\"-inf\")}[value]\n\"\"\"Ordered generator evaluator boundary.\"\"\"\n\nfrom .ast import Add, Array, Comma, Filter, Format, Identity, Iterate, Limit, Literal, Pipe, Raise, StringTemplate\nfrom .errors import RuntimeError\nfrom .runtime import JsonValue, ValueStream, identity_stream\n\n\ndef evaluate(program: Filter, value: JsonValue) -> ValueStream:\n    \"\"\"Evaluate one input as an ordered stream of output values.\"\"\"\n    if isinstance(program, Identity):\n        yield from identity_stream(value)\n        return\n    if isinstance(program, Iterate):\n        if isinstance(value, list):\n            yield from value\n        elif isinstance(value, dict):\n            yield from value.values()\n        else:\n            raise RuntimeError(\"cannot iterate over value\")\n        return\n    if isinstance(program, Literal):\n        yield program.value\n        return\n    if isinstance(program, Pipe):\n        for intermediate in evaluate(program.left, value): yield from evaluate(program.right, intermediate)\n        return\n    if isinstance(program, Add):\n        left = list(evaluate(program.left, value))\n        right = list(evaluate(program.right, value))\n        for first in left:\n            for second in right:\n                if isinstance(first, (int, float)) and isinstance(second, (int, float)):\n                    yield first + second\n                elif isinstance(first, str) and isinstance(second, str): yield first + second\n                elif first is None: yield second\n                elif second is None: yield first\n                else: raise RuntimeError(\"cannot add values\")\n        return\n    if isinstance(program, StringTemplate):\n        pieces: list[str] = []\n        for part in program.parts:\n            pieces.append(part if isinstance(part, str) else \"\".join(_stringify(x) for x in evaluate(part, value)))\n        yield \"\".join(pieces)\n        return\n    if isinstance(program, Format):\n        if program.template is None: yield _apply_format(program.name, value)\n        else:\n            pieces: list[str] = []\n            for part in program.template.parts:\n                if isinstance(part, str): pieces.append(part)\n                else:\n                    pieces.extend(_apply_format(program.name, item) for item in evaluate(part, value))\n            yield \"\".join(pieces)\n        return\n    if isinstance(program, Comma):\n        yield from evaluate(program.left, value)\n        yield from evaluate(program.right, value)\n        return\n    if isinstance(program, Raise):\n        raise RuntimeError(program.message)\n    if isinstance(program, Array):\n        yield list(evaluate(program.expression, value))\n        return\n    if isinstance(program, Limit):\n        outputs = iter(evaluate(program.expression, value))\n        for _ in range(program.count):\n            try:\n                yield next(outputs)\n            except StopIteration:\n                break\n        return\n    raise RuntimeError(\"unknown compiled filter\")\n\ndef _stringify(value: object) -> str:\n    import json\n    return value if isinstance(value, str) else json.dumps(value, separators=(\",\", \":\"), ensure_ascii=False, allow_nan=False)\n\ndef _apply_format(name: str, value: object, template: bool = False) -> str:\n    import base64, html, json, urllib.parse\n    if name == \"text\": return _stringify(value)\n    if name == \"json\": return json.dumps(value, separators=(\",\", \":\"), ensure_ascii=False)\n    if name == \"html\": return html.escape(_stringify(value), quote=True).replace(\"&#x27;\", \"&apos;\")\n    if name == \"uri\": return urllib.parse.quote(_stringify(value), safe=\"-_.~\")\n    if name == \"urid\": return urllib.parse.unquote(_stringify(value))\n    if name == \"base64\": return base64.b64encode(_stringify(value).encode()).decode()\n    if name == \"base64d\": return base64.b64decode(_stringify(value)).decode()\n    if name == \"csv\": return \",\".join('\"' + str(x).replace('\"', '\"\"') + '\"' if isinstance(x, str) else _stringify(x) for x in value)\n    if name == \"tsv\": return \"\\t\".join(_stringify(x).replace(\"\\\\\", \"\\\\\\\\\").replace(\"\\n\", \"\\\\n\").replace(\"\\r\", \"\\\\r\").replace(\"\\t\", \"\\\\t\") for x in value)\n    if name == \"sh\": return \"'\" + _stringify(value).replace(\"'\", \"'\\\\''\") + \"'\"\n    raise RuntimeError(f\"unknown format @{name}\")\n","exit_code":0,"status":"completed"}}
{"type":"item.started","item":{"id":"item_3","type":"command_execution","command":"/bin/bash -lc \"sed -n '1,220p' jq_interpreter/cli.py; sed -n '1,260p' tests/test_parse_002.py; sed -n '1,200p' tests/test_lexer.py; sed -n '1,160p' jq_interpreter/paths.py; sed -n '1,160p' jq_interpreter/builtins.py\"","aggregated_output":"","exit_code":null,"status":"in_progress"}}
{"type":"item.completed","item":{"id":"item_3","type":"command_execution","command":"/bin/bash -lc \"sed -n '1,220p' jq_interpreter/cli.py; sed -n '1,260p' tests/test_parse_002.py; sed -n '1,200p' tests/test_lexer.py; sed -n '1,160p' jq_interpreter/paths.py; sed -n '1,160p' jq_interpreter/builtins.py\"","aggregated_output":"\"\"\"Executable boundary for ``jq -c '<program>'``.\"\"\"\n\nimport argparse\nimport json\nimport math\nimport sys\nfrom collections.abc import Iterator\n\nfrom .diagnostics import report_compile_error, report_runtime_error\nfrom .errors import CompileError, RuntimeError\nfrom .interpreter import Interpreter, parse_inputs\n\n\ndef _inputs() -> Iterator[object]:\n    yield from parse_inputs(sys.stdin.read())\n\n\ndef _json_output(value: object) -> object:\n    \"\"\"Convert jq's non-finite numbers to its JSON output representation.\n\n    jq represents NaN and infinities as ``null`` when emitting JSON.  Doing this\n    recursively also covers values nested in arrays and objects.\n    \"\"\"\n    if isinstance(value, float) and not math.isfinite(value):\n        return None\n    if isinstance(value, list):\n        return [_json_output(item) for item in value]\n    if isinstance(value, dict):\n        return {key: _json_output(item) for key, item in value.items()}\n    return value\n\n\ndef main(argv: list[str] | None = None) -> int:\n    arguments = argparse.ArgumentParser(prog=\"jq\")\n    arguments.add_argument(\"-c\", action=\"store_true\")\n    arguments.add_argument(\"program\")\n    options = arguments.parse_args(argv)\n    try:\n        interpreter = Interpreter(options.program)\n    except CompileError as error:\n        return report_compile_error(error)\n    try:\n        for output in interpreter.run(_inputs()):\n            print(\n                json.dumps(_json_output(output), separators=(\",\", \":\"), ensure_ascii=False),\n                flush=True,\n            )\n    except (RuntimeError, ValueError, TypeError, json.JSONDecodeError) as error:\n        return report_runtime_error(RuntimeError(str(error)))\n    return 0\nimport json\nimport subprocess\nfrom pathlib import Path\n\nimport pytest\n\nfrom jq_interpreter.errors import CompileError\nfrom jq_interpreter.parser import parse\n\n\nROOT = Path(__file__).parents[1]\n\n\ndef run(program: str, value: object) -> subprocess.CompletedProcess[str]:\n    return subprocess.run(\n        [str(ROOT / \"jq\"), \"-c\", program],\n        input=json.dumps(value) + \"\\n\",\n        text=True,\n        capture_output=True,\n        check=False,\n    )\n\n\ndef test_unicode_json_escapes_are_decoded() -> None:\n    result = run(r'\"Aa\\r\\n\\t\\b\\f\\u03bc\"', None)\n    assert result.returncode == 0\n    assert json.loads(result.stdout) == \"Aa\\r\\n\\t\\b\\fμ\"\n\n\ndef test_interpolation_uses_filter_output() -> None:\n    result = run(r'\"inter\\(\"pol\" + \"ation\")\"', None)\n    assert result.returncode == 0\n    assert json.loads(result.stdout) == \"interpolation\"\n\n\n@pytest.mark.parametrize(\n    (\"program\", \"value\", \"expected\"),\n    [\n        (\"@uri\", \"μ\", \"%CE%BC\"),\n        (\"@base64\", \"foóbar\\n\", \"Zm/Ds2Jhcgo=\"),\n        ('@html \"<b>\\\\(.)</b>\"', \"<script>hax</script>\", \"<b>&lt;script&gt;hax&lt;/script&gt;</b>\"),\n    ],\n)\ndef test_format_literals(program: str, value: object, expected: str) -> None:\n    result = run(program, value)\n    assert result.returncode == 0\n    assert json.loads(result.stdout) == expected\n\n\ndef test_invalid_escape_is_compile_failure() -> None:\n    with pytest.raises(CompileError):\n        parse(r'\"u\\vw\"')\n\nimport pytest\n\nfrom jq_interpreter.errors import CompileError\nfrom jq_interpreter.lexer import TokenKind, tokenize\n\n\ndef test_scans_literals_keywords_and_operators_in_source_order() -> None:\n    tokens = tokenize('def f($x): .foo == 1; $x // null')\n    assert [token.kind for token in tokens[:-1]] == [\n        TokenKind.KEYWORD, TokenKind.IDENTIFIER, TokenKind.DELIMITER,\n        TokenKind.BINDING, TokenKind.DELIMITER, TokenKind.DELIMITER,\n        TokenKind.FIELD, TokenKind.OPERATOR, TokenKind.NUMBER,\n        TokenKind.DELIMITER, TokenKind.BINDING, TokenKind.OPERATOR,\n        TokenKind.IDENTIFIER,\n    ]\n    assert [token.position for token in tokens[:3]] == [0, 4, 5]\n    assert tokens[-1].kind is TokenKind.END\n\n\ndef test_scans_comments_and_json_string_escapes() -> None:\n    tokens = tokenize('1 # ignored\\n \"a\\\\n#b\"')\n    assert [token.text for token in tokens[:-1]] == [\"1\", '\"', r\"a\\n#b\", '\"']\n\n\ndef test_scans_formats_and_qualified_bindings() -> None:\n    tokens = tokenize('@json $module::value .field')\n    assert [(token.kind, token.text) for token in tokens[:-1]] == [\n        (TokenKind.FORMAT, \"@json\"),\n        (TokenKind.BINDING, \"$module::value\"),\n        (TokenKind.FIELD, \".field\"),\n    ]\n\n\n@pytest.mark.parametrize(\"source\", ['\"bad\\\\q\"', '\"unterminated'])\ndef test_rejects_invalid_lexical_source(source: str) -> None:\n    with pytest.raises(CompileError):\n        tokenize(source)\n\"\"\"Immutable path discovery and update boundary.\"\"\"\n\nfrom dataclasses import dataclass\n\nfrom .runtime import JsonValue\n\n\n@dataclass(frozen=True)\nclass Path:\n    \"\"\"A path into a JSON value, represented as immutable components.\"\"\"\n\n    components: tuple[str | int, ...] = ()\n\n\ndef get_path(value: JsonValue, path: Path) -> JsonValue:\n    \"\"\"Read a path without mutating the input value.\"\"\"\n    current = value\n    for component in path.components:\n        current = current[component]  # type: ignore[index]\n    return current\n\"\"\"Builtin filter ownership boundary.\n\nLanguage-specific builtin definitions will be added here; the evaluator depends on\nthis module rather than embedding standard-library filters in process code.\n\"\"\"\n\n","exit_code":0,"status":"completed"}}
{"type":"item.completed","item":{"id":"item_4","type":"agent_message","text":"The repository already has a foundational lexer/parser/evaluator, but the parser only recognizes a small handful of expressions. I’m extending that existing architecture in place with a general AST node, precedence-aware parsing, accessors/collections/operators, and declaration/control nodes so the CLI keeps its existing compile/runtime exit contract."}}
{"type":"item.started","item":{"id":"item_5","type":"file_change","changes":[{"path":"/mnt/c/Users/barlo/projects/drydock/uat/jq/runs/20260822.044627/build/jq/jq_interpreter/ast.py","kind":"update"}],"status":"in_progress"}}
{"type":"item.completed","item":{"id":"item_5","type":"file_change","changes":[{"path":"/mnt/c/Users/barlo/projects/drydock/uat/jq/runs/20260822.044627/build/jq/jq_interpreter/ast.py","kind":"update"}],"status":"completed"}}
{"type":"item.started","item":{"id":"item_6","type":"file_change","changes":[{"path":"/mnt/c/Users/barlo/projects/drydock/uat/jq/runs/20260822.044627/build/jq/jq_interpreter/parser.py","kind":"delete"}],"status":"in_progress"}}
{"type":"item.completed","item":{"id":"item_6","type":"file_change","changes":[{"path":"/mnt/c/Users/barlo/projects/drydock/uat/jq/runs/20260822.044627/build/jq/jq_interpreter/parser.py","kind":"delete"}],"status":"completed"}}
{"type":"item.started","item":{"id":"item_7","type":"file_change","changes":[{"path":"/mnt/c/Users/barlo/projects/drydock/uat/jq/runs/20260822.044627/build/jq/jq_interpreter/parser.py","kind":"add"}],"status":"in_progress"}}
{"type":"item.completed","item":{"id":"item_7","type":"file_change","changes":[{"path":"/mnt/c/Users/barlo/projects/drydock/uat/jq/runs/20260822.044627/build/jq/jq_interpreter/parser.py","kind":"add"}],"status":"completed"}}
{"type":"item.started","item":{"id":"item_8","type":"file_change","changes":[{"path":"/mnt/c/Users/barlo/projects/drydock/uat/jq/runs/20260822.044627/build/jq/jq_interpreter/evaluator.py","kind":"update"}],"status":"in_progress"}}
{"type":"item.completed","item":{"id":"item_8","type":"file_change","changes":[{"path":"/mnt/c/Users/barlo/projects/drydock/uat/jq/runs/20260822.044627/build/jq/jq_interpreter/evaluator.py","kind":"update"}],"status":"completed"}}
{"type":"item.started","item":{"id":"item_9","type":"file_change","changes":[{"path":"/mnt/c/Users/barlo/projects/drydock/uat/jq/runs/20260822.044627/build/jq/jq_interpreter/evaluator.py","kind":"update"}],"status":"in_progress"}}
{"type":"item.completed","item":{"id":"item_9","type":"file_change","changes":[{"path":"/mnt/c/Users/barlo/projects/drydock/uat/jq/runs/20260822.044627/build/jq/jq_interpreter/evaluator.py","kind":"update"}],"status":"completed"}}
{"type":"item.started","item":{"id":"item_10","type":"command_execution","command":"/bin/bash -lc 'pytest -q'","aggregated_output":"","exit_code":null,"status":"in_progress"}}
{"type":"item.completed","item":{"id":"item_10","type":"command_execution","command":"/bin/bash -lc 'pytest -q'","aggregated_output":"F..F.......F...............FFFF.                                         [100%]\n=================================== FAILURES ===================================\n______________ ArchitectureTests.test_compile_failure_is_distinct ______________\n\nself = <test_architecture.ArchitectureTests testMethod=test_compile_failure_is_distinct>\n\n    def test_compile_failure_is_distinct(self) -> None:\n>       with self.assertRaises(CompileError):\nE       AssertionError: CompileError not raised\n\ntests/test_architecture.py:66: AssertionError\n_________ ArchitectureTests.test_executable_reports_compile_exit_three _________\n\nself = <test_architecture.ArchitectureTests testMethod=test_executable_reports_compile_exit_three>\n\n    def test_executable_reports_compile_exit_three(self) -> None:\n        result = subprocess.run(\n            [sys.executable, str(EXECUTABLE), \"-c\", \"x\"],\n            capture_output=True,\n            text=True,\n            check=False,\n        )\n>       self.assertEqual(result.returncode, 3)\nE       AssertionError: 0 != 3\n\ntests/test_architecture.py:95: AssertionError\n___ ArchitectureTests.test_special_numeric_literals_are_emitted_as_json_null ___\n\nself = <test_architecture.ArchitectureTests testMethod=test_special_numeric_literals_are_emitted_as_json_null>\n\n    def test_special_numeric_literals_are_emitted_as_json_null(self) -> None:\n        result = subprocess.run(\n            [sys.executable, str(EXECUTABLE), \"-c\", \"nan, infinite\"],\n            input=\"null\\n\",\n            capture_output=True,\n            text=True,\n            check=False,\n        )\n>       self.assertEqual(result.returncode, 0)\nE       AssertionError: 5 != 0\n\ntests/test_architecture.py:47: AssertionError\n____________________ test_interpolation_uses_filter_output _____________________\n\n    def test_interpolation_uses_filter_output() -> None:\n        result = run(r'\"inter\\(\"pol\" + \"ation\")\"', None)\n>       assert result.returncode == 0\nE       assert 3 == 0\nE        +  where 3 = CompletedProcess(args=['/mnt/c/Users/barlo/projects/drydock/uat/jq/runs/20260822.044627/build/jq/jq', '-c', '\"inter\\\\(\"pol\" + \"ation\")\"'], returncode=3, stdout='', stderr='jq: compile error: unexpected token\\n').returncode\n\ntests/test_parse_002.py:32: AssertionError\n___________________ test_format_literals[@uri-\\u03bc-%CE%BC] ___________________\n\nprogram = '@uri', value = 'μ', expected = '%CE%BC'\n\n    @pytest.mark.parametrize(\n        (\"program\", \"value\", \"expected\"),\n        [\n            (\"@uri\", \"μ\", \"%CE%BC\"),\n            (\"@base64\", \"foóbar\\n\", \"Zm/Ds2Jhcgo=\"),\n            ('@html \"<b>\\\\(.)</b>\"', \"<script>hax</script>\", \"<b>&lt;script&gt;hax&lt;/script&gt;</b>\"),\n        ],\n    )\n    def test_format_literals(program: str, value: object, expected: str) -> None:\n        result = run(program, value)\n        assert result.returncode == 0\n>       assert json.loads(result.stdout) == expected\n\ntests/test_parse_002.py:47: \n_ _ _ _ _ _ _ _ _ _ _ _ _ _ _ _ _ _ _ _ _ _ _ _ _ _ _ _ _ _ _ _ _ _ _ _ _ _ _ _ \n/usr/lib/python3.10/json/__init__.py:346: in loads\n    return _default_decoder.decode(s)\n/usr/lib/python3.10/json/decoder.py:337: in decode\n    obj, end = self.raw_decode(s, idx=_w(s, 0).end())\n_ _ _ _ _ _ _ _ _ _ _ _ _ _ _ _ _ _ _ _ _ _ _ _ _ _ _ _ _ _ _ _ _ _ _ _ _ _ _ _ \n\nself = <json.decoder.JSONDecoder object at 0x767bbd0ce8f0>, s = '', idx = 0\n\n    def raw_decode(self, s, idx=0):\n        \"\"\"Decode a JSON document from ``s`` (a ``str`` beginning with\n        a JSON document) and return a 2-tuple of the Python\n        representation and the index in ``s`` where the document ended.\n    \n        This can be used to decode a JSON document from a string that may\n        have extraneous data at the end.\n    \n        \"\"\"\n        try:\n            obj, end = self.scan_once(s, idx)\n        except StopIteration as err:\n>           raise JSONDecodeError(\"Expecting value\", s, err.value) from None\nE           json.decoder.JSONDecodeError: Expecting value: line 1 column 1 (char 0)\n\n/usr/lib/python3.10/json/decoder.py:355: JSONDecodeError\n____________ test_format_literals[@base64-fo\\xf3bar\\n-Zm/Ds2Jhcgo=] ____________\n\nprogram = '@base64', value = 'foóbar\\n', expected = 'Zm/Ds2Jhcgo='\n\n    @pytest.mark.parametrize(\n        (\"program\", \"value\", \"expected\"),\n        [\n            (\"@uri\", \"μ\", \"%CE%BC\"),\n            (\"@base64\", \"foóbar\\n\", \"Zm/Ds2Jhcgo=\"),\n            ('@html \"<b>\\\\(.)</b>\"', \"<script>hax</script>\", \"<b>&lt;script&gt;hax&lt;/script&gt;</b>\"),\n        ],\n    )\n    def test_format_literals(program: str, value: object, expected: str) -> None:\n        result = run(program, value)\n        assert result.returncode == 0\n>       assert json.loads(result.stdout) == expected\n\ntests/test_parse_002.py:47: \n_ _ _ _ _ _ _ _ _ _ _ _ _ _ _ _ _ _ _ _ _ _ _ _ _ _ _ _ _ _ _ _ _ _ _ _ _ _ _ _ \n/usr/lib/python3.10/json/__init__.py:346: in loads\n    return _default_decoder.decode(s)\n/usr/lib/python3.10/json/decoder.py:337: in decode\n    obj, end = self.raw_decode(s, idx=_w(s, 0).end())\n_ _ _ _ _ _ _ _ _ _ _ _ _ _ _ _ _ _ _ _ _ _ _ _ _ _ _ _ _ _ _ _ _ _ _ _ _ _ _ _ \n\nself = <json.decoder.JSONDecoder object at 0x767bbd0ce8f0>, s = '', idx = 0\n\n    def raw_decode(self, s, idx=0):\n        \"\"\"Decode a JSON document from ``s`` (a ``str`` beginning with\n        a JSON document) and return a 2-tuple of the Python\n        representation and the index in ``s`` where the document ended.\n    \n        This can be used to decode a JSON document from a string that may\n        have extraneous data at the end.\n    \n        \"\"\"\n        try:\n            obj, end = self.scan_once(s, idx)\n        except StopIteration as err:\n>           raise JSONDecodeError(\"Expecting value\", s, err.value) from None\nE           json.decoder.JSONDecodeError: Expecting value: line 1 column 1 (char 0)\n\n/usr/lib/python3.10/json/decoder.py:355: JSONDecodeError\n_ test_format_literals[@html \"<b>\\\\(.)</b>\"-<script>hax</script>-<b>&lt;script&gt;hax&lt;/script&gt;</b>] _\n\nprogram = '@html \"<b>\\\\(.)</b>\"', value = '<script>hax</script>'\nexpected = '<b>&lt;script&gt;hax&lt;/script&gt;</b>'\n\n    @pytest.mark.parametrize(\n        (\"program\", \"value\", \"expected\"),\n        [\n            (\"@uri\", \"μ\", \"%CE%BC\"),\n            (\"@base64\", \"foóbar\\n\", \"Zm/Ds2Jhcgo=\"),\n            ('@html \"<b>\\\\(.)</b>\"', \"<script>hax</script>\", \"<b>&lt;script&gt;hax&lt;/script&gt;</b>\"),\n        ],\n    )\n    def test_format_literals(program: str, value: object, expected: str) -> None:\n        result = run(program, value)\n>       assert result.returncode == 0\nE       assert 3 == 0\nE        +  where 3 = CompletedProcess(args=['/mnt/c/Users/barlo/projects/drydock/uat/jq/runs/20260822.044627/build/jq/jq', '-c', '@html \"<b>\\\\(.)</b>\"'], returncode=3, stdout='', stderr='jq: compile error: unexpected token\\n').returncode\n\ntests/test_parse_002.py:46: AssertionError\n=========================== short test summary info ============================\nFAILED tests/test_architecture.py::ArchitectureTests::test_compile_failure_is_distinct\nFAILED tests/test_architecture.py::ArchitectureTests::test_executable_reports_compile_exit_three\nFAILED tests/test_architecture.py::ArchitectureTests::test_special_numeric_literals_are_emitted_as_json_null\nFAILED tests/test_parse_002.py::test_interpolation_uses_filter_output - asser...\nFAILED tests/test_parse_002.py::test_format_literals[@uri-\\u03bc-%CE%BC] - js...\nFAILED tests/test_parse_002.py::test_format_literals[@base64-fo\\xf3bar\\n-Zm/Ds2Jhcgo=]\nFAILED tests/test_parse_002.py::test_format_literals[@html \"<b>\\\\(.)</b>\"-<script>hax</script>-<b>&lt;script&gt;hax&lt;/script&gt;</b>]\n7 failed, 25 passed in 6.89s\n","exit_code":1,"status":"failed"}}
{"type":"item.started","item":{"id":"item_11","type":"command_execution","command":"/bin/bash -lc \"sed -n '1,120p' tests/test_architecture.py\"","aggregated_output":"","exit_code":null,"status":"in_progress"}}
{"type":"item.completed","item":{"id":"item_11","type":"command_execution","command":"/bin/bash -lc \"sed -n '1,120p' tests/test_architecture.py\"","aggregated_output":"\"\"\"Boundary tests for the foundational interpreter architecture.\"\"\"\n\nimport json\nimport subprocess\nimport sys\nimport unittest\nfrom pathlib import Path\n\nfrom jq_interpreter import CompileError, Interpreter, MODULE_BOUNDARIES\nfrom jq_interpreter.architecture import COMPILE_EXIT, RUNTIME_EXIT\nfrom jq_interpreter.runtime import EvaluationContext\nfrom jq_interpreter.paths import Path as JsonPath, get_path\n\nROOT = Path(__file__).parents[1]\nEXECUTABLE = ROOT / \"jq\"\n\n\nclass ArchitectureTests(unittest.TestCase):\n    def test_module_boundaries_name_each_foundational_subsystem(self) -> None:\n        modules = {boundary.module for boundary in MODULE_BOUNDARIES}\n        self.assertTrue({\n            \"jq\",\n            \"jq_interpreter.lexer\",\n            \"jq_interpreter.parser\",\n            \"jq_interpreter.evaluator\",\n            \"jq_interpreter.runtime\",\n            \"jq_interpreter.builtins\",\n        } <= modules)\n\n    def test_each_input_gets_isolated_evaluation_context(self) -> None:\n        first = EvaluationContext()\n        second = EvaluationContext()\n        first.bindings[\"answer\"] = 42\n        self.assertEqual(second.bindings, {})\n\n    def test_diagnostics_use_declared_process_exit_contract(self) -> None:\n        self.assertEqual((COMPILE_EXIT, RUNTIME_EXIT), (3, 5))\n\n    def test_special_numeric_literals_are_emitted_as_json_null(self) -> None:\n        result = subprocess.run(\n            [sys.executable, str(EXECUTABLE), \"-c\", \"nan, infinite\"],\n            input=\"null\\n\",\n            capture_output=True,\n            text=True,\n            check=False,\n        )\n        self.assertEqual(result.returncode, 0)\n        self.assertEqual(result.stdout.splitlines(), [\"null\", \"null\"])\n\n    def test_unicode_is_decoded_and_compactly_reencoded(self) -> None:\n        result = subprocess.run(\n            [sys.executable, str(EXECUTABLE), \"-c\", \".\"],\n            input='\"\\\\u03bc\"\\n',\n            capture_output=True,\n            text=True,\n            check=False,\n        )\n        self.assertEqual(result.returncode, 0)\n        self.assertEqual(json.loads(result.stdout), \"μ\")\n\n    def test_identity_preserves_order_and_multiplicity(self) -> None:\n        outputs = list(Interpreter(\".\").run([1, 2, 2]))\n        self.assertEqual(outputs, [1, 2, 2])\n\n    def test_compile_failure_is_distinct(self) -> None:\n        with self.assertRaises(CompileError):\n            Interpreter(\"not-a-filter\")\n\n    def test_path_read_does_not_mutate_value(self) -> None:\n        value = {\"nested\": {\"answer\": 42}}\n        self.assertEqual(get_path(value, JsonPath((\"nested\", \"answer\"))), 42)\n        self.assertEqual(value, {\"nested\": {\"answer\": 42}})\n\n    def test_executable_streams_compact_json_lines(self) -> None:\n        result = subprocess.run(\n            [sys.executable, str(EXECUTABLE), \"-c\", \".\"],\n            input='{\"a\": 1}\\n[2, 3]\\n',\n            capture_output=True,\n            text=True,\n            check=False,\n        )\n        self.assertEqual(result.returncode, 0)\n        self.assertEqual(\n            [json.loads(line) for line in result.stdout.splitlines()],\n            [{\"a\": 1}, [2, 3]],\n        )\n\n    def test_executable_reports_compile_exit_three(self) -> None:\n        result = subprocess.run(\n            [sys.executable, str(EXECUTABLE), \"-c\", \"x\"],\n            capture_output=True,\n            text=True,\n            check=False,\n        )\n        self.assertEqual(result.returncode, 3)\n\n    def test_executable_reports_runtime_exit_five(self) -> None:\n        result = subprocess.run(\n            [sys.executable, str(EXECUTABLE), \"-c\", \"error\"],\n            input=\"null\\n\",\n            capture_output=True,\n            text=True,\n            check=False,\n        )\n        self.assertEqual(result.returncode, 5)\n        self.assertNotEqual(result.stderr, \"\")\n\n    def test_runtime_failure_keeps_prior_generator_output(self) -> None:\n        result = subprocess.run(\n            [sys.executable, str(EXECUTABLE), \"-c\", \"1, error\"],\n            input=\"null\\n\",\n            capture_output=True,\n            text=True,\n            check=False,\n        )\n        self.assertEqual(result.returncode, 5)\n        self.assertEqual(result.stdout.splitlines(), [\"1\"])\n        self.assertNotEqual(result.stderr, \"\")\n\n    def test_runtime_diagnostic_is_not_written_to_stdout(self) -> None:\n","exit_code":0,"status":"completed"}}
{"type":"item.started","item":{"id":"item_12","type":"command_execution","command":"/bin/bash -lc \"rg -n 'literal|format|def parse' jq_interpreter/evaluator.py jq_interpreter/parser.py | head -20\"","aggregated_output":"","exit_code":null,"status":"in_progress"}}
{"type":"item.completed","item":{"id":"item_12","type":"command_execution","command":"/bin/bash -lc \"rg -n 'literal|format|def parse' jq_interpreter/evaluator.py jq_interpreter/parser.py | head -20\"","aggregated_output":"jq_interpreter/evaluator.py:51:        if program.template is None: yield _apply_format(program.name, value)\njq_interpreter/evaluator.py:57:                    pieces.extend(_apply_format(program.name, item) for item in evaluate(part, value))\njq_interpreter/evaluator.py:82:    elif op == \"literal\":\njq_interpreter/evaluator.py:181:def _apply_format(name: str, value: object, template: bool = False) -> str:\njq_interpreter/evaluator.py:193:    raise RuntimeError(f\"unknown format @{name}\")\njq_interpreter/parser.py:41:            if not m: raise CompileError(\"invalid format\")\njq_interpreter/parser.py:54:    def parse(self):\njq_interpreter/parser.py:78:        if t.startswith('@'): self.take(); return self.post(Node('format',(t[1:],)))\njq_interpreter/parser.py:80:        if t in ('true','false','null','nan','infinite','-infinite','-nan') or re.fullmatch(r'(?:[0-9]+(?:\\.[0-9]*)?|\\.[0-9]+)(?:[eE][+-]?[0-9]+)?',t): return self.post(Node('literal',(t,)))\njq_interpreter/parser.py:111:        self.take('if'); c=self.expr(0); self.take('then'); a=self.expr(0); b=Node('literal',('null',))\njq_interpreter/parser.py:136:def parse(source: str) -> Filter:\n","exit_code":0,"status":"completed"}}
{"type":"item.started","item":{"id":"item_13","type":"command_execution","command":"/bin/bash -lc \"sed -n '78,96p' jq_interpreter/evaluator.py; sed -n '134,145p' jq_interpreter/parser.py\"","aggregated_output":"","exit_code":null,"status":"in_progress"}}
{"type":"item.completed","item":{"id":"item_13","type":"command_execution","command":"/bin/bash -lc \"sed -n '78,96p' jq_interpreter/evaluator.py; sed -n '134,145p' jq_interpreter/parser.py\"","aggregated_output":"\ndef _node(node: Node, value: object, env: dict[str, object]) -> ValueStream:\n    op, a = node.operation, node.arguments\n    if op == \"identity\": yield value\n    elif op == \"literal\":\n        text=a[0]; yield {\"true\":True,\"false\":False,\"null\":None,\"nan\":float(\"nan\"),\"infinite\":float(\"inf\"),\"-infinite\":float(\"-inf\"),\"-nan\":float(\"nan\")}.get(text, json.loads(text))\n    elif op == \"string\": yield _decode_string(a[0], value, env)\n    elif op == \"var\":\n        if a[0] not in env: raise RuntimeError(f\"variable ${a[0]} is not defined\")\n        yield env[a[0]]\n    elif op == \"field\": yield _index(value, a[0])\n    elif op == \"index\":\n        for base in _node(a[0],value,env): yield _index(base,a[1])\n    elif op == \"iterate\":\n        for base in _node(a[0],value,env):\n            if isinstance(base,dict): yield from base.values()\n            elif isinstance(base,list): yield from base\n            else: raise RuntimeError(\"cannot iterate over value\")\n    elif op in (\"indexexpr\",\"slice\"):\n        return Node('unsupported',(w,))\n\ndef parse(source: str) -> Filter:\n    tokenize(source)\n    return Parser(source).parse()\n","exit_code":0,"status":"completed"}}
{"type":"item.started","item":{"id":"item_14","type":"file_change","changes":[{"path":"/mnt/c/Users/barlo/projects/drydock/uat/jq/runs/20260822.044627/build/jq/jq_interpreter/evaluator.py","kind":"update"},{"path":"/mnt/c/Users/barlo/projects/drydock/uat/jq/runs/20260822.044627/build/jq/jq_interpreter/parser.py","kind":"update"}],"status":"in_progress"}}
{"type":"item.completed","item":{"id":"item_14","type":"file_change","changes":[{"path":"/mnt/c/Users/barlo/projects/drydock/uat/jq/runs/20260822.044627/build/jq/jq_interpreter/evaluator.py","kind":"update"},{"path":"/mnt/c/Users/barlo/projects/drydock/uat/jq/runs/20260822.044627/build/jq/jq_interpreter/parser.py","kind":"update"}],"status":"completed"}}
{"type":"item.started","item":{"id":"item_15","type":"file_change","changes":[{"path":"/mnt/c/Users/barlo/projects/drydock/uat/jq/runs/20260822.044627/build/jq/jq_interpreter/evaluator.py","kind":"update"},{"path":"/mnt/c/Users/barlo/projects/drydock/uat/jq/runs/20260822.044627/build/jq/jq_interpreter/parser.py","kind":"update"}],"status":"in_progress"}}
{"type":"item.completed","item":{"id":"item_15","type":"file_change","changes":[{"path":"/mnt/c/Users/barlo/projects/drydock/uat/jq/runs/20260822.044627/build/jq/jq_interpreter/evaluator.py","kind":"update"},{"path":"/mnt/c/Users/barlo/projects/drydock/uat/jq/runs/20260822.044627/build/jq/jq_interpreter/parser.py","kind":"update"}],"status":"completed"}}
{"type":"item.started","item":{"id":"item_16","type":"command_execution","command":"/bin/bash -lc 'pytest -q'","aggregated_output":"","exit_code":null,"status":"in_progress"}}
{"type":"item.completed","item":{"id":"item_16","type":"command_execution","command":"/bin/bash -lc 'pytest -q'","aggregated_output":"F..........................F..F.                                         [100%]\n=================================== FAILURES ===================================\n______________ ArchitectureTests.test_compile_failure_is_distinct ______________\n\nself = <test_architecture.ArchitectureTests testMethod=test_compile_failure_is_distinct>\n\n    def test_compile_failure_is_distinct(self) -> None:\n>       with self.assertRaises(CompileError):\nE       AssertionError: CompileError not raised\n\ntests/test_architecture.py:66: AssertionError\n____________________ test_interpolation_uses_filter_output _____________________\n\n    def test_interpolation_uses_filter_output() -> None:\n        result = run(r'\"inter\\(\"pol\" + \"ation\")\"', None)\n>       assert result.returncode == 0\nE       assert 3 == 0\nE        +  where 3 = CompletedProcess(args=['/mnt/c/Users/barlo/projects/drydock/uat/jq/runs/20260822.044627/build/jq/jq', '-c', '\"inter\\\\(\"pol\" + \"ation\")\"'], returncode=3, stdout='', stderr='jq: compile error: unexpected token\\n').returncode\n\ntests/test_parse_002.py:32: AssertionError\n_ test_format_literals[@html \"<b>\\\\(.)</b>\"-<script>hax</script>-<b>&lt;script&gt;hax&lt;/script&gt;</b>] _\n\nprogram = '@html \"<b>\\\\(.)</b>\"', value = '<script>hax</script>'\nexpected = '<b>&lt;script&gt;hax&lt;/script&gt;</b>'\n\n    @pytest.mark.parametrize(\n        (\"program\", \"value\", \"expected\"),\n        [\n            (\"@uri\", \"μ\", \"%CE%BC\"),\n            (\"@base64\", \"foóbar\\n\", \"Zm/Ds2Jhcgo=\"),\n            ('@html \"<b>\\\\(.)</b>\"', \"<script>hax</script>\", \"<b>&lt;script&gt;hax&lt;/script&gt;</b>\"),\n        ],\n    )\n    def test_format_literals(program: str, value: object, expected: str) -> None:\n        result = run(program, value)\n        assert result.returncode == 0\n>       assert json.loads(result.stdout) == expected\nE       AssertionError: assert '&lt;script&g...t;/script&gt;' == '<b>&lt;scrip...cript&gt;</b>'\nE         \nE         - <b>&lt;script&gt;hax&lt;/script&gt;</b>\nE         ? ---                                ----\nE         + &lt;script&gt;hax&lt;/script&gt;\n\ntests/test_parse_002.py:47: AssertionError\n=========================== short test summary info ============================\nFAILED tests/test_architecture.py::ArchitectureTests::test_compile_failure_is_distinct\nFAILED tests/test_parse_002.py::test_interpolation_uses_filter_output - asser...\nFAILED tests/test_parse_002.py::test_format_literals[@html \"<b>\\\\(.)</b>\"-<script>hax</script>-<b>&lt;script&gt;hax&lt;/script&gt;</b>]\n3 failed, 29 passed in 5.28s\n","exit_code":1,"status":"failed"}}
{"type":"item.started","item":{"id":"item_17","type":"file_change","changes":[{"path":"/mnt/c/Users/barlo/projects/drydock/uat/jq/runs/20260822.044627/build/jq/jq_interpreter/parser.py","kind":"update"}],"status":"in_progress"}}
{"type":"item.completed","item":{"id":"item_17","type":"file_change","changes":[{"path":"/mnt/c/Users/barlo/projects/drydock/uat/jq/runs/20260822.044627/build/jq/jq_interpreter/parser.py","kind":"update"}],"status":"completed"}}
{"type":"item.started","item":{"id":"item_18","type":"command_execution","command":"/bin/bash -lc \"pytest -q && python3 sources/run_conformance.py --select '\\\\\\\\.|\\\\\\\\[|\\\\\\\\{|\\\\\\\\+|\\\\\\\\-|\\\\\\\\*|/|%' --json\"","aggregated_output":"","exit_code":null,"status":"in_progress"}}
{"type":"item.completed","item":{"id":"item_18","type":"command_execution","command":"/bin/bash -lc \"pytest -q && python3 sources/run_conformance.py --select '\\\\\\\\.|\\\\\\\\[|\\\\\\\\{|\\\\\\\\+|\\\\\\\\-|\\\\\\\\*|/|%' --json\"","aggregated_output":"................................                                         [100%]\n32 passed in 4.77s\nTraceback (most recent call last):\n  File \"/mnt/c/Users/barlo/projects/drydock/uat/jq/runs/20260822.044627/build/jq/sources/run_conformance.py\", line 455, in <module>\n    raise SystemExit(main())\n                     ^^^^^^\n  File \"/mnt/c/Users/barlo/projects/drydock/uat/jq/runs/20260822.044627/build/jq/sources/run_conformance.py\", line 372, in main\n    return _run(args)\n           ^^^^^^^^^^\n  File \"/mnt/c/Users/barlo/projects/drydock/uat/jq/runs/20260822.044627/build/jq/sources/run_conformance.py\", line 385, in _run\n    selector = re.compile(args.select) if args.select else None\n               ^^^^^^^^^^^^^^^^^^^^^^^\n  File \"/home/barlo/.local/share/uv/python/cpython-3.12.13-linux-x86_64-gnu/lib/python3.12/re/__init__.py\", line 228, in compile\n    return _compile(pattern, flags)\n           ^^^^^^^^^^^^^^^^^^^^^^^^\n  File \"/home/barlo/.local/share/uv/python/cpython-3.12.13-linux-x86_64-gnu/lib/python3.12/re/__init__.py\", line 307, in _compile\n    p = _compiler.compile(pattern, flags)\n        ^^^^^^^^^^^^^^^^^^^^^^^^^^^^^^^^^\n  File \"/home/barlo/.local/share/uv/python/cpython-3.12.13-linux-x86_64-gnu/lib/python3.12/re/_compiler.py\", line 750, in compile\n    p = _parser.parse(p, flags)\n        ^^^^^^^^^^^^^^^^^^^^^^^\n  File \"/home/barlo/.local/share/uv/python/cpython-3.12.13-linux-x86_64-gnu/lib/python3.12/re/_parser.py\", line 979, in parse\n    p = _parse_sub(source, state, flags & SRE_FLAG_VERBOSE, 0)\n        ^^^^^^^^^^^^^^^^^^^^^^^^^^^^^^^^^^^^^^^^^^^^^^^^^^^^^^\n  File \"/home/barlo/.local/share/uv/python/cpython-3.12.13-linux-x86_64-gnu/lib/python3.12/re/_parser.py\", line 460, in _parse_sub\n    itemsappend(_parse(source, state, verbose, nested + 1,\n                ^^^^^^^^^^^^^^^^^^^^^^^^^^^^^^^^^^^^^^^^^^\n  File \"/home/barlo/.local/share/uv/python/cpython-3.12.13-linux-x86_64-gnu/lib/python3.12/re/_parser.py\", line 568, in _parse\n    raise source.error(\"unterminated character set\",\nre.error: unterminated character set at position 6\n","exit_code":1,"status":"failed"}}
{"type":"item.completed","item":{"id":"item_19","type":"agent_message","text":"The project’s own suite is green (32 tests). The first conformance invocation I typed was malformed by shell escaping, so I’m rerunning the exact acceptance selectors via a Python subprocess wrapper and will report their actual JSON tallies."}}
{"type":"item.started","item":{"id":"item_20","type":"command_execution","command":"/bin/bash -lc \"python3 - <<'PY'\nimport json, os, subprocess, sys\nfor selector in [r'\\\\.|\\\\[|\\\\{|\\\\+|\\\\-|\\\\*|/|%', r'%%FAIL|if |try |reduce |foreach |def | as |label |module|include']:\n    result=subprocess.run([sys.executable,'sources/run_conformance.py','--select',selector,'--json'],capture_output=True,text=True,env={**os.environ,'JQ':os.path.abspath('jq')})\n    print(json.dumps({'returncode':result.returncode,'report':json.loads(result.stdout)}))\nPY\"","aggregated_output":"","exit_code":null,"status":"in_progress"}}
{"type":"item.started","item":{"id":"item_21","type":"command_execution","command":"/bin/bash -lc \"python3 - <<'PY'\nimport os, subprocess, sys\nr=subprocess.run([sys.executable,'sources/run_conformance.py','--select',r'%%FAIL|if |try |reduce |foreach |def | as |label |module|include','--json'],capture_output=True,text=True,env={**os.environ,'JQ':os.path.abspath('jq')},timeout=120)\nprint(r.returncode); print(r.stdout); print(r.stderr[-2000:])\nPY\"","aggregated_output":"","exit_code":null,"status":"in_progress"}}
{"type":"item.started","item":{"id":"item_22","type":"command_execution","command":"/bin/bash -lc \"for p in '.' '1+1' '.foo' '[.[]]' 'if true then 1 else 2 end' 'def f: .+1; f'; do echo \\\"\"'$p\" | ./jq -c \"$p\" 2>&1 | head -2; done'","aggregated_output":"","exit_code":null,"status":"in_progress"}}
{"type":"item.completed","item":{"id":"item_22","type":"command_execution","command":"/bin/bash -lc \"for p in '.' '1+1' '.foo' '[.[]]' 'if true then 1 else 2 end' 'def f: .+1; f'; do echo \\\"\"'$p\" | ./jq -c \"$p\" 2>&1 | head -2; done'","aggregated_output":"jq: runtime error: Expecting value: line 1 column 1 (char 0)\n2\njq: runtime error: Expecting value: line 1 column 2 (char 1)\njq: runtime error: Expecting value: line 1 column 1 (char 0)\njq: runtime error: Expecting value: line 1 column 2 (char 1)\njq: runtime error: Expecting value: line 1 column 1 (char 0)\njq: compile error: unexpected token\n","exit_code":0,"status":"completed"}}
{"type":"item.started","item":{"id":"item_23","type":"command_execution","command":"/bin/bash -lc \"printf 'null\\\\n' | ./jq -c '1+1'; printf 'null\\\\n' | ./jq -c '.foo'; printf '[1,2]\\\\n' | ./jq -c '[.[]]'; printf 'null\\\\n' | ./jq -c 'if true then 1 else 2 end'; git diff --stat 2>/dev/null || true; git status --short 2>/dev/null || true\"","aggregated_output":"","exit_code":null,"status":"in_progress"}}
{"type":"item.completed","item":{"id":"item_23","type":"command_execution","command":"/bin/bash -lc \"printf 'null\\\\n' | ./jq -c '1+1'; printf 'null\\\\n' | ./jq -c '.foo'; printf '[1,2]\\\\n' | ./jq -c '[.[]]'; printf 'null\\\\n' | ./jq -c 'if true then 1 else 2 end'; git diff --stat 2>/dev/null || true; git status --short 2>/dev/null || true\"","aggregated_output":"2\njq: runtime error: cannot index value\n[1,2]\n1\n runs/20260822.044627/build/jq/jq                   |   16 +-\n .../build/jq/jq_interpreter/__init__.py            |    3 +-\n .../20260822.044627/build/jq/jq_interpreter/ast.py |   30 +\n .../20260822.044627/build/jq/jq_interpreter/cli.py |   11 +-\n .../build/jq/jq_interpreter/diagnostics.py         |    4 +-\n .../build/jq/jq_interpreter/evaluator.py           |  164 ++-\n .../build/jq/jq_interpreter/interpreter.py         |   23 +-\n .../build/jq/jq_interpreter/lexer.py               |  155 ++-\n .../build/jq/jq_interpreter/parser.py              |  216 ++--\n .../build/jq/jq_interpreter/runtime.py             |    8 +\n .../build/jq/tests/test_architecture.py            |   36 +-\n .../evidence/commands/04-plan.llm.log              |   94 --\n .../evidence/commands/04-plan.stdout.log           |   69 +-\n .../evidence/commands/05-plan-verify.stdout.log    |   23 +-\n .../commands/06-after-plan-build-status.stdout.log |  104 +-\n .../07-after-plan-target-status.stdout.log         |   42 +-\n .../08-after-plan-workspace-status.stdout.log      |    6 +-\n .../evidence/commands/10-initial-build-1.llm.log   |   29 -\n .../commands/10-initial-build-1.stderr.log         |    2 -\n .../commands/10-initial-build-1.stdout.log         |  134 +--\n .../11-after-initial-build-build-status.stderr.log |    0\n .../11-after-initial-build-build-status.stdout.log |  137 ---\n ...12-after-initial-build-target-status.stderr.log |    0\n ...12-after-initial-build-target-status.stdout.log |   44 -\n ...after-initial-build-workspace-status.stderr.log |    0\n ...after-initial-build-workspace-status.stdout.log |   16 -\n runs/20260822.044627/workspace/logs/history.jsonl  |    3 +\n .../workspace/targets/jq/DECISIONS.json            |   49 +-\n .../20260822.044627/workspace/targets/jq/ERRORS.md |   31 -\n .../workspace/targets/jq/MANIFEST.md               | 1079 +++++++++-----------\n .../workspace/targets/jq/METADATA.md               |    4 +-\n .../workspace/targets/jq/PROJECT_STATUS.jsonl      |    7 +-\n .../targets/jq/QuarterDeck/commanders_chair.html   |  103 +-\n .../workspace/targets/jq/STOP_NOW.md               |   13 -\n .../workspace/targets/jq/blueprint/ARCHITECTURE.md |  116 ++-\n .../targets/jq/blueprint/FEATURE-Accessors.md      |   65 --\n .../jq/blueprint/FEATURE-Arithmetic-Operators.md   |   55 -\n .../jq/blueprint/FEATURE-Assignment-Operators.md   |   48 -\n .../FEATURE-Boolean-and-Alternative-Operators.md   |   53 -\n .../jq/blueprint/FEATURE-Collection-Transforms.md  |   55 -\n .../jq/blueprint/FEATURE-Complete-Conformance.md   |   48 -\n .../jq/blueprint/FEATURE-Complex-Assignments.md    |   57 --\n .../targets/jq/blueprint/FEATURE-Composition.md    |   79 --\n .../FEATURE-Conditionals-and-Exceptions.md         |   64 --\n .../jq/blueprint/FEATURE-Conformance-Assets.md     |   62 --\n .../targets/jq/blueprint/FEATURE-Date-and-Time.md  |   73 --\n .../jq/blueprint/FEATURE-Declaration-Parser.md     |   78 --\n .../targets/jq/blueprint/FEATURE-Destructuring.md  |   49 -\n .../targets/jq/blueprint/FEATURE-Diagnostics.md    |   66 --\n .../FEATURE-Error-and-Optional-Evaluation.md       |   79 --\n .../targets/jq/blueprint/FEATURE-Filter-Parser.md  |   71 --\n .../jq/blueprint/FEATURE-Function-Definitions.md   |   59 --\n .../jq/blueprint/FEATURE-Function-Parameters.md    |   60 --\n .../targets/jq/blueprint/FEATURE-Generator-Core.md |   58 --\n .../jq/blueprint/FEATURE-Index-and-Membership.md   |   51 -\n .../targets/jq/blueprint/FEATURE-Input-Streams.md  |   60 --\n .../jq/blueprint/FEATURE-Labels-and-Breaks.md      |   58 --\n .../targets/jq/blueprint/FEATURE-Lexer.md          |  111 --\n .../FEATURE-Object-and-Containment-Builtins.md     |   56 -\n .../targets/jq/blueprint/FEATURE-Output-Formats.md |   67 --\n .../targets/jq/blueprint/FEATURE-Path-Discovery.md |   57 --\n .../jq/blueprint/FEATURE-Path-Primitives.md        |   57 --\n .../jq/blueprint/FEATURE-Recursive-Generators.md   |   75 --\n .../FEATURE-Reductions-and-Iteration-Control.md    |   75 --\n .../jq/blueprint/FEATURE-Regular-Expressions.md    |   71 --\n .../jq/blueprint/FEATURE-Scoped-Conformance.md     |   81 --\n .../jq/blueprint/FEATURE-Slices-and-Iteration.md   |   72 --\n .../jq/blueprint/FEATURE-Sorting-and-Grouping.md   |   57 --\n .../targets/jq/blueprint/FEATURE-Streaming.md      |   79 --\n .../jq/blueprint/FEATURE-String-Builtins.md        |   58 --\n .../FEATURE-Strings-and-Interpolation-Parser.md    |   69 --\n .../blueprint/FEATURE-Truthiness-and-Comparison.md |   77 --\n .../blueprint/FEATURE-Type-and-Numeric-Builtins.md |   60 --\n .../targets/jq/blueprint/FEATURE-Value-Model.md    |   71 --\n .../jq/blueprint/FEATURE-Variable-Bindings.md      |   77 --\n .../workspace/targets/jq/evidence/block-1.md       |   68 +-\n .../workspace/targets/jq/evidence/block-2.md       |  145 +--\n .../workspace/targets/jq/evidence/block-3.md       |   87 +-\n .../workspace/targets/jq/evidence/block-4.md       |  146 +--\n .../targets/jq/evidence/prepassed-acceptance.json  |   14 +-\n 80 files changed, 1536 insertions(+), 4313 deletions(-)\n M jq\n M jq_interpreter/__init__.py\n M jq_interpreter/ast.py\n M jq_interpreter/cli.py\n M jq_interpreter/diagnostics.py\n M jq_interpreter/evaluator.py\n M jq_interpreter/interpreter.py\n M jq_interpreter/lexer.py\n M jq_interpreter/parser.py\n M jq_interpreter/runtime.py\n M tests/test_architecture.py\n D ../../evidence/commands/04-plan.llm.log\n M ../../evidence/commands/04-plan.stdout.log\n M ../../evidence/commands/05-plan-verify.stdout.log\n M ../../evidence/commands/06-after-plan-build-status.stdout.log\n M ../../evidence/commands/07-after-plan-target-status.stdout.log\n M ../../evidence/commands/08-after-plan-workspace-status.stdout.log\n D ../../evidence/commands/10-initial-build-1.llm.log\n M ../../evidence/commands/10-initial-build-1.stderr.log\n M ../../evidence/commands/10-initial-build-1.stdout.log\n D ../../evidence/commands/11-after-initial-build-build-status.stderr.log\n D ../../evidence/commands/11-after-initial-build-build-status.stdout.log\n D ../../evidence/commands/12-after-initial-build-target-status.stderr.log\n D ../../evidence/commands/12-after-initial-build-target-status.stdout.log\n D ../../evidence/commands/13-after-initial-build-workspace-status.stderr.log\n D ../../evidence/commands/13-after-initial-build-workspace-status.stdout.log\n M ../../workspace/logs/history.jsonl\n M ../../workspace/targets/jq/DECISIONS.json\n D ../../workspace/targets/jq/ERRORS.md\n M ../../workspace/targets/jq/MANIFEST.md\n M ../../workspace/targets/jq/METADATA.md\n M ../../workspace/targets/jq/PROJECT_STATUS.jsonl\n M ../../workspace/targets/jq/QuarterDeck/commanders_chair.html\n D ../../workspace/targets/jq/STOP_NOW.md\n M ../../workspace/targets/jq/blueprint/ARCHITECTURE.md\n D ../../workspace/targets/jq/blueprint/FEATURE-Accessors.md\n D ../../workspace/targets/jq/blueprint/FEATURE-Arithmetic-Operators.md\n D ../../workspace/targets/jq/blueprint/FEATURE-Assignment-Operators.md\n D ../../workspace/targets/jq/blueprint/FEATURE-Boolean-and-Alternative-Operators.md\n D ../../workspace/targets/jq/blueprint/FEATURE-Collection-Transforms.md\n D ../../workspace/targets/jq/blueprint/FEATURE-Complete-Conformance.md\n D ../../workspace/targets/jq/blueprint/FEATURE-Complex-Assignments.md\n D ../../workspace/targets/jq/blueprint/FEATURE-Composition.md\n D ../../workspace/targets/jq/blueprint/FEATURE-Conditionals-and-Exceptions.md\n D ../../workspace/targets/jq/blueprint/FEATURE-Conformance-Assets.md\n D ../../workspace/targets/jq/blueprint/FEATURE-Date-and-Time.md\n D ../../workspace/targets/jq/blueprint/FEATURE-Declaration-Parser.md\n D ../../workspace/targets/jq/blueprint/FEATURE-Destructuring.md\n D ../../workspace/targets/jq/blueprint/FEATURE-Diagnostics.md\n D ../../workspace/targets/jq/blueprint/FEATURE-Error-and-Optional-Evaluation.md\n D ../../workspace/targets/jq/blueprint/FEATURE-Filter-Parser.md\n D ../../workspace/targets/jq/blueprint/FEATURE-Function-Definitions.md\n D ../../workspace/targets/jq/blueprint/FEATURE-Function-Parameters.md\n D ../../workspace/targets/jq/blueprint/FEATURE-Generator-Core.md\n D ../../workspace/targets/jq/blueprint/FEATURE-Index-and-Membership.md\n D ../../workspace/targets/jq/blueprint/FEATURE-Input-Streams.md\n D ../../workspace/targets/jq/blueprint/FEATURE-Labels-and-Breaks.md\n D ../../workspace/targets/jq/blueprint/FEATURE-Lexer.md\n D ../../workspace/targets/jq/blueprint/FEATURE-Object-and-Containment-Builtins.md\n D ../../workspace/targets/jq/blueprint/FEATURE-Output-Formats.md\n D ../../workspace/targets/jq/blueprint/FEATURE-Path-Discovery.md\n D ../../workspace/targets/jq/blueprint/FEATURE-Path-Primitives.md\n D ../../workspace/targets/jq/blueprint/FEATURE-Recursive-Generators.md\n D ../../workspace/targets/jq/blueprint/FEATURE-Reductions-and-Iteration-Control.md\n D ../../workspace/targets/jq/blueprint/FEATURE-Regular-Expressions.md\n D ../../workspace/targets/jq/blueprint/FEATURE-Scoped-Conformance.md\n D ../../workspace/targets/jq/blueprint/FEATURE-Slices-and-Iteration.md\n D ../../workspace/targets/jq/blueprint/FEATURE-Sorting-and-Grouping.md\n D ../../workspace/targets/jq/blueprint/FEATURE-Streaming.md\n D ../../workspace/targets/jq/blueprint/FEATURE-String-Builtins.md\n D ../../workspace/targets/jq/blueprint/FEATURE-Strings-and-Interpolation-Parser.md\n D ../../workspace/targets/jq/blueprint/FEATURE-Truthiness-and-Comparison.md\n D ../../workspace/targets/jq/blueprint/FEATURE-Type-and-Numeric-Builtins.md\n D ../../workspace/targets/jq/blueprint/FEATURE-Value-Model.md\n D ../../workspace/targets/jq/blueprint/FEATURE-Variable-Bindings.md\n M ../../workspace/targets/jq/evidence/block-1.md\n M ../../workspace/targets/jq/evidence/block-2.md\n M ../../workspace/targets/jq/evidence/block-3.md\n M ../../workspace/targets/jq/evidence/block-4.md\n M ../../workspace/targets/jq/evidence/prepassed-acceptance.json\n?? jq_interpreter/architecture.py\n?? tests/conftest.py\n?? tests/test_conf_001_acceptance.py\n?? tests/test_json_io.py\n?? tests/test_lexer.py\n?? tests/test_parse_002.py\n?? ../../evidence/commands/superseded/20260822.193318/\n?? ../../workspace/logs/20260822.193319.568Z_jq_plan_codex.log\n?? ../../workspace/logs/20260822.193326.654Z_jq_plan_codex.llm.log\n?? ../../workspace/logs/20260822.193326.654Z_jq_plan_codex.output.txt\n?? ../../workspace/logs/20260822.193326.654Z_jq_plan_codex.prompt.md\n?? ../../workspace/logs/20260822.193326.654Z_jq_plan_codex.raw.jsonl\n?? ../../workspace/logs/20260822.193551.973Z_jq_plan_codex.llm.log\n?? ../../workspace/logs/20260822.193551.973Z_jq_plan_codex.output.txt\n?? ../../workspace/logs/20260822.193551.973Z_jq_plan_codex.prompt.md\n?? ../../workspace/logs/20260822.193551.973Z_jq_plan_codex.raw.jsonl\n?? ../../workspace/logs/20260822.193702.748Z_jq_plan_codex.llm.log\n?? ../../workspace/logs/20260822.193702.748Z_jq_plan_codex.output.txt\n?? ../../workspace/logs/20260822.193702.748Z_jq_plan_codex.prompt.md\n?? ../../workspace/logs/20260822.193702.748Z_jq_plan_codex.raw.jsonl\n?? ../../workspace/logs/20260822.193751.995Z_jq_plan_codex.llm.log\n?? ../../workspace/logs/20260822.193751.995Z_jq_plan_codex.output.txt\n?? ../../workspace/logs/20260822.193751.995Z_jq_plan_codex.prompt.md\n?? ../../workspace/logs/20260822.193751.995Z_jq_plan_codex.raw.jsonl\n?? ../../workspace/logs/20260822.193901.270Z_jq_plan_codex.llm.log\n?? ../../workspace/logs/20260822.193901.270Z_jq_plan_codex.output.txt\n?? ../../workspace/logs/20260822.193901.270Z_jq_plan_codex.prompt.md\n?? ../../workspace/logs/20260822.193901.270Z_jq_plan_codex.raw.jsonl\n?? ../../workspace/logs/20260822.193947.219Z_jq_plan_codex.llm.log\n?? ../../workspace/logs/20260822.193947.219Z_jq_plan_codex.output.txt\n?? ../../workspace/logs/20260822.193947.219Z_jq_plan_codex.prompt.md\n?? ../../workspace/logs/20260822.193947.219Z_jq_plan_codex.raw.jsonl\n?? ../../workspace/logs/20260822.194033.977Z_jq_plan_codex.llm.log\n?? ../../workspace/logs/20260822.194033.977Z_jq_plan_codex.output.txt\n?? ../../workspace/logs/20260822.194033.977Z_jq_plan_codex.prompt.md\n?? ../../workspace/logs/20260822.194033.977Z_jq_plan_codex.raw.jsonl\n?? ../../workspace/logs/20260822.194125.678Z_jq_plan_codex.llm.log\n?? ../../workspace/logs/20260822.194125.678Z_jq_plan_codex.output.txt\n?? ../../workspace/logs/20260822.194125.678Z_jq_plan_codex.prompt.md\n?? ../../workspace/logs/20260822.194125.678Z_jq_plan_codex.raw.jsonl\n?? ../../workspace/logs/20260822.194215.979Z_jq_plan_codex.llm.log\n?? ../../workspace/logs/20260822.194215.979Z_jq_plan_codex.output.txt\n?? ../../workspace/logs/20260822.194215.979Z_jq_plan_codex.prompt.md\n?? ../../workspace/logs/20260822.194215.979Z_jq_plan_codex.raw.jsonl\n?? ../../workspace/logs/20260822.194307.858Z_jq_plan_codex.llm.log\n?? ../../workspace/logs/20260822.194307.858Z_jq_plan_codex.output.txt\n?? ../../workspace/logs/20260822.194307.858Z_jq_plan_codex.prompt.md\n?? ../../workspace/logs/20260822.194307.858Z_jq_plan_codex.raw.jsonl\n?? ../../workspace/logs/20260822.194410.932Z_jq_plan_codex.llm.log\n?? ../../workspace/logs/20260822.194410.932Z_jq_plan_codex.output.txt\n?? ../../workspace/logs/20260822.194410.932Z_jq_plan_codex.prompt.md\n?? ../../workspace/logs/20260822.194410.932Z_jq_plan_codex.raw.jsonl\n?? ../../workspace/logs/20260822.194447.252Z_jq_plan_codex.llm.log\n?? ../../workspace/logs/20260822.194447.252Z_jq_plan_codex.output.txt\n?? ../../workspace/logs/20260822.194447.252Z_jq_plan_codex.prompt.md\n?? ../../workspace/logs/20260822.194447.252Z_jq_plan_codex.raw.jsonl\n?? ../../workspace/logs/20260822.194545.022Z_jq_plan_codex.llm.log\n?? ../../workspace/logs/20260822.194545.022Z_jq_plan_codex.output.txt\n?? ../../workspace/logs/20260822.194545.022Z_jq_plan_codex.prompt.md\n?? ../../workspace/logs/20260822.194545.022Z_jq_plan_codex.raw.jsonl\n?? ../../workspace/logs/20260822.194658.624Z_verify_plan_codex.log\n?? ../../workspace/logs/20260822.194704.870Z_jq_build.log\n?? ../../workspace/logs/20260822.194706.410Z_jq_status.log\n?? ../../workspace/logs/20260822.194709.861Z_status.log\n?? ../../workspace/logs/20260822.194711.292Z_jq_status.log\n?? ../../workspace/logs/20260822.194712.269Z_jq_build_codex.log\n?? ../../workspace/logs/20260822.194717.195Z_jq_build_codex.llm.log\n?? ../../workspace/logs/20260822.194717.195Z_jq_build_codex.output.txt\n?? ../../workspace/logs/20260822.194717.195Z_jq_build_codex.prompt.md\n?? ../../workspace/logs/20260822.194717.195Z_jq_build_codex.raw.jsonl\n?? ../../workspace/logs/20260822.194717.195Z_jq_build_codex.stderr.log\n?? ../../workspace/logs/20260822.194909.871Z_jq_build_codex.llm.log\n?? ../../workspace/logs/20260822.194909.871Z_jq_build_codex.output.txt\n?? ../../workspace/logs/20260822.194909.871Z_jq_build_codex.prompt.md\n?? ../../workspace/logs/20260822.194909.871Z_jq_build_codex.raw.jsonl\n?? ../../workspace/logs/20260822.195011.791Z_jq_build_codex.llm.log\n?? ../../workspace/logs/20260822.195011.791Z_jq_build_codex.output.txt\n?? ../../workspace/logs/20260822.195011.791Z_jq_build_codex.prompt.md\n?? ../../workspace/logs/20260822.195011.791Z_jq_build_codex.raw.jsonl\n?? ../../workspace/logs/20260822.195122.332Z_jq_build_codex.llm.log\n?? ../../workspace/logs/20260822.195122.332Z_jq_build_codex.output.txt\n?? ../../workspace/logs/20260822.195122.332Z_jq_build_codex.prompt.md\n?? ../../workspace/logs/20260822.195122.332Z_jq_build_codex.raw.jsonl\n?? ../../workspace/logs/20260822.195319.493Z_jq_build_codex.llm.log\n?? ../../workspace/logs/20260822.195319.493Z_jq_build_codex.output.txt\n?? ../../workspace/logs/20260822.195319.493Z_jq_build_codex.prompt.md\n?? ../../workspace/logs/20260822.195319.493Z_jq_build_codex.raw.jsonl\n?? ../../workspace/logs/20260822.195437.799Z_jq_build_codex.llm.log\n?? ../../workspace/logs/20260822.195437.799Z_jq_build_codex.output.txt\n?? ../../workspace/logs/20260822.195437.799Z_jq_build_codex.prompt.md\n?? ../../workspace/logs/20260822.195437.799Z_jq_build_codex.raw.jsonl\n?? ../../workspace/logs/20260822.195437.799Z_jq_build_codex.stderr.log\n?? ../../workspace/logs/20260822.195833.572Z_jq_build_codex.llm.log\n?? ../../workspace/logs/20260822.195833.572Z_jq_build_codex.output.txt\n?? ../../workspace/logs/20260822.195833.572Z_jq_build_codex.prompt.md\n?? ../../workspace/logs/20260822.195833.572Z_jq_build_codex.raw.jsonl\n?? ../../workspace/logs/20260822.195833.572Z_jq_build_codex.stderr.log\n?? ../../workspace/logs/20260822.200621.180Z_jq_build_codex.prompt.md\n?? ../../workspace/logs/20260822.200621.180Z_jq_build_codex.raw.jsonl\n?? ../../workspace/logs/20260822.200621.180Z_jq_build_codex.stderr.log\n?? ../../workspace/targets/jq/blueprint/FEATURE-CONF-001.md\n?? ../../workspace/targets/jq/blueprint/FEATURE-CONF-002.md\n?? ../../workspace/targets/jq/blueprint/FEATURE-CONF-003.md\n?? ../../workspace/targets/jq/blueprint/FEATURE-CORE-001.md\n?? ../../workspace/targets/jq/blueprint/FEATURE-CORE-002.md\n?? ../../workspace/targets/jq/blueprint/FEATURE-CORE-003.md\n?? ../../workspace/targets/jq/blueprint/FEATURE-CORE-004.md\n?? ../../workspace/targets/jq/blueprint/FEATURE-DATA-001.md\n?? ../../workspace/targets/jq/blueprint/FEATURE-DATA-002.md\n?? ../../workspace/targets/jq/blueprint/FEATURE-DATA-003.md\n?? ../../workspace/targets/jq/blueprint/FEATURE-DATA-004.md\n?? ../../workspace/targets/jq/blueprint/FEATURE-EXEC-001.md\n?? ../../workspace/targets/jq/blueprint/FEATURE-EXEC-002.md\n?? ../../workspace/targets/jq/blueprint/FEATURE-EXEC-003.md\n?? ../../workspace/targets/jq/blueprint/FEATURE-FLOW-001.md\n?? ../../workspace/targets/jq/blueprint/FEATURE-FLOW-002.md\n?? ../../workspace/targets/jq/blueprint/FEATURE-FLOW-003.md\n?? ../../workspace/targets/jq/blueprint/FEATURE-FLOW-004.md\n?? ../../workspace/targets/jq/blueprint/FEATURE-FLOW-005.md\n?? ../../workspace/targets/jq/blueprint/FEATURE-FLOW-006.md\n?? ../../workspace/targets/jq/blueprint/FEATURE-FUNC-001.md\n?? ../../workspace/targets/jq/blueprint/FEATURE-FUNC-002.md\n?? ../../workspace/targets/jq/blueprint/FEATURE-FUNC-003.md\n?? ../../workspace/targets/jq/blueprint/FEATURE-FUNC-004.md\n?? ../../workspace/targets/jq/blueprint/FEATURE-IO-001.md\n?? ../../workspace/targets/jq/blueprint/FEATURE-IO-002.md\n?? ../../workspace/targets/jq/blueprint/FEATURE-IO-003.md\n?? ../../workspace/targets/jq/blueprint/FEATURE-PARSE-001.md\n?? ../../workspace/targets/jq/blueprint/FEATURE-PARSE-002.md\n?? ../../workspace/targets/jq/blueprint/FEATURE-PARSE-003.md\n?? ../../workspace/targets/jq/blueprint/FEATURE-PARSE-004.md\n?? ../../workspace/targets/jq/blueprint/FEATURE-PATH-001.md\n?? ../../workspace/targets/jq/blueprint/FEATURE-PATH-002.md\n?? ../../workspace/targets/jq/blueprint/FEATURE-PATH-003.md\n?? ../../workspace/targets/jq/blueprint/FEATURE-PATH-004.md\n?? ../../workspace/targets/jq/blueprint/FEATURE-TEXT-001.md\n?? ../../workspace/targets/jq/blueprint/FEATURE-TEXT-002.md\n?? ../../workspace/targets/jq/blueprint/FEATURE-TEXT-003.md\n?? ../../workspace/targets/jq/blueprint/FEATURE-TEXT-004.md\n?? ../../workspace/targets/jq/blueprint/FEATURE-VALUE-001.md\n?? ../../workspace/targets/jq/blueprint/FEATURE-VALUE-002.md\n?? ../../workspace/targets/jq/blueprint/FEATURE-VALUE-003.md\n?? ../../workspace/targets/jq/blueprint/FEATURE-VALUE-004.md\n?? ../../workspace/targets/jq/blueprint/builtin_compact.md\n?? ../../workspace/targets/jq/blueprint/exclusions_compact.md\n?? ../../workspace/targets/jq/blueprint/full_test_compact.md\n?? ../../workspace/targets/jq/blueprint/jq-manual_compact.md\n?? ../../workspace/targets/jq/blueprint/lexer_compact.md\n?? ../../workspace/targets/jq/blueprint/parser_compact.md\n?? ../../workspace/targets/jq/evidence/block-5.md\n?? ../../workspace/targets/jq/evidence/block-6.md\n?? ../../workspace/targets/jq/evidence/block-7.md\n","exit_code":0,"status":"completed"}}
{"type":"item.completed","item":{"id":"item_24","type":"agent_message","text":"RESULT: FAILED\n\nFILES CHANGED:\n- jq_interpreter/ast.py\n- jq_interpreter/parser.py\n- jq_interpreter/evaluator.py\n\nSUMMARY:\nExpanded AST, parser, and evaluator support. Project tests pass: 32 passed. Declared conformance checks did not complete within the available execution window.\n\nBLOCKERS:\n- Scoped conformance selectors hang before producing a JSON report; parser/evaluator coverage remains incomplete.\n\nFAILURE_SUMMARY: Scoped conformance checks did not complete.\nFAILURE_DETAIL: The local test suite is green, but both required acceptance invocations failed to return a report, so the build cannot be claimed complete. Further debugging is required for hanging corpus cases and broader declaration/control semantics."}}
{"type":"turn.completed","usage":{"input_tokens":1634523,"cached_input_tokens":1552384,"cache_write_input_tokens":0,"output_tokens":12314,"reasoning_output_tokens":1176}}
