{"type":"thread.started","thread_id":"01a02b40-584e-7922-9289-24ce550d4df6"}
{"type":"turn.started"}
{"type":"item.completed","item":{"id":"item_0","type":"agent_message","text":"I’m inspecting the existing parser/evaluator and rerunning both authoritative scoped checks first, then I’ll trace the failing corpus cases to general grammar/evaluation defects and patch only the build files."}}
{"type":"item.started","item":{"id":"item_1","type":"command_execution","command":"/bin/bash -lc 'ls -la && find jq_interpreter -maxdepth 2 -type f -print && JQ=\"$PWD/jq\" python3 sources/run_conformance.py --select '\"'\\\\.\\\\|\\\\[\\\\|\\\\{\\\\|\\\\+\\\\|\\\\-\\\\|\\\\*|/|%' --json\"","aggregated_output":"","exit_code":null,"status":"in_progress"}}
{"type":"item.completed","item":{"id":"item_1","type":"command_execution","command":"/bin/bash -lc 'ls -la && find jq_interpreter -maxdepth 2 -type f -print && JQ=\"$PWD/jq\" python3 sources/run_conformance.py --select '\"'\\\\.\\\\|\\\\[\\\\|\\\\{\\\\|\\\\+\\\\|\\\\-\\\\|\\\\*|/|%' --json\"","aggregated_output":"{\n  \"candidate\": [\n    \"/mnt/c/Users/barlo/projects/drydock/uat/jq/runs/20260822.044627/build/jq/jq\"\n  ],\n  \"corpus\": \"jq.test\",\n  \"summary\": {\n    \"pass\": 23,\n    \"fail\": 35,\n    \"error\": 0,\n    \"skip\": 0\n  },\n  \"cases\": [\n    {\n      \"line\": 353,\n      \"program\": \"[foreach .[] / .[] as $i (0; . + $i)]\",\n      \"status\": \"fail\",\n      \"detail\": \"output mismatch\",\n      \"expect_failure\": false,\n      \"expected\": [\n        \"[1,3,3.5,4.5]\"\n      ],\n      \"actual\": [\n        \"[1.0,1.5,3.5,4.5]\"\n      ]\n    },\n    {\n      \"line\": 445,\n      \"program\": \"join(\\\",\\\",\\\"/\\\")\",\n      \"status\": \"fail\",\n      \"detail\": \"output mismatch\",\n      \"expect_failure\": false,\n      \"expected\": [\n        \"\\\"a,b,c,d\\\"\",\n        \"\\\"a/b/c/d\\\"\"\n      ],\n      \"actual\": []\n    },\n    {\n      \"line\": 689,\n      \"program\": \"[(infinite, -infinite) % (1, -1, infinite)]\",\n      \"status\": \"fail\",\n      \"detail\": \"output mismatch\",\n      \"expect_failure\": false,\n      \"expected\": [\n        \"[0,0,0,0,0,-1]\"\n      ],\n      \"actual\": [\n        \"[null,null,null,null,null,null]\"\n      ]\n    },\n    {\n      \"line\": 693,\n      \"program\": \"[nan % 1, 1 % nan | isnan]\",\n      \"status\": \"fail\",\n      \"detail\": \"output mismatch\",\n      \"expect_failure\": false,\n      \"expected\": [\n        \"[true,true]\"\n      ],\n      \"actual\": []\n    },\n    {\n      \"line\": 838,\n      \"program\": \"(add / length) as $m | map((. - $m) as $d | $d * $d) | add / length | sqrt\",\n      \"status\": \"fail\",\n      \"detail\": \"output mismatch\",\n      \"expect_failure\": false,\n      \"expected\": [\n        \"2\"\n      ],\n      \"actual\": []\n    },\n    {\n      \"line\": 847,\n      \"program\": \"atan * 4 * 1000000|floor / 1000000\",\n      \"status\": \"fail\",\n      \"detail\": \"output mismatch\",\n      \"expect_failure\": false,\n      \"expected\": [\n        \"3.141592\"\n      ],\n      \"actual\": []\n    },\n    {\n      \"line\": 851,\n      \"program\": \"[(3.141592 / 2) * (range(0;20) / 20)|cos * 1000000|floor / 1000000]\",\n      \"status\": \"fail\",\n      \"detail\": \"output mismatch\",\n      \"expect_failure\": false,\n      \"expected\": [\n        \"[1,0.996917,0.987688,0.972369,0.951056,0.923879,0.891006,0.85264,0.809017,0.760406,0.707106,0.649448,0.587785,0.522498,0.45399,0.382683,0.309017,0.233445,0.156434,0.078459]\"\n      ],\n      \"actual\": []\n    },\n    {\n      \"line\": 855,\n      \"program\": \"[(3.141592 / 2) * (range(0;20) / 20)|sin * 1000000|floor / 1000000]\",\n      \"status\": \"fail\",\n      \"detail\": \"output mismatch\",\n      \"expect_failure\": false,\n      \"expected\": [\n        \"[0,0.078459,0.156434,0.233445,0.309016,0.382683,0.45399,0.522498,0.587785,0.649447,0.707106,0.760405,0.809016,0.85264,0.891006,0.923879,0.951056,0.972369,0.987688,0.996917]\"\n      ],\n      \"actual\": []\n    },\n    {\n      \"line\": 938,\n      \"program\": \".[] | . as {$a, b: [$c, {$d}]} ?// [$a, {$b}, $e] ?// $f | [$a, $b, $c, $d, $e, $f]\",\n      \"status\": \"fail\",\n      \"detail\": \"output mismatch\",\n      \"expect_failure\": false,\n      \"expected\": [\n        \"[1, null, 2, 3, null, null]\",\n        \"[4, 5, null, null, 7, null]\",\n        \"[null, null, null, null, null, \\\"foo\\\"]\"\n      ],\n      \"actual\": []\n    },\n    {\n      \"line\": 945,\n      \"program\": \".[] | . as {a:$a} ?// {a:$a} ?// {a:$a} | $a\",\n      \"status\": \"fail\",\n      \"detail\": \"output mismatch\",\n      \"expect_failure\": false,\n      \"expected\": [],\n      \"actual\": [\n        \"null\",\n        \"null\",\n        \"null\",\n        \"null\"\n      ]\n    },\n    {\n      \"line\": 949,\n      \"program\": \".[] as {a:$a} ?// {a:$a} ?// {a:$a} | $a\",\n      \"status\": \"fail\",\n      \"detail\": \"output mismatch\",\n      \"expect_failure\": false,\n      \"expected\": [],\n      \"actual\": [\n        \"null\",\n        \"null\",\n        \"null\",\n        \"null\"\n      ]\n    },\n    {\n      \"line\": 953,\n      \"program\": \"[[3],[4],[5],6][] | . as {a:$a} ?// {a:$a} ?// {a:$a} | $a\",\n      \"status\": \"fail\",\n      \"detail\": \"output mismatch\",\n      \"expect_failure\": false,\n      \"expected\": [],\n      \"actual\": [\n        \"null\",\n        \"null\",\n        \"null\",\n        \"null\"\n      ]\n    },\n    {\n      \"line\": 957,\n      \"program\": \"[[3],[4],[5],6] | .[] as {a:$a} ?// {a:$a} ?// {a:$a} | $a\",\n      \"status\": \"fail\",\n      \"detail\": \"output mismatch\",\n      \"expect_failure\": false,\n      \"expected\": [],\n      \"actual\": [\n        \"null\",\n        \"null\",\n        \"null\",\n        \"null\"\n      ]\n    },\n    {\n      \"line\": 1241,\n      \"program\": \"[.[] % 7]\",\n      \"status\": \"fail\",\n      \"detail\": \"output mismatch\",\n      \"expect_failure\": false,\n      \"expected\": [\n        \"[0,-6,-5,-4,-3,-2,-1,0,1,2,3,4,5,6,0]\"\n      ],\n      \"actual\": [\n        \"[0,1,2,3,4,5,6,0,1,2,3,4,5,6,0]\"\n      ]\n    },\n    {\n      \"line\": 1274,\n      \"program\": \".[] |= select(. % 2 == 0)\",\n      \"status\": \"fail\",\n      \"detail\": \"output mismatch\",\n      \"expect_failure\": false,\n      \"expected\": [\n        \"[0,2,4]\"\n      ],\n      \"actual\": []\n    },\n    {\n      \"line\": 1370,\n      \"program\": \"[.[] | [.foo[] // .bar]]\",\n      \"status\": \"fail\",\n      \"detail\": \"output mismatch\",\n      \"expect_failure\": false,\n      \"expected\": [\n        \"[[1,2], [1], [3], [42], [41]]\"\n      ],\n      \"actual\": [\n        \"[[1,2],[1],[18,18,3],[],[41,41,41]]\"\n      ]\n    },\n    {\n      \"line\": 1374,\n      \"program\": \".[] //= .[0]\",\n      \"status\": \"fail\",\n      \"detail\": \"output mismatch\",\n      \"expect_failure\": false,\n      \"expected\": [\n        \"[\\\"hello\\\",true,\\\"hello\\\",[false],\\\"hello\\\"]\"\n      ],\n      \"actual\": []\n    },\n    {\n      \"line\": 1464,\n      \"program\": \"try error(0) // 1\",\n      \"status\": \"fail\",\n      \"detail\": \"output mismatch\",\n      \"expect_failure\": false,\n      \"expected\": [\n        \"1\"\n      ],\n      \"actual\": []\n    },\n    {\n      \"line\": 1645,\n      \"program\": \"[.[] / \\\",\\\"]\",\n      \"status\": \"fail\",\n      \"detail\": \"output mismatch\",\n      \"expect_failure\": false,\n      \"expected\": [\n        \"[[\\\"a\\\",\\\" bc\\\",\\\" def\\\",\\\" ghij\\\",\\\" jklmn\\\",\\\" a\\\",\\\"b\\\",\\\" c\\\",\\\"d\\\",\\\" e\\\",\\\"f\\\"],[\\\"a\\\",\\\"b\\\",\\\"c\\\",\\\"d\\\",\\\" e\\\",\\\"f\\\",\\\"g\\\",\\\"h\\\"]]\"\n      ],\n      \"actual\": []\n    },\n    {\n      \"line\": 1649,\n      \"program\": \"[.[] / \\\", \\\"]\",\n      \"status\": \"fail\",\n      \"detail\": \"output mismatch\",\n      \"expect_failure\": false,\n      \"expected\": [\n        \"[[\\\"a\\\",\\\"bc\\\",\\\"def\\\",\\\"ghij\\\",\\\"jklmn\\\",\\\"a,b\\\",\\\"c,d\\\",\\\"e,f\\\"],[\\\"a,b,c,d\\\",\\\"e,f,g,h\\\"]]\"\n      ],\n      \"actual\": []\n    },\n    {\n      \"line\": 1843,\n      \"program\": \"strftime(\\\"%Y-%m-%dT%H:%M:%SZ\\\")\",\n      \"status\": \"fail\",\n      \"detail\": \"output mismatch\",\n      \"expect_failure\": false,\n      \"expected\": [\n        \"\\\"2015-03-05T23:51:47Z\\\"\"\n      ],\n      \"actual\": []\n    },\n    {\n      \"line\": 1847,\n      \"program\": \"strftime(\\\"%A, %B %d, %Y\\\")\",\n      \"status\": \"fail\",\n      \"detail\": \"output mismatch\",\n      \"expect_failure\": false,\n      \"expected\": [\n        \"\\\"Tuesday, June 30, 2015\\\"\"\n      ],\n      \"actual\": []\n    },\n    {\n      \"line\": 1851,\n      \"program\": \"strftime(\\\"%Y-%m-%dT%H:%M:%SZ\\\")\",\n      \"status\": \"fail\",\n      \"detail\": \"output mismatch\",\n      \"expect_failure\": false,\n      \"expected\": [\n        \"\\\"2024-03-15T00:00:00Z\\\"\"\n      ],\n      \"actual\": []\n    },\n    {\n      \"line\": 1868,\n      \"program\": \"try strftime(\\\"%Y-%m-%dT%H:%M:%SZ\\\") catch .\",\n      \"status\": \"fail\",\n      \"detail\": \"output mismatch\",\n      \"expect_failure\": false,\n      \"expected\": [\n        \"\\\"strftime/1 requires parsed datetime inputs\\\"\"\n      ],\n      \"actual\": [\n        \"\\\"unknown function strftime\\\"\"\n      ]\n    },\n    {\n      \"line\": 1872,\n      \"program\": \"try strflocaltime(\\\"%Y-%m-%dT%H:%M:%SZ\\\") catch .\",\n      \"status\": \"fail\",\n      \"detail\": \"output mismatch\",\n      \"expect_failure\": false,\n      \"expected\": [\n        \"\\\"strflocaltime/1 requires parsed datetime inputs\\\"\"\n      ],\n      \"actual\": [\n        \"\\\"unknown function strflocaltime\\\"\"\n      ]\n    },\n    {\n      \"line\": 1889,\n      \"program\": \"[strptime(\\\"%Y-%m-%dT%H:%M:%SZ\\\")|(.,mktime)]\",\n      \"status\": \"fail\",\n      \"detail\": \"output mismatch\",\n      \"expect_failure\": false,\n      \"expected\": [\n        \"[[2015,2,5,23,51,47,4,63],1425599507]\"\n      ],\n      \"actual\": []\n    },\n    {\n      \"line\": 1895,\n      \"program\": \"last(range(365 * 67)|(\\\"1970-03-01T01:02:03Z\\\"|strptime(\\\"%Y-%m-%dT%H:%M:%SZ\\\")|mktime) + (86400 * .)|strftime(\\\"%Y-%m-%dT%H:%M:%SZ\\\")|strptime(\\\"%Y-%m-%dT%H:%M:%SZ\\\"))\",\n      \"status\": \"fail\",\n      \"detail\": \"output mismatch\",\n      \"expect_failure\": false,\n      \"expected\": [\n        \"[2037,1,11,1,2,3,3,41]\"\n      ],\n      \"actual\": []\n    },\n    {\n      \"line\": 2046,\n      \"program\": \"try (1/.) catch .\",\n      \"status\": \"fail\",\n      \"detail\": \"output mismatch\",\n      \"expect_failure\": false,\n      \"expected\": [\n        \"\\\"number (1) and number (0) cannot be divided because the divisor is zero\\\"\"\n      ],\n      \"actual\": [\n        \"\\\"division by zero\\\"\"\n      ]\n    },\n    {\n      \"line\": 2050,\n      \"program\": \"try (1/0) catch .\",\n      \"status\": \"fail\",\n      \"detail\": \"output mismatch\",\n      \"expect_failure\": false,\n      \"expected\": [\n        \"\\\"number (1) and number (0) cannot be divided because the divisor is zero\\\"\"\n      ],\n      \"actual\": [\n        \"\\\"division by zero\\\"\"\n      ]\n    },\n    {\n      \"line\": 2054,\n      \"program\": \"try (0/0) catch .\",\n      \"status\": \"fail\",\n      \"detail\": \"output mismatch\",\n      \"expect_failure\": false,\n      \"expected\": [\n        \"\\\"number (0) and number (0) cannot be divided because the divisor is zero\\\"\"\n      ],\n      \"actual\": [\n        \"\\\"division by zero\\\"\"\n      ]\n    },\n    {\n      \"line\": 2058,\n      \"program\": \"try (1%.) catch .\",\n      \"status\": \"fail\",\n      \"detail\": \"exited 1: Traceback (most recent call last):\",\n      \"expect_failure\": false,\n      \"expected\": [\n        \"\\\"number (1) and number (0) cannot be divided (remainder) because the divisor is zero\\\"\"\n      ],\n      \"actual\": []\n    },\n    {\n      \"line\": 2062,\n      \"program\": \"try (1%0) catch .\",\n      \"status\": \"fail\",\n      \"detail\": \"exited 1: Traceback (most recent call last):\",\n      \"expect_failure\": false,\n      \"expected\": [\n        \"\\\"number (1) and number (0) cannot be divided (remainder) because the divisor is zero\\\"\"\n      ],\n      \"actual\": []\n    },\n    {\n      \"line\": 2071,\n      \"program\": \"[range(-99/2;99/2;1)] as $orig | [$orig[]|pow(2;.)|log2] as $back | ($orig|keys)[]|. as $k | (($orig|.[$k])-($back|.[$k]))|if . < 0 then . * -1 else . end|select(.>.00005)\",\n      \"status\": \"fail\",\n      \"detail\": \"program did not compile: jq: compile error: expected ]\",\n      \"expect_failure\": false,\n      \"expected\": [],\n      \"actual\": []\n    },\n    {\n      \"line\": 2161,\n      \"program\": \"\\\"-1\\\"|IN(builtins[] / \\\"/\\\"|.[1])\",\n      \"status\": \"fail\",\n      \"detail\": \"output mismatch\",\n      \"expect_failure\": false,\n      \"expected\": [\n        \"false\"\n      ],\n      \"actual\": []\n    },\n    {\n      \"line\": 2165,\n      \"program\": \"all(builtins[] / \\\"/\\\"; .[1]|tonumber >= 0)\",\n      \"status\": \"fail\",\n      \"detail\": \"output mismatch\",\n      \"expect_failure\": false,\n      \"expected\": [\n        \"true\"\n      ],\n      \"actual\": []\n    }\n  ]\n}\n","exit_code":1,"status":"failed"}}
{"type":"item.started","item":{"id":"item_2","type":"command_execution","command":"/bin/bash -lc \"sed -n '1,260p' jq_interpreter/parser.py && sed -n '1,280p' jq_interpreter/evaluator.py\"","aggregated_output":"","exit_code":null,"status":"in_progress"}}
{"type":"item.completed","item":{"id":"item_2","type":"command_execution","command":"/bin/bash -lc \"sed -n '1,260p' jq_interpreter/parser.py && sed -n '1,280p' jq_interpreter/evaluator.py\"","aggregated_output":"\"\"\"Precedence-aware jq expression parser.\"\"\"\nimport json\nimport re\nfrom dataclasses import dataclass\nfrom .ast import Filter, Node, StringTemplate, Format\nfrom .errors import CompileError\nfrom .lexer import tokenize\n\n@dataclass(frozen=True)\nclass T: text: str\nOPS=(\"//=\",\"?//\",\"!=\",\"==\",\"|=\",\"+=\",\"-=\",\"*=\",\"/=\",\"%=\",\"<=\",\">=\",\"..\",\"//\")\nPREC={\",\":1,\"|\":2,\"=\":3,\"|=\":3,\"+=\":3,\"-=\":3,\"*=\":3,\"/=\":3,\"%=\":3,\"//=\":3,\"//\":4,\"or\":5,\"and\":6,\"==\":7,\"!=\":7,\"<\":7,\">\":7,\"<=\":7,\">=\":7,\"+\":8,\"-\":8,\"*\":9,\"/\":9,\"%\":9}\n\ndef lex(s: str) -> list[T]:\n    s=re.sub(r\"#[^\\n]*\",\"\",s); out=[]; i=0\n    while i<len(s):\n        if s[i].isspace(): i+=1; continue\n        if s[i]=='\"':\n            a=i; i+=1; esc=False\n            while i<len(s):\n                c=s[i]; i+=1\n                if esc: esc=False\n                elif c=='\\\\': esc=True\n                elif c=='\"': break\n            else: raise CompileError(\"unterminated string\")\n            out.append(T(s[a:i])); continue\n        op=next((x for x in OPS if s.startswith(x,i)),None)\n        if op: out.append(T(op)); i+=len(op); continue\n        m=re.match(r\"(?:[0-9]+(?:\\.[0-9]*)?|\\.[0-9]+)(?:[eE][+-]?[0-9]+)?\",s[i:])\n        if m: out.append(T(m.group())); i+=len(m.group()); continue\n        m=re.match(r\"(?:[A-Za-z_][A-Za-z_0-9]*::)*[A-Za-z_][A-Za-z_0-9]*\",s[i:])\n        if m: out.append(T(m.group())); i+=len(m.group()); continue\n        if s[i]=='$':\n            m=re.match(r\"\\$[A-Za-z_][A-Za-z_0-9]*(?:::[A-Za-z_][A-Za-z_0-9]*)*\",s[i:])\n            if not m: raise CompileError(\"invalid binding\")\n            out.append(T(m.group())); i+=len(m.group()); continue\n        if s[i]=='.' and i+1<len(s) and re.match(r\"[A-Za-z_]\",s[i+1]):\n            m=re.match(r\"\\.[A-Za-z_][A-Za-z_0-9]*\",s[i:]); out.append(T(m.group())); i+=len(m.group()); continue\n        if s[i]=='@':\n            m=re.match(r\"@[A-Za-z_][A-Za-z_0-9]*\",s[i:])\n            if not m: raise CompileError(\"invalid format\")\n            out.append(T(m.group())); i+=len(m.group()); continue\n        if s[i] in \".?=;,:|+-*/%$<>()[]{}\": out.append(T(s[i])); i+=1; continue\n        raise CompileError(\"unexpected character\")\n    out.append(T(\"<eof>\")); return out\n\nclass Parser:\n    def __init__(self,s:str): self.t=lex(s); self.i=0\n    def p(self): return self.t[self.i].text\n    def take(self,x=None):\n        v=self.p()\n        if x is not None and v!=x: raise CompileError(f\"expected {x}\")\n        self.i+=1; return v\n    def parse(self):\n        if self.p()==\"<eof>\": raise CompileError(\"empty program\")\n        x=self.expr(0)\n        while self.p()==';': self.take()\n        if self.p()!='<eof>': raise CompileError(\"unexpected token\")\n        return x\n    def expr(self,n):\n        x=self.prefix()\n        # Binding is a query construct, below all ordinary operators.\n        if self.p()=='as' and n <= 2:\n            self.take('as'); pattern=self.pattern(); self.take('|')\n            return Node('bind',(x,pattern,self.expr(0)))\n        while self.p() in PREC and PREC[self.p()]>=n:\n            op=self.take(); q=PREC[op]; x=Node(\"binary\",(op,x,self.expr(q if op in (\"=\",\"|=\",\"+=\",\"-=\",\"*=\",\"/=\",\"%=\",\"//=\") else q+1)))\n        if self.p()=='as' and n <= 2:\n            self.take('as'); pattern=self.pattern(); self.take('|')\n            return Node('bind',(x,pattern,self.expr(0)))\n        return x\n    def prefix(self):\n        t=self.p()\n        if t=='-': self.take(); return Node('unary',('-',self.expr(10)))\n        if t=='if': return self.if_expr()\n        if t in ('try','reduce','foreach','label','break','def','module','import','include'): return self.control(t)\n        if t=='(': self.take(); x=self.expr(0); self.take(')'); return self.post(x)\n        if t=='[':\n            self.take()\n            if self.p()==']': x=Node('array',(None,))\n            else:\n                parts=[self.expr(2)]\n                while self.p()==',': self.take(); parts.append(self.expr(2))\n                combined=parts[0]\n                for part in parts[1:]: combined=Node('binary',(',',combined,part))\n                x=Node('array',(combined,))\n            self.take(']'); return self.post(x)\n        if t=='{': return self.object()\n        if t=='.': self.take(); return self.post(Node('identity'))\n        if t.startswith('.'): self.take(); return self.post(Node('field',(t[1:],)))\n        if t.startswith('$'): self.take(); return Node('var',(t[1:],))\n        if t.startswith('\"'): self.take(); return self.post(Node('string',(t,)))\n        if t.startswith('@'): self.take(); return self.post(Node('format',(t[1:],)))\n        self.take()\n        if t in ('true','false','null','nan','infinite','-infinite','-nan') or re.fullmatch(r'(?:[0-9]+(?:\\.[0-9]*)?|\\.[0-9]+)(?:[eE][+-]?[0-9]+)?',t): return self.post(Node('literal',(t,)))\n        return self.post(Node('call',(t,())))\n    def post(self,x):\n        while True:\n            if self.p().startswith('\"') and isinstance(x,Node) and x.operation=='format':\n                x=Node('format_template',(x.arguments[0],self.take())); continue\n            if self.p().startswith('\"'):\n                x=Node('indexexpr',(x,Node('string',(self.take(),)))); continue\n            if self.p()=='?': self.take(); x=Node('optional',(x,)); continue\n            if self.p().startswith('.') and len(self.p())>1: x=Node('index',(x,self.take()[1:],False)); continue\n            if self.p()=='.' and self.t[self.i+1].text.startswith('\"'):\n                self.take('.'); x=Node('indexexpr',(x,Node('string',(self.take(),)))); continue\n            if self.p()=='.' and self.t[self.i+1].text=='[':\n                self.take('.'); continue\n            if self.p()=='[':\n                self.take()\n                if self.p()==']': self.take(); x=Node('iterate',(x,)); continue\n                a=self.expr(0)\n                if self.p()==':': self.take(); b=None if self.p()==']' else self.expr(0); self.take(']'); x=Node('slice',(x,a,b))\n                else: self.take(']'); x=Node('indexexpr',(x,a))\n                continue\n            if self.p()=='(' and isinstance(x,Node) and x.operation=='call':\n                name=x.arguments[0]; self.take(); args=[]\n                if self.p()!=')':\n                    args.append(self.expr(0))\n                    # jq's grammar uses semicolons for filter arguments.  The\n                    # corpus also exercises the permissive comma spelling.\n                    while self.p()==';': self.take(); args.append(self.expr(0))\n                self.take(')'); x=Node('call',(name,tuple(args))); continue\n            break\n        return x\n    def object(self):\n        self.take('{'); pairs=[]\n        while self.p()!='}':\n            if self.p()=='(':\n                self.take('('); key=self.expr(0); self.take(')')\n            else:\n                k=self.take()\n                if k.startswith('\"'):\n                    key=Node('string',(k,))\n                else:\n                    key=Node('string',(json.dumps(k.lstrip('$').lstrip('.')),))\n            if self.p()==':': self.take(); v=self.expr(2)\n            else:\n                # `{name}` and `{$name}` abbreviate an access using the key.\n                raw = k.lstrip('$').lstrip('.')\n                v=Node('var',(raw,)) if k.startswith('$') else Node('index',(Node('identity'),raw,False))\n            pairs.append((key,v))\n            if self.p()!= '}': self.take(',')\n        self.take('}'); return Node('object',(tuple(pairs),))\n\n    def pattern(self):\n        t=self.p()\n        if t.startswith('$'):\n            result=Node('pattern_var',(self.take()[1:],))\n            return self._pattern_alt(result)\n        if t=='[':\n            self.take()\n            if self.p()==']': raise CompileError('empty destructuring pattern')\n            items=[]\n            if self.p()!=']':\n                items.append(self.pattern())\n                while self.p()==',': self.take(); items.append(self.pattern())\n            self.take(']'); return self._pattern_alt(Node('pattern_array',(tuple(items),)))\n        if t=='{':\n            self.take()\n            if self.p()=='}': raise CompileError('empty destructuring pattern')\n            items=[]\n            if self.p()!='}':\n                while True:\n                    key=self.take()\n                    if self.p()==':': self.take(); pat=self.pattern()\n                    elif key.startswith('$'): pat=Node('pattern_var',(key[1:],))\n                    else: pat=Node('pattern_var',(key,))\n                    items.append((key.lstrip('$'),pat))\n                    if self.p()!='}': self.take(',')\n                    else: break\n            self.take('}'); return self._pattern_alt(Node('pattern_object',(tuple(items),)))\n        raise CompileError('expected binding pattern')\n\n    def _pattern_alt(self, result):\n        if self.p()=='?//':\n            self.take('?//'); return Node('pattern_alt',(result,self.pattern()))\n        return result\n    def if_expr(self):\n        self.take('if'); c=self.expr(0); self.take('then'); a=self.expr(0); b=Node('literal',('null',))\n        if self.p()=='else': self.take(); b=self.expr(0); self.take('end')\n        elif self.p()=='elif':\n            self.take('elif'); ec=self.expr(0); self.take('then'); ea=self.expr(0)\n            eb=Node('literal',('null',))\n            if self.p()=='else': self.take(); eb=self.expr(0); self.take('end')\n            elif self.p()=='elif':\n                self.take('elif'); eb=self.if_expr()\n            else: self.take('end')\n            b=Node('if',(ec,ea,eb))\n        else: self.take('end')\n        return Node('if',(c,a,b))\n    def control(self,w):\n        self.take(w)\n        if w in ('module', 'import', 'include'):\n            raise CompileError('module directives are not available')\n        if w=='try':\n            a=self.expr(0); b=None\n            if self.p()=='catch': self.take(); b=self.expr(0)\n            return Node('try',(a,b))\n        if w=='def':\n            name=self.take(); ps=[]\n            if self.p()=='(': self.take();\n            while self.p() not in (')',':'):\n                ps.append(self.take().lstrip('$'))\n                if self.p()==';': self.take()\n            if ps: self.take(')')\n            self.take(':'); b=self.expr(0); self.take(';')\n            definition=Node('def',(name,tuple(ps),b))\n            if self.p()!='<eof>': return Node('defprog',(definition,self.expr(0)))\n            return definition\n        if w in ('reduce','foreach'):\n            src=self.expr(3); self.take('as'); pat=self.pattern(); self.take('('); init=self.expr(0); self.take(';'); upd=self.expr(2); ext=None\n            if self.p()==';': self.take(); ext=self.expr(2)\n            self.take(')'); return Node(w,(src,pat,init,upd,ext))\n        if w=='label': name=self.take().lstrip('$'); self.take('|'); return Node('label',(name,self.expr(0)))\n        if w=='break': return Node('break',(self.take().lstrip('$'),))\n        return Node('unsupported',(w,))\n\ndef parse(source: str) -> Filter:\n    tokenize(source)\n    if source.strip() == 'not-a-filter': raise CompileError('unknown filter')\n    stripped=source.strip()\n    if stripped.startswith('\"') and '\\\\(' in stripped:\n        parts=[]; pos=1; end=len(stripped)-1\n        while pos<end:\n            mark=stripped.find('\\\\(',pos)\n            if mark<0:\n                parts.append(json.loads('\"'+stripped[pos:end]+'\"')); break\n            if mark>pos: parts.append(json.loads('\"'+stripped[pos:mark]+'\"'))\n            depth=1; cursor=mark+2\n            while depth and cursor<end:\n                if stripped[cursor]=='(': depth+=1\n                elif stripped[cursor]==')': depth-=1\n                cursor+=1\n            parts.append(parse(stripped[mark+2:cursor-1])); pos=cursor\n        return StringTemplate(tuple(parts))\n    if stripped.startswith('@') and ' \"' in stripped:\n        name, template=stripped.split(None,1); inner=parse(template)\n        return Format(name[1:], inner if isinstance(inner,StringTemplate) else StringTemplate((inner,)))\n    result=Parser(source).parse()\n    # Bare calls are valid jq builtins as well as user definitions supplied by\n    # the builtin library.  Retain compile-time rejection for an unknown bare\n    # identifier while registering the standard library's zero-argument names.\n    known = set('empty error length type not tostring tojson abs fabs floor ceil round sqrt sin cos tan asin acos atan log log10 exp exp2 log2 pow keys sort add min max any all arrays objects iterables booleans numbers normals finites strings nulls values scalars unique reverse paths builtins modulemeta'.split())\n    if isinstance(result, Node) and result.operation == 'call' and not result.arguments[1] and result.arguments[0] not in known:\n        raise CompileError('unknown filter')\n    return result\n\"\"\"Ordered generator evaluator boundary.\"\"\"\nimport json\nimport math\n\nfrom .ast import Add, Array, Comma, Filter, Format, Identity, Iterate, Literal, Limit, Node, Pipe, Raise, StringTemplate\nfrom .errors import RuntimeError\nfrom .runtime import JsonValue, ValueStream, identity_stream\n\n\ndef evaluate(program: Filter, value: JsonValue) -> ValueStream:\n    \"\"\"Evaluate one input as an ordered stream of output values.\"\"\"\n    if isinstance(program, Node):\n        yield from _node(program, value, {})\n        return\n    if isinstance(program, Identity):\n        yield from identity_stream(value)\n        return\n    if isinstance(program, Iterate):\n        if isinstance(value, list):\n            yield from value\n        elif isinstance(value, dict):\n            yield from value.values()\n        else:\n            raise RuntimeError(\"cannot iterate over value\")\n        return\n    if isinstance(program, Literal):\n        yield program.value\n        return\n    if isinstance(program, Pipe):\n        for intermediate in evaluate(program.left, value): yield from evaluate(program.right, intermediate)\n        return\n    if isinstance(program, Add):\n        left = list(evaluate(program.left, value))\n        right = list(evaluate(program.right, value))\n        for first in left:\n            for second in right:\n                if isinstance(first, (int, float)) and isinstance(second, (int, float)):\n                    yield first + second\n                elif isinstance(first, str) and isinstance(second, str): yield first + second\n                elif first is None: yield second\n                elif second is None: yield first\n                else: raise RuntimeError(\"cannot add values\")\n        return\n    if isinstance(program, StringTemplate):\n        pieces: list[str] = []\n        for part in program.parts:\n            pieces.append(part if isinstance(part, str) else \"\".join(_stringify(x) for x in evaluate(part, value)))\n        yield \"\".join(pieces)\n        return\n    if isinstance(program, Format):\n        if program.template is None: yield _apply_format(program.name, value)\n        else:\n            pieces: list[str] = []\n            for part in program.template.parts:\n                if isinstance(part, str): pieces.append(part)\n                else:\n                    pieces.extend(_apply_format(program.name, item) for item in evaluate(part, value))\n            yield \"\".join(pieces)\n        return\n    if isinstance(program, Comma):\n        yield from evaluate(program.left, value)\n        yield from evaluate(program.right, value)\n        return\n    if isinstance(program, Raise):\n        raise RuntimeError(program.message)\n    if isinstance(program, Array):\n        yield list(evaluate(program.expression, value))\n        return\n    if isinstance(program, Limit):\n        outputs = iter(evaluate(program.expression, value))\n        for _ in range(program.count):\n            try:\n                yield next(outputs)\n            except StopIteration:\n                break\n        return\n    raise RuntimeError(\"unknown compiled filter\")\n\ndef _node(node: Node, value: object, env: dict[str, object]) -> ValueStream:\n    op, a = node.operation, node.arguments\n    if op == \"identity\": yield value\n    elif op == \"literal\":\n        text=a[0]; special={\"true\":True,\"false\":False,\"null\":None,\"nan\":float(\"nan\"),\"infinite\":float(\"inf\"),\"-infinite\":float(\"-inf\"),\"-nan\":float(\"nan\")}; yield special[text] if text in special else json.loads(text)\n    elif op == \"string\": yield _decode_string(a[0], value, env)\n    elif op == \"format\": yield _apply_format(a[0], value)\n    elif op == \"format_template\": yield _decode_string(a[1], value, env).replace(_decode_string(a[1], value, env), _apply_format(a[0], value))\n    elif op == \"var\":\n        if a[0] not in env: raise RuntimeError(f\"variable ${a[0]} is not defined\")\n        yield env[a[0]]\n    elif op == \"bind\":\n        for item in _node(a[0], value, env):\n            bound=dict(env); _bind_pattern(a[1], item, bound)\n            # `exp as $x | rest` binds the value produced by exp while the\n            # remainder continues with the original input.\n            yield from _node(a[2], value, bound)\n    elif op == \"field\": yield _index(value, a[0])\n    elif op == \"index\":\n        for base in _node(a[0],value,env): yield _index(base,a[1])\n    elif op == \"iterate\":\n        for base in _node(a[0],value,env):\n            if isinstance(base,dict): yield from base.values()\n            elif isinstance(base,list): yield from base\n            else: raise RuntimeError(\"cannot iterate over value\")\n    elif op in (\"indexexpr\",\"slice\"):\n        for base in _node(a[0],value,env):\n            if op==\"slice\":\n                start=_one(a[1],base,env); end=None if a[2] is None else _one(a[2],base,env); yield base[int(start) if start is not None else 0:int(end) if end is not None else None]\n            else: yield _index(base,_one(a[1],base,env))\n    elif op == \"array\": yield [] if a[0] is None else list(_node(a[0],value,env))\n    elif op == \"object\":\n        results=[{}]\n        for key, expr in a[0]:\n            keys=list(_node(key,value,env))\n            values=list(_node(expr,value,env))\n            expanded=[]\n            for prior in results:\n                for k in keys:\n                    for v in values:\n                        item=dict(prior); item[str(k)]=v; expanded.append(item)\n            results=expanded\n        yield from results\n    elif op == \"binary\": yield from _binary(a[0],a[1],a[2],value,env)\n    elif op == \"unary\":\n        x=_one(a[1],value,env); yield -x\n    elif op == \"optional\":\n        try: yield from _node(a[0],value,env)\n        except RuntimeError: return\n    elif op == \"if\":\n        branch=a[1] if _truth(_one(a[0],value,env)) else a[2]; yield from _node(branch,value,env)\n    elif op == \"try\":\n        try: yield from _node(a[0],value,env)\n        except RuntimeError as error:\n            if a[1] is not None: yield from _node(a[1],str(error),env)\n    elif op == \"label\":\n        try: yield from _node(a[1], value, {**env, '__label__': a[0]})\n        except _Break as exc:\n            if exc.name != a[0]: raise\n    elif op == \"break\":\n        raise _Break(a[0])\n    elif op in (\"reduce\", \"foreach\"):\n        states=list(_node(a[0], value, env)); initial=list(_node(a[2], value, env))\n        currents=initial\n        for item in states:\n            next_currents=[]\n            for current in currents:\n                bound=dict(env); _bind_pattern(a[1], item, bound)\n                next_currents.extend(_node(a[3], current, bound))\n            currents=next_currents\n            if op == \"foreach\":\n                if a[4] is None:\n                    yield from currents\n                else:\n                    for result in currents: yield from _node(a[4], result, env)\n        if op==\"reduce\": yield from currents\n    elif op == \"call\": yield from _call(a[0],a[1],value,env)\n    elif op == \"def\":\n        env.setdefault('__funcs__',{})[a[0]]=(a[1],a[2])\n        yield value\n    elif op == \"defprog\":\n        funcs=dict(env.get('__funcs__',{}))\n        program: Node = node\n        while program.operation == 'defprog':\n            definition = program.arguments[0]\n            funcs[definition.arguments[0]] = (definition.arguments[1], definition.arguments[2])\n            program = program.arguments[1]\n        yield from _node(program, value, {**env, '__funcs__': funcs})\n    elif op == \"unsupported\": raise RuntimeError(\"unsupported syntax\")\n\nclass _Break(Exception):\n    def __init__(self, name): self.name=name\n\ndef _bind_pattern(pattern, value, env):\n    op, args=pattern.operation, pattern.arguments\n    if op=='pattern_alt':\n        first, second=args\n        if first.operation=='pattern_object' and not isinstance(value,dict): return _bind_pattern(second,value,env)\n        if first.operation=='pattern_array' and not isinstance(value,list): return _bind_pattern(second,value,env)\n        return _bind_pattern(first,value,env)\n    if op=='pattern_var': env[args[0]]=value\n    elif op=='pattern_array':\n        for i,p in enumerate(args[0]): _bind_pattern(p, value[i] if isinstance(value,list) and i<len(value) else None, env)\n    elif op=='pattern_object':\n        for key,p in args[0]: _bind_pattern(p, value.get(key) if isinstance(value,dict) else None, env)\n\ndef _one(node, value, env):\n    vals=list(_node(node,value,env)); return vals[0] if vals else None\ndef _truth(x): return x is not None and x is not False\ndef _index(v,k):\n    if isinstance(v,dict): return v.get(str(k))\n    if isinstance(v,list): return v[int(k)] if -len(v)<=int(k)<len(v) else None\n    raise RuntimeError(\"cannot index value\")\ndef _binary(op,left,right,value,env):\n    if op==',': yield from _node(left,value,env); yield from _node(right,value,env); return\n    if op=='|':\n        for x in _node(left,value,env): yield from _node(right,x,env)\n        return\n    if op in ('=', '|=', '+=', '-=', '*=', '/=', '%=', '//='):\n        paths = _paths(left, value, env)\n        replacements = [value] if op == '|=' else list(_node(right, value, env))\n        for replacement in replacements:\n            result = value\n            for path in paths:\n                old = _get_path(result, path)\n                new = replacement if op == '=' else _one(right, old, env)\n                if op not in ('=', '|='):\n                    new = _arithmetic(op[0], old, replacement)\n                result = _set_path(result, path, new)\n            if paths: yield result\n        return\n    ls=list(_node(left,value,env)); rs=list(_node(right,value,env))\n    for x in ls:\n      for y in rs:\n        if op=='+': yield y if x is None else x if y is None else x+y\n        elif op=='-': yield x-y\n        elif op=='*': yield x*y\n        elif op=='/':\n            if y==0: raise RuntimeError(\"division by zero\")\n            yield x/y\n        elif op=='%': yield x%y\n        elif op in ('==','!=','<','>','<=','>='): yield {'==':x==y,'!=':x!=y,'<':x<y,'>':x>y,'<=':x<=y,'>=':x>=y}[op]\n        elif op in ('and','or'): yield (_truth(x) and _truth(y)) if op=='and' else (_truth(x) or _truth(y))\n        elif op=='//': yield x if _truth(x) else y\n        else: yield x\n\ndef _arithmetic(op, left, right):\n    if op == '+': return left + right\n    if op == '-': return left - right\n    if op == '*': return left * right\n    if op == '/': return left / right\n    if op == '%': return left % right\n    return right\n\ndef _paths(node, value, env):\n    op, args = node.operation, node.arguments\n    if op == 'identity': return [()]\n    if op == 'field': return [(args[0],)]\n    if op == 'index': return [p + (args[1],) for p in _paths(args[0], value, env)]\n    if op == 'indexexpr':\n        return [p + (key,) for p in _paths(args[0], value, env) for key in _node(args[1], value, env)]\n    if op == 'iterate':\n        result = []\n        for p in _paths(args[0], value, env):\n            current = _get_path(value, p)\n            if isinstance(current, list): result.extend(p + (i,) for i in range(len(current)))\n            elif isinstance(current, dict): result.extend(p + (k,) for k in current)\n        return result\n    if op == 'call' and not args[1] and args[0] in env.get('__funcs__', {}):\n        return _paths(env['__funcs__'][args[0]][1], value, env)\n    return []\n\ndef _get_path(value, path):\n    current = value\n    for key in path:\n        if isinstance(current, dict): current = current.get(str(key))\n        elif isinstance(current, list):\n            index = int(key); current = current[index] if -len(current) <= index < len(current) else None\n        else: return None\n    return current\n\ndef _set_path(value, path, replacement):\n    if not path: return replacement\n    if isinstance(value, dict):\n        result = dict(value); key = str(path[0]); result[key] = _set_path(result.get(key), path[1:], replacement); return result\n    if isinstance(value, list):\n        result = list(value); index = int(path[0]); index = index + len(result) if index < 0 else index\n        while index >= len(result): result.append(None)\n        result[index] = _set_path(result[index], path[1:], replacement); return result\n    return {str(path[0]): _set_path(None, path[1:], replacement)}\ndef _call(name,args,value,env):\n    if not args and name in env:\n        bound = env[name]\n        if isinstance(bound, Node):\n            yield from _node(bound, value, env)\n        else:\n            yield bound\n        return\n    if name in env.get('__funcs__',{}):\n        params,body=env['__funcs__'][name]\n        if not args:\n            yield from _node(body,value,env); return\n","exit_code":0,"status":"completed"}}
{"type":"item.started","item":{"id":"item_3","type":"command_execution","command":"/bin/bash -lc \"sed -n '280,620p' jq_interpreter/evaluator.py; sed -n '1,240p' jq_interpreter/builtins.py; sed -n '1,180p' jq_interpreter/ast.py\"","aggregated_output":"","exit_code":null,"status":"in_progress"}}
{"type":"item.completed","item":{"id":"item_3","type":"command_execution","command":"/bin/bash -lc \"sed -n '280,620p' jq_interpreter/evaluator.py; sed -n '1,240p' jq_interpreter/builtins.py; sed -n '1,180p' jq_interpreter/ast.py\"","aggregated_output":"            yield from _node(body,value,env); return\n        # Function parameters are filters, not eagerly evaluated values.  A\n        # parameter is evaluated against the function's current input each\n        # time its name is used, which preserves jq's generator semantics.\n        local=dict(env)\n        local.update({param:arg for param,arg in zip(params,args)})\n        yield from _node(body,value,local); return\n    if name=='error': raise RuntimeError(_one(args[0],value,env) if args else 'error')\n    if name=='length': yield len(value); return\n    if name=='type': yield 'null' if value is None else 'boolean' if isinstance(value,bool) else 'number' if isinstance(value,(int,float)) else 'string' if isinstance(value,str) else 'array' if isinstance(value,list) else 'object'; return\n    if name=='not': yield not _truth(value); return\n    if name in ('tostring','tojson'): yield json.dumps(value,separators=(',',':')) if name=='tojson' else _stringify(value); return\n    if name=='abs': yield abs(value); return\n    if name=='floor': yield math.floor(value); return\n    if name=='ceil': yield math.ceil(value); return\n    if name=='map':\n        yield [_one(args[0],x,env) for x in value]; return\n    if name=='range':\n        start=0 if not args else _one(args[0],value,env); end=_one(args[1],value,env) if len(args)>1 else start; step=_one(args[2],value,env) if len(args)>2 else 1\n        yield from range(int(start),int(end),int(step)); return\n    if name in ('sort', 'unique'):\n        if not isinstance(value, list):\n            raise RuntimeError('cannot sort value')\n        ordered = sorted(value, key=_jq_sort_key)\n        if name == 'unique':\n            ordered = _dedupe_sorted(ordered)\n        yield ordered\n        return\n    raise RuntimeError(f\"unknown function {name}\")\n\n\ndef _jq_sort_key(value: object) -> tuple[object, ...]:\n    \"\"\"Return jq's basic total-order key for values used by sort/unique.\"\"\"\n    if value is None: return (0,)\n    if isinstance(value, bool): return (1, int(value))\n    if isinstance(value, (int, float)): return (2, value)\n    if isinstance(value, str): return (3, value)\n    if isinstance(value, list): return (4, tuple(_jq_sort_key(item) for item in value))\n    if isinstance(value, dict):\n        return (5, tuple((key, _jq_sort_key(item)) for key, item in sorted(value.items())))\n    return (6, repr(value))\n\n\ndef _dedupe_sorted(values: list[object]) -> list[object]:\n    result: list[object] = []\n    for value in values:\n        if not result or value != result[-1]:\n            result.append(value)\n    return result\ndef _decode_string(text,value,env):\n    if \"\\\\(\" not in text: return json.loads(text)\n    inner=text[1:-1]; out=''; pos=0\n    while pos<len(inner):\n        mark=inner.find('\\\\(',pos)\n        if mark<0: out+=json.loads('\"'+inner[pos:]+'\"'); break\n        out+=json.loads('\"'+inner[pos:mark]+'\"'); depth=1; end=mark+2\n        while depth and end<len(inner):\n            if inner[end]=='(': depth+=1\n            elif inner[end]==')': depth-=1\n            end+=1\n        out+=_stringify(_one(Node('identity'),value,env)); pos=end\n    return out\n\ndef _stringify(value: object) -> str:\n    import json\n    return value if isinstance(value, str) else json.dumps(value, separators=(\",\", \":\"), ensure_ascii=False, allow_nan=False)\n\ndef _apply_format(name: str, value: object, template: bool = False) -> str:\n    import base64, html, json, urllib.parse\n    if name == \"text\": return _stringify(value)\n    if name == \"json\": return json.dumps(value, separators=(\",\", \":\"), ensure_ascii=False)\n    if name == \"html\": return html.escape(_stringify(value), quote=True).replace(\"&#x27;\", \"&apos;\")\n    if name == \"uri\": return urllib.parse.quote(_stringify(value), safe=\"-_.~\")\n    if name == \"urid\": return urllib.parse.unquote(_stringify(value))\n    if name == \"base64\": return base64.b64encode(_stringify(value).encode()).decode()\n    if name == \"base64d\": return base64.b64decode(_stringify(value)).decode()\n    if name == \"csv\": return \",\".join('\"' + str(x).replace('\"', '\"\"') + '\"' if isinstance(x, str) else _stringify(x) for x in value)\n    if name == \"tsv\": return \"\\t\".join(_stringify(x).replace(\"\\\\\", \"\\\\\\\\\").replace(\"\\n\", \"\\\\n\").replace(\"\\r\", \"\\\\r\").replace(\"\\t\", \"\\\\t\") for x in value)\n    if name == \"sh\": return \"'\" + _stringify(value).replace(\"'\", \"'\\\\''\") + \"'\"\n    raise RuntimeError(f\"unknown format @{name}\")\n\"\"\"Builtin filter ownership boundary.\n\nLanguage-specific builtin definitions will be added here; the evaluator depends on\nthis module rather than embedding standard-library filters in process code.\n\"\"\"\n\n\"\"\"Syntax tree types shared by the lexer, parser, and evaluator.\"\"\"\n\nfrom dataclasses import dataclass\n\n\n@dataclass(frozen=True)\nclass Filter:\n    \"\"\"Base type for compiled jq filters.\"\"\"\n\n\n@dataclass(frozen=True)\nclass Identity(Filter):\n    \"\"\"The ``.`` filter, yielding its input unchanged.\"\"\"\n\n\n@dataclass(frozen=True)\nclass Iterate(Filter):\n    \"\"\"The ``.[]`` filter, yielding array or object members in order.\"\"\"\n\n\n@dataclass(frozen=True)\nclass Literal(Filter):\n    \"\"\"A JSON literal filter.\"\"\"\n\n    value: object\n\n\n@dataclass(frozen=True)\nclass Comma(Filter):\n    \"\"\"Concatenate the output streams of two filters.\"\"\"\n\n    left: Filter\n    right: Filter\n\n\n@dataclass(frozen=True)\nclass Raise(Filter):\n    \"\"\"Raise a jq runtime error when evaluated.\"\"\"\n\n    message: str = \"error\"\n\n\n@dataclass(frozen=True)\nclass Array(Filter):\n    \"\"\"Collect a filter's generated values into an array.\"\"\"\n\n    expression: Filter\n\n\n@dataclass(frozen=True)\nclass Limit(Filter):\n    \"\"\"Keep at most ``count`` values from a filter stream.\"\"\"\n\n    count: int\n    expression: Filter\n\n@dataclass(frozen=True)\nclass Pipe(Filter):\n    left: Filter\n    right: Filter\n\n@dataclass(frozen=True)\nclass StringTemplate(Filter):\n    parts: tuple[str | Filter, ...]\n\n@dataclass(frozen=True)\nclass Format(Filter):\n    name: str\n    template: StringTemplate | None = None\n\n@dataclass(frozen=True)\nclass Add(Filter):\n    left: Filter\n    right: Filter\n\n@dataclass(frozen=True)\nclass Node(Filter):\n    \"\"\"General expression node used by the complete source parser.\"\"\"\n    operation: str\n    arguments: tuple[object, ...] = ()\n","exit_code":0,"status":"completed"}}
{"type":"item.started","item":{"id":"item_4","type":"command_execution","command":"/bin/bash -lc \"sed -n '1,220p' jq_interpreter/interpreter.py; sed -n '1,220p' jq_interpreter/cli.py; sed -n '1,160p' jq_interpreter/lexer.py; python3 - <<'PY'\nimport subprocess, json, os\nfor p,inp in [('join(\\\",\\\",\\\"/\\\")','[\\\"a\\\",\\\"b\\\"]'),('atan * 4 * 1000000|floor / 1000000','1'),('def f: .+1; f','null'),('reduce .[] as \"'$x (0; .+$x)'\"','[1,2]')]:\n r=subprocess.run(['./jq','-c',p],input=inp+'\\\\n',text=True,capture_output=True); print(p,r.returncode,r.stdout,r.stderr)\nPY\"","aggregated_output":"","exit_code":null,"status":"in_progress"}}
{"type":"item.completed","item":{"id":"item_4","type":"command_execution","command":"/bin/bash -lc \"sed -n '1,220p' jq_interpreter/interpreter.py; sed -n '1,220p' jq_interpreter/cli.py; sed -n '1,160p' jq_interpreter/lexer.py; python3 - <<'PY'\nimport subprocess, json, os\nfor p,inp in [('join(\\\",\\\",\\\"/\\\")','[\\\"a\\\",\\\"b\\\"]'),('atan * 4 * 1000000|floor / 1000000','1'),('def f: .+1; f','null'),('reduce .[] as \"'$x (0; .+$x)'\"','[1,2]')]:\n r=subprocess.run(['./jq','-c',p],input=inp+'\\\\n',text=True,capture_output=True); print(p,r.returncode,r.stdout,r.stderr)\nPY\"","aggregated_output":"join(\",\",\"/\") 5  jq: runtime error: unknown function join\n\natan * 4 * 1000000|floor / 1000000 5  jq: runtime error: unknown function atan\n\ndef f: .+1; f 0 1\n \nreduce .[] as $x (0; .+$x) 0 3\n \n","exit_code":0,"status":"completed"}}
{"type":"item.started","item":{"id":"item_5","type":"command_execution","command":"/bin/bash -lc 'JQ=\"$PWD/jq\" python3 sources/run_conformance.py --select '\"'%%FAIL|if |try |reduce |foreach |def | as |label |module|include' --json > /tmp/p4.json; python3 - <<'PY'\nimport json\nx=json.load(open('/tmp/p4.json')); print(x['summary']);\nfor c in x['cases']:\n if c['status']\"'!='\"'pass': print(c['line'],c['program'],c['detail'],c.get('actual'))\nPY\"","aggregated_output":"","exit_code":null,"status":"in_progress"}}
{"type":"item.completed","item":{"id":"item_5","type":"command_execution","command":"/bin/bash -lc 'JQ=\"$PWD/jq\" python3 sources/run_conformance.py --select '\"'%%FAIL|if |try |reduce |foreach |def | as |label |module|include' --json > /tmp/p4.json; python3 - <<'PY'\nimport json\nx=json.load(open('/tmp/p4.json')); print(x['summary']);\nfor c in x['cases']:\n if c['status']\"'!='\"'pass': print(c['line'],c['program'],c['detail'],c.get('actual'))\nPY\"","aggregated_output":"Traceback (most recent call last):\n  File \"<stdin>\", line 2, in <module>\n  File \"/home/barlo/.local/share/uv/python/cpython-3.12.13-linux-x86_64-gnu/lib/python3.12/json/__init__.py\", line 293, in load\n    return loads(fp.read(),\n           ^^^^^^^^^^^^^^^^\n  File \"/home/barlo/.local/share/uv/python/cpython-3.12.13-linux-x86_64-gnu/lib/python3.12/json/__init__.py\", line 346, in loads\n    return _default_decoder.decode(s)\n           ^^^^^^^^^^^^^^^^^^^^^^^^^^\n  File \"/home/barlo/.local/share/uv/python/cpython-3.12.13-linux-x86_64-gnu/lib/python3.12/json/decoder.py\", line 338, in decode\n    obj, end = self.raw_decode(s, idx=_w(s, 0).end())\n               ^^^^^^^^^^^^^^^^^^^^^^^^^^^^^^^^^^^^^^\n  File \"/home/barlo/.local/share/uv/python/cpython-3.12.13-linux-x86_64-gnu/lib/python3.12/json/decoder.py\", line 354, in raw_decode\n    obj, end = self.scan_once(s, idx)\n               ^^^^^^^^^^^^^^^^^^^^^^\njson.decoder.JSONDecodeError: Invalid control character at: line 869 column 2147456251 (char 2147479552)\n","exit_code":1,"status":"failed"}}
{"type":"item.started","item":{"id":"item_6","type":"command_execution","command":"/bin/bash -lc \"python3 - <<'PY'\nfrom jq_interpreter.parser import parse\nfor s in ['def f: .+1; f','reduce .[] as \"'$x (0; .+$x)'\"','join(\\\",\\\",\\\"/\\\")','if true then 1 else 2 end']:\n try: print(s,parse(s))\n except Exception as e: print(type(e),e)\nPY\"","aggregated_output":"","exit_code":null,"status":"in_progress"}}
{"type":"item.completed","item":{"id":"item_6","type":"command_execution","command":"/bin/bash -lc \"python3 - <<'PY'\nfrom jq_interpreter.parser import parse\nfor s in ['def f: .+1; f','reduce .[] as \"'$x (0; .+$x)'\"','join(\\\",\\\",\\\"/\\\")','if true then 1 else 2 end']:\n try: print(s,parse(s))\n except Exception as e: print(type(e),e)\nPY\"","aggregated_output":"def f: .+1; f Node(operation='defprog', arguments=(Node(operation='def', arguments=('f', (), Node(operation='binary', arguments=('+', Node(operation='identity', arguments=()), Node(operation='literal', arguments=('1',)))))), Node(operation='call', arguments=('f', ()))))\nreduce .[] as $x (0; .+$x) Node(operation='reduce', arguments=(Node(operation='iterate', arguments=(Node(operation='identity', arguments=()),)), Node(operation='pattern_var', arguments=('x',)), Node(operation='literal', arguments=('0',)), Node(operation='binary', arguments=('+', Node(operation='identity', arguments=()), Node(operation='var', arguments=('x',)))), None))\njoin(\",\",\"/\") Node(operation='call', arguments=('join', (Node(operation='binary', arguments=(',', Node(operation='string', arguments=('\",\"',)), Node(operation='string', arguments=('\"/\"',)))),)))\nif true then 1 else 2 end Node(operation='if', arguments=(Node(operation='literal', arguments=('true',)), Node(operation='literal', arguments=('1',)), Node(operation='literal', arguments=('2',))))\n","exit_code":0,"status":"completed"}}
{"type":"item.completed","item":{"id":"item_7","type":"agent_message","text":"The failures cluster into a few general defects rather than isolated cases: keyword boolean operators are not in the expression precedence table, function-call generator arguments are being evaluated as one unsupported builtin shape, and several core arithmetic/string builtins are absent. I’m correcting those shared paths now, including jq’s remainder semantics and function-scope behavior."}}
{"type":"item.started","item":{"id":"item_8","type":"file_change","changes":[{"path":"/mnt/c/Users/barlo/projects/drydock/uat/jq/runs/20260822.044627/build/jq/jq_interpreter/parser.py","kind":"update"}],"status":"in_progress"}}
{"type":"item.completed","item":{"id":"item_8","type":"file_change","changes":[{"path":"/mnt/c/Users/barlo/projects/drydock/uat/jq/runs/20260822.044627/build/jq/jq_interpreter/parser.py","kind":"update"}],"status":"completed"}}
{"type":"item.started","item":{"id":"item_9","type":"file_change","changes":[{"path":"/mnt/c/Users/barlo/projects/drydock/uat/jq/runs/20260822.044627/build/jq/jq_interpreter/evaluator.py","kind":"update"}],"status":"in_progress"}}
{"type":"item.completed","item":{"id":"item_9","type":"file_change","changes":[{"path":"/mnt/c/Users/barlo/projects/drydock/uat/jq/runs/20260822.044627/build/jq/jq_interpreter/evaluator.py","kind":"update"}],"status":"completed"}}
{"type":"item.started","item":{"id":"item_10","type":"file_change","changes":[{"path":"/mnt/c/Users/barlo/projects/drydock/uat/jq/runs/20260822.044627/build/jq/jq_interpreter/evaluator.py","kind":"update"}],"status":"in_progress"}}
{"type":"item.completed","item":{"id":"item_10","type":"file_change","changes":[{"path":"/mnt/c/Users/barlo/projects/drydock/uat/jq/runs/20260822.044627/build/jq/jq_interpreter/evaluator.py","kind":"update"}],"status":"completed"}}
{"type":"item.started","item":{"id":"item_11","type":"command_execution","command":"/bin/bash -lc \"python3 - <<'PY'\nimport subprocess\ncases=[('join(\\\",\\\",\\\"/\\\")','[\\\"a\\\",\\\"b\\\"]'),('[.[] % 7]','[-7,-6,-1,7]'),('def f: .+1; f','null'),('if true then 1 else 2 end','null'),('.[] | . as {a:\"'$a} ?// $a | $a'\"','[[3],6]')]\nfor p,i in cases:\n r=subprocess.run(['./jq','-c',p],input=i+'\\\\n',text=True,capture_output=True);print(p, r.returncode,repr(r.stdout),repr(r.stderr))\nPY\nJQ=\\\"\"'$PWD/jq\" python3 sources/run_conformance.py --select '\"'\\\\.\\\\|\\\\[|\\\\{|\\\\+|\\\\-|\\\\*|/|%' --json > /tmp/p3.json\npython3 - <<'PY'\nimport json\nx=json.load(open('/tmp/p3.json')); print(x['summary']);\nfor c in x['cases']:\n if c['status']\"'!='\"'pass': print(c['line'],c['program'],c['detail'])\nPY\"","aggregated_output":"","exit_code":null,"status":"in_progress"}}
{"type":"item.completed","item":{"id":"item_11","type":"command_execution","command":"/bin/bash -lc \"python3 - <<'PY'\nimport subprocess\ncases=[('join(\\\",\\\",\\\"/\\\")','[\\\"a\\\",\\\"b\\\"]'),('[.[] % 7]','[-7,-6,-1,7]'),('def f: .+1; f','null'),('if true then 1 else 2 end','null'),('.[] | . as {a:\"'$a} ?// $a | $a'\"','[[3],6]')]\nfor p,i in cases:\n r=subprocess.run(['./jq','-c',p],input=i+'\\\\n',text=True,capture_output=True);print(p, r.returncode,repr(r.stdout),repr(r.stderr))\nPY\nJQ=\\\"\"'$PWD/jq\" python3 sources/run_conformance.py --select '\"'\\\\.\\\\|\\\\[|\\\\{|\\\\+|\\\\-|\\\\*|/|%' --json > /tmp/p3.json\npython3 - <<'PY'\nimport json\nx=json.load(open('/tmp/p3.json')); print(x['summary']);\nfor c in x['cases']:\n if c['status']\"'!='\"'pass': print(c['line'],c['program'],c['detail'])\nPY\"","aggregated_output":"join(\",\",\"/\") 0 '\"a,b\"\\n\"a/b\"\\n' ''\n[.[] % 7] 0 '[-0.0,-6.0,-1.0,0.0]\\n' ''\ndef f: .+1; f 0 '1\\n' ''\nif true then 1 else 2 end 0 '1\\n' ''\n.[] | . as {a:$a} ?// $a | $a 0 '[3]\\n6\\n' ''\n{'pass': 107, 'fail': 101, 'error': 1, 'skip': 1}\n122 {\"a\",b,\"a$\\(1+1)\"} output mismatch\n127 {(0):1} program was accepted, but the corpus marks it %%FAIL\n139 {non_const:., (0):1} program was accepted, but the corpus marks it %%FAIL\n213 try (.foo[-1] = 0) catch . output mismatch\n217 try (.foo[-2] = 0) catch . output mismatch\n277 {x: (1,2)},{x:3} | .x output mismatch\n283 [.[-4,-3,-2,-1,0,1,2,3]] output mismatch\n311 [while(.<100; .*2)] output mismatch\n329 [.[]|[.,1]|until(.[0] < 1; [.[0] - 1, .[1] * .[0]])|.[1]] output mismatch\n349 [-foreach -.[] as $x (0; . + $x)] output mismatch\n353 [foreach .[] / .[] as $i (0; . + $i)] output mismatch\n373 try limit(-1; error) catch . output mismatch\n389 try skip(-1; error) catch . output mismatch\n405 [nth(0,5,9,10,15; range(.)), try nth(-1; range(.)) catch .] output mismatch\n425 [nth(5,7; range(9;0;-1))] output mismatch\n466 [.[3:2], .[-5:4], .[:-2], .[-2:], .[3:3][1:], .[10:]] output mismatch\n470 [.[3:2], .[-5:4], .[:-2], .[-2:], .[3:3][1:], .[10:]] output mismatch\n474 del(.[2:4],.[0],.[-2:]) output mismatch\n530 . as {as: $kw, \"str\": $str, (\"e\"+\"x\"+\"p\"): $exp} | [$kw, $str, $exp] program did not compile: jq: compile error: expected ,\n617 {\"a\":1} + {\"b\":2} + {\"c\":3} output mismatch\n633 [1,2,3,4,1] - [.,3] output mismatch\n661 9E999999999, 9999999999E999999990, 1E-999999999, 0.000000001E-999999990 output mismatch\n689 [(infinite, -infinite) % (1, -1, infinite)] output mismatch\n693 [nan % 1, 1 % nan | isnan] output mismatch\n697 1 + tonumber + (\"10\" | tonumber) output mismatch\n725 [{\"a\":42},.object,10,.num,false,true,null,\"b\",[1,4]] | .[] as $x | [$x == .[]] output mismatch\n762 map_values(.+1) output mismatch\n775 add({(.[]):1}) | keys output mismatch\n798 def f: 1; def g: f, def f: 2; def g: 3; f, def f: g; f, g; def f: 4; [f, def f: g; def g: 5; f, g]+[f,g] output mismatch\n868 def f: .+1; def g: f; def f: .+100; def f(a):a+.+11; [(g|f(20)), f] output mismatch\n873 def id(x):x; 2000 as $x | def f(x):1 as $x | id([$x, x, x]); def g(x): 100 as $x | f($x,$x+x); g($x) exited 1: Traceback (most recent call last):\n878 def x(a;b): a as $a | b as $b | $a + $b; def y($a;$b): $a + $b; def check(a;b): [x(a;b)] == [y(a;b)]; check(.[];.[]*2) exited 1: Traceback (most recent call last):\n884 [[20,10][1,0] as $x | def f: (100,200) as $y | def g: [$x + $y, .]; . + $x | g; f[0] | [f][0][1] | f] output mismatch\n911 [-reduce -.[] as $x (0; . + $x)] output mismatch\n933 . as {$a, $b:[$c, $d]}| [$a, $b, $c, $d] output mismatch\n938 .[] | . as {$a, b: [$c, {$d}]} ?// [$a, {$b}, $e] ?// $f | [$a, $b, $c, $d, $e, $f] output mismatch\n1169 delpaths([[-200]]) output mismatch\n1184 del(.[1], .[-6], .[2], .[-3:9]) output mismatch\n1197 setpath([-1]; 1) output mismatch\n1245 .foo += .foo output mismatch\n1253 def inc(x): x |= .+1; inc(.[].a) output mismatch\n1274 .[] |= select(. % 2 == 0) output mismatch\n1294 try ((map(select(.a == 1))[].a) |= .+1) catch . output mismatch\n1370 [.[] | [.foo[] // .bar]] output mismatch\n1374 .[] //= .[0] output mismatch\n1411 [{\"foo\":42} == {\"foo\":42},{\"foo\":42} != {\"foo\":42}, {\"foo\":42} != {\"bar\":42}, {\"foo\":42} == {\"bar\":42}] output mismatch\n1416 [{\"foo\":[1,2,{\"bar\":18},\"world\"]} == {\"foo\":[1,2,{\"bar\":18},\"world\"]},{\"foo\":[1,2,{\"bar\":18},\"world\"]} == {\"foo\":[1,2,{\"bar\":19},\"world\"]}] output mismatch\n1464 try error(0) // 1 output mismatch\n1473 1 + try 2 catch 3 + 4 output mismatch\n1481 try -.? catch . output mismatch\n1485 {x: try 1, y: try error catch 2, z: if true then 3 end} program did not compile: jq: compile error: expected ,\n1625 [.[] * \"abc\"] output mismatch\n1629 [. * (nan,-nan)] output mismatch\n1633 . * 100000 | [.[:10],.[-10:]] program did not compile: jq: compile error: expected ]\n1641 try (. * 1000000000) catch . timed out after 10s\n1661 [({foo: 12, bar:13} | contains({foo: 12})), ({foo: 12} | contains({})), ({foo: 12, bar:13} | contains({baz:14}))] output mismatch\n1665 {foo: {baz: 12, blap: {bar: 13}}, bar: 14} | contains({bar: 14, foo: {blap: {}}}) output mismatch\n1669 {foo: {baz: 12, blap: {bar: 13}}, bar: 14} | contains({bar: 14, foo: {blap: {bar: 14}}}) output mismatch\n1677 (sort_by(.b) | sort_by(.a)), sort_by(.a, .b), sort_by(.b, .c), group_by(.b), group_by(.a + .b - .c == 2) output mismatch\n1721 with_entries(.key |= \"KEY_\" + .) output mismatch\n1751 {\"k\": {\"a\": 1, \"b\": 2}} * . output mismatch\n1755 {\"k\": {\"a\": 1, \"b\": 2}, \"hello\": {\"x\": 1}} * . output mismatch\n1759 {\"k\": {\"a\": 1, \"b\": 2}, \"hello\": 1} * . output mismatch\n1763 {\"a\": {\"b\": 1}, \"c\": {\"d\": 2}, \"e\": 5} * . output mismatch\n1811 try flatten(-1) catch . output mismatch\n1835 bsearch({x:1}) output mismatch\n1843 strftime(\"%Y-%m-%dT%H:%M:%SZ\") output mismatch\n1847 strftime(\"%A, %B %d, %Y\") output mismatch\n1851 strftime(\"%Y-%m-%dT%H:%M:%SZ\") output mismatch\n1868 try strftime(\"%Y-%m-%dT%H:%M:%SZ\") catch . output mismatch\n1872 try strflocaltime(\"%Y-%m-%dT%H:%M:%SZ\") catch . output mismatch\n1885 try [\"OK\", strflocaltime({})] catch [\"KO\", .] output mismatch\n1889 [strptime(\"%Y-%m-%dT%H:%M:%SZ\")|(.,mktime)] output mismatch\n1895 last(range(365 * 67)|(\"1970-03-01T01:02:03Z\"|strptime(\"%Y-%m-%dT%H:%M:%SZ\")|mktime) + (86400 * .)|strftime(\"%Y-%m-%dT%H:%M:%SZ\")|strptime(\"%Y-%m-%dT%H:%M:%SZ\")) output mismatch\n1917 import \"data\" as $a; import \"data\" as $b; def f: {$a, $b}; f declared in exclusions.txt\n1997 try -. catch . output mismatch\n2001 try (.-.) catch . output mismatch\n2005 \"x\" * range(0; 12; 2) + \"☆\" * 8 | try -. catch . output mismatch\n2014 try (. + \"x\") catch . == if have_decnum then \"number (12345678901234567890123456...) and string (\\\"x\\\") cannot be added\" else \"number (12345678901234568000000000...) and string (\\\"x\\\") cannot be added\" end output mismatch\n2067 [range(-52;52;1)] as $powers | [$powers[]|pow(2;.)|log2|round] == $powers program did not compile: jq: compile error: expected ]\n2071 [range(-99/2;99/2;1)] as $orig | [$orig[]|pow(2;.)|log2] as $back | ($orig|keys)[]|. as $k | (($orig|.[$k])-($back|.[$k]))|if . < 0 then . * -1 else . end|select(.>.00005) program did not compile: jq: compile error: expected ]\n2075 { exited 1; a rejected program must exit 3\n2086 (.[{}] = 0)? output mismatch\n2093 JOIN({\"0\":[0,\"abc\"],\"1\":[1,\"bcd\"],\"2\":[2,\"def\"],\"3\":[3,\"efg\"],\"4\":[4,\"fgh\"]}; .[0]|tostring) output mismatch\n2161 \"-1\"|IN(builtins[] / \"/\"|.[1]) output mismatch\n2165 all(builtins[] / \"/\"; .[1]|tonumber >= 0) output mismatch\n2211 . - 10 output mismatch\n2215 .[0] - 10 output mismatch\n2219 .x - 10 output mismatch\n2224 -. | tojson == if have_decnum then \"-13911860366432393\" else \"-13911860366432392\" end output mismatch\n2228 -. | tojson == if have_decnum then \"0.12345678901234567890123456789\" else \"0.12345678901234568\" end output mismatch\n2232 [1E+1000,-1E+1000 | tojson] == if have_decnum then [\"1E+1000\",\"-1E+1000\"] else [\"1.7976931348623157e+308\",\"-1.7976931348623157e+308\"] end output mismatch\n2241 .[] as $n | $n+0 | [., tostring, . == $n] output mismatch\n2271 [1E+1000,-1E+1000 | abs | tojson] | unique == if have_decnum then [\"1E+1000\"] else [\"1.7976931348623157e+308\"] end output mismatch\n2275 [1E+1000,-1E+1000 | length | tojson] | unique == if have_decnum then [\"1E+1000\"] else [\"1.7976931348623157e+308\"] end output mismatch\n2304 { a, $__loc__, c } output mismatch\n2308 1 as $x | \"2\" as $y | \"3\" as $z | { $x, as, $y: 4, ($z): 5, if: 6, foo: 7 } output mismatch\n2430 walk(select(IN({}, []) | not)) output mismatch\n2538 foreach .[] as $x (0, 1; . + $x) output mismatch\n2607 reduce range(10000) as $_ ({}; {a: .}) as $x | $x * $x | length output mismatch\n2611 try (reduce range(10001) as $_ ({}; {a: .}) as $x | $x * $x) catch . output mismatch\n2629 try ((reduce range(10001) as $_ ({}; {a: .})) as $x | [$x, $x] | sort) catch . output mismatch\n2633 try ((reduce range(10001) as $_ ({}; {a: .})) as $x | [$x, $x] | unique) catch . output mismatch\n","exit_code":0,"status":"completed"}}
{"type":"item.started","item":{"id":"item_12","type":"command_execution","command":"/bin/bash -lc \"python3 - <<'PY'\nfrom jq_interpreter.parser import parse\nfor s in ['[range(-52;52;1)] as \"'$powers | [$powers[]|pow(2;.)|log2|round] == $powers'\"','[range(-99/2;99/2;1)] as \"'$orig | [$orig[]|pow(2;.)|log2] as $back | ($orig|keys)[]'\"']:\n try: print(parse(s))\n except Exception as e: print(repr(e))\nPY\"","aggregated_output":"","exit_code":null,"status":"in_progress"}}
{"type":"item.completed","item":{"id":"item_12","type":"command_execution","command":"/bin/bash -lc \"python3 - <<'PY'\nfrom jq_interpreter.parser import parse\nfor s in ['[range(-52;52;1)] as \"'$powers | [$powers[]|pow(2;.)|log2|round] == $powers'\"','[range(-99/2;99/2;1)] as \"'$orig | [$orig[]|pow(2;.)|log2] as $back | ($orig|keys)[]'\"']:\n try: print(parse(s))\n except Exception as e: print(repr(e))\nPY\"","aggregated_output":"CompileError('expected ]')\nCompileError('expected ]')\n","exit_code":0,"status":"completed"}}
{"type":"item.started","item":{"id":"item_13","type":"command_execution","command":"/bin/bash -lc \"python3 - <<'PY'\nfrom jq_interpreter.parser import Parser\ns='[range(-52;52;1)]'\np=Parser(s)\ntry: print(p.parse())\nexcept Exception as e: print(e, 'at',p.i,p.p(),[x.text for x in p.t[max(0,p.i-4):p.i+4]])\nPY\"","aggregated_output":"","exit_code":null,"status":"in_progress"}}
{"type":"item.completed","item":{"id":"item_13","type":"command_execution","command":"/bin/bash -lc \"python3 - <<'PY'\nfrom jq_interpreter.parser import Parser\ns='[range(-52;52;1)]'\np=Parser(s)\ntry: print(p.parse())\nexcept Exception as e: print(e, 'at',p.i,p.p(),[x.text for x in p.t[max(0,p.i-4):p.i+4]])\nPY\"","aggregated_output":"Node(operation='array', arguments=(Node(operation='call', arguments=('range', (Node(operation='unary', arguments=('-', Node(operation='literal', arguments=('52',)))), Node(operation='literal', arguments=('52',)), Node(operation='literal', arguments=('1',))))),))\n","exit_code":0,"status":"completed"}}
{"type":"item.started","item":{"id":"item_14","type":"command_execution","command":"/bin/bash -lc \"python3 - <<'PY'\nfrom jq_interpreter.parser import Parser\nfor s in ['[\"'$powers[]|pow(2;.)|log2|round]'\"','[range(-52;52;1)] as \"'$powers | [$powers[]|pow(2;.)|log2|round]'\"']:\n p=Parser(s)\n try: print(p.parse())\n except Exception as e: print(e,p.i,p.p(),[x.text for x in p.t[max(0,p.i-5):p.i+5]])\nPY\"","aggregated_output":"","exit_code":null,"status":"in_progress"}}
{"type":"item.completed","item":{"id":"item_14","type":"command_execution","command":"/bin/bash -lc \"python3 - <<'PY'\nfrom jq_interpreter.parser import Parser\nfor s in ['[\"'$powers[]|pow(2;.)|log2|round]'\"','[range(-52;52;1)] as \"'$powers | [$powers[]|pow(2;.)|log2|round]'\"']:\n p=Parser(s)\n try: print(p.parse())\n except Exception as e: print(e,p.i,p.p(),[x.text for x in p.t[max(0,p.i-5):p.i+5]])\nPY\"","aggregated_output":"expected ] 2 [ ['[', '$powers', '[', ']', '|', 'pow', '(']\nexpected ] 16 [ ['as', '$powers', '|', '[', '$powers', '[', ']', '|', 'pow', '(']\n","exit_code":0,"status":"completed"}}
{"type":"item.started","item":{"id":"item_15","type":"file_change","changes":[{"path":"/mnt/c/Users/barlo/projects/drydock/uat/jq/runs/20260822.044627/build/jq/jq_interpreter/parser.py","kind":"update"}],"status":"in_progress"}}
{"type":"item.completed","item":{"id":"item_15","type":"file_change","changes":[{"path":"/mnt/c/Users/barlo/projects/drydock/uat/jq/runs/20260822.044627/build/jq/jq_interpreter/parser.py","kind":"update"}],"status":"completed"}}
{"type":"item.started","item":{"id":"item_16","type":"command_execution","command":"/bin/bash -lc \"python3 - <<'PY'\nfrom jq_interpreter.parser import parse\nprint(parse('[range(-52;52;1)] as \"'$powers | [$powers[]|pow(2;.)|log2|round] == $powers'\"'))\nPY\nJQ=\\\"\"'$PWD/jq\" python3 sources/run_conformance.py --select '\"'%%FAIL|if |try |reduce |foreach |def | as |label |module|include' --json > /tmp/p4b.json\"","aggregated_output":"","exit_code":null,"status":"in_progress"}}
{"type":"item.started","item":{"id":"item_17","type":"command_execution","command":"/bin/bash -lc \"python3 - <<'PY'\nimport json\nx=json.load(open('/tmp/p4b.json'));print(x['summary']);\nfor c in x['cases']:\n if c['status']\"'!='\"'pass': print(c['line'],c['program'],c['detail'])\nPY\"","aggregated_output":"","exit_code":null,"status":"in_progress"}}
{"type":"item.completed","item":{"id":"item_16","type":"command_execution","command":"/bin/bash -lc \"python3 - <<'PY'\nfrom jq_interpreter.parser import parse\nprint(parse('[range(-52;52;1)] as \"'$powers | [$powers[]|pow(2;.)|log2|round] == $powers'\"'))\nPY\nJQ=\\\"\"'$PWD/jq\" python3 sources/run_conformance.py --select '\"'%%FAIL|if |try |reduce |foreach |def | as |label |module|include' --json > /tmp/p4b.json\"","aggregated_output":"Node(operation='bind', arguments=(Node(operation='array', arguments=(Node(operation='call', arguments=('range', (Node(operation='unary', arguments=('-', Node(operation='literal', arguments=('52',)))), Node(operation='literal', arguments=('52',)), Node(operation='literal', arguments=('1',))))),)), Node(operation='pattern_var', arguments=('powers',)), Node(operation='binary', arguments=('==', Node(operation='array', arguments=(Node(operation='binary', arguments=('|', Node(operation='binary', arguments=('|', Node(operation='binary', arguments=('|', Node(operation='iterate', arguments=(Node(operation='var', arguments=('powers',)),)), Node(operation='call', arguments=('pow', (Node(operation='literal', arguments=('2',)), Node(operation='identity', arguments=())))))), Node(operation='call', arguments=('log2', ())))), Node(operation='call', arguments=('round', ())))),)), Node(operation='var', arguments=('powers',))))))\n","exit_code":1,"status":"failed"}}
{"type":"item.completed","item":{"id":"item_17","type":"command_execution","command":"/bin/bash -lc \"python3 - <<'PY'\nimport json\nx=json.load(open('/tmp/p4b.json'));print(x['summary']);\nfor c in x['cases']:\n if c['status']\"'!='\"'pass': print(c['line'],c['program'],c['detail'])\nPY\"","aggregated_output":"Traceback (most recent call last):\n  File \"<stdin>\", line 2, in <module>\n  File \"/home/barlo/.local/share/uv/python/cpython-3.12.13-linux-x86_64-gnu/lib/python3.12/json/__init__.py\", line 293, in load\n    return loads(fp.read(),\n           ^^^^^^^^^^^^^^^^\n  File \"/home/barlo/.local/share/uv/python/cpython-3.12.13-linux-x86_64-gnu/lib/python3.12/json/__init__.py\", line 346, in loads\n    return _default_decoder.decode(s)\n           ^^^^^^^^^^^^^^^^^^^^^^^^^^\n  File \"/home/barlo/.local/share/uv/python/cpython-3.12.13-linux-x86_64-gnu/lib/python3.12/json/decoder.py\", line 338, in decode\n    obj, end = self.raw_decode(s, idx=_w(s, 0).end())\n               ^^^^^^^^^^^^^^^^^^^^^^^^^^^^^^^^^^^^^^\n  File \"/home/barlo/.local/share/uv/python/cpython-3.12.13-linux-x86_64-gnu/lib/python3.12/json/decoder.py\", line 354, in raw_decode\n    obj, end = self.scan_once(s, idx)\n               ^^^^^^^^^^^^^^^^^^^^^^\njson.decoder.JSONDecodeError: Invalid control character at: line 802 column 2147457900 (char 2147479552)\n","exit_code":1,"status":"failed"}}
{"type":"item.started","item":{"id":"item_18","type":"command_execution","command":"/bin/bash -lc \"for s in '%%FAIL' 'if ' 'try ' 'reduce ' 'foreach ' 'def ' ' as ' 'label ';module|include'; do echo \\\"\"'$s\"; JQ=\"$PWD/jq\" timeout 25 python3 sources/run_conformance.py --select \"$s\" --json > /tmp/x.json; python3 - <<'\"'PY'\nimport json\ntry:\n x=json.load(open('/tmp/x.json'));print(x['summary'])\nexcept Exception as e: print('bad',e)\nPY\ndone\"","aggregated_output":"","exit_code":null,"status":"in_progress"}}
{"type":"item.completed","item":{"id":"item_18","type":"command_execution","command":"/bin/bash -lc \"for s in '%%FAIL' 'if ' 'try ' 'reduce ' 'foreach ' 'def ' ' as ' 'label ';module|include'; do echo \\\"\"'$s\"; JQ=\"$PWD/jq\" timeout 25 python3 sources/run_conformance.py --select \"$s\" --json > /tmp/x.json; python3 - <<'\"'PY'\nimport json\ntry:\n x=json.load(open('/tmp/x.json'));print(x['summary'])\nexcept Exception as e: print('bad',e)\nPY\ndone\"","aggregated_output":"/bin/bash: -c: line 1: syntax error near unexpected token `module'\n/bin/bash: -c: line 1: `for s in '%%FAIL' 'if ' 'try ' 'reduce ' 'foreach ' 'def ' ' as ' 'label ';module|include'; do echo \"$s\"; JQ=\"$PWD/jq\" timeout 25 python3 sources/run_conformance.py --select \"$s\" --json > /tmp/x.json; python3 - <<'PY''\n","exit_code":2,"status":"failed"}}
{"type":"item.started","item":{"id":"item_19","type":"command_execution","command":"/bin/bash -lc 'JQ=\"$PWD/jq\" timeout 25 python3 sources/run_conformance.py --select '\"'def ' --json > /tmp/def.json; python3 -c 'import json; x=json.load(open(\\\"/tmp/def.json\\\")); print(x[\\\"summary\\\"])'\"","aggregated_output":"","exit_code":null,"status":"in_progress"}}
{"type":"item.completed","item":{"id":"item_19","type":"command_execution","command":"/bin/bash -lc 'JQ=\"$PWD/jq\" timeout 25 python3 sources/run_conformance.py --select '\"'def ' --json > /tmp/def.json; python3 -c 'import json; x=json.load(open(\\\"/tmp/def.json\\\")); print(x[\\\"summary\\\"])'\"","aggregated_output":"{'pass': 8, 'fail': 7, 'error': 0, 'skip': 2}\n","exit_code":0,"status":"completed"}}
{"type":"item.completed","item":{"id":"item_20","type":"agent_message","text":"The parser now correctly handles variable postfix access and the previously failing nested generator expression compiles. The scoped corpus still exposes a much larger evaluator surface than this partial implementation currently provides; I’m applying the remaining high-leverage expression semantics (dynamic object-key rejection, string/object multiplication, and assignment path behavior) before the final mandated reruns."}}
{"type":"item.started","item":{"id":"item_21","type":"file_change","changes":[{"path":"/mnt/c/Users/barlo/projects/drydock/uat/jq/runs/20260822.044627/build/jq/jq_interpreter/parser.py","kind":"update"}],"status":"in_progress"}}
{"type":"item.completed","item":{"id":"item_21","type":"file_change","changes":[{"path":"/mnt/c/Users/barlo/projects/drydock/uat/jq/runs/20260822.044627/build/jq/jq_interpreter/parser.py","kind":"update"}],"status":"completed"}}
{"type":"item.started","item":{"id":"item_22","type":"file_change","changes":[{"path":"/mnt/c/Users/barlo/projects/drydock/uat/jq/runs/20260822.044627/build/jq/jq_interpreter/parser.py","kind":"update"}],"status":"in_progress"}}
{"type":"item.completed","item":{"id":"item_22","type":"file_change","changes":[{"path":"/mnt/c/Users/barlo/projects/drydock/uat/jq/runs/20260822.044627/build/jq/jq_interpreter/parser.py","kind":"update"}],"status":"completed"}}
{"type":"item.started","item":{"id":"item_23","type":"file_change","changes":[{"path":"/mnt/c/Users/barlo/projects/drydock/uat/jq/runs/20260822.044627/build/jq/jq_interpreter/parser.py","kind":"update"}],"status":"in_progress"}}
{"type":"item.completed","item":{"id":"item_23","type":"file_change","changes":[{"path":"/mnt/c/Users/barlo/projects/drydock/uat/jq/runs/20260822.044627/build/jq/jq_interpreter/parser.py","kind":"update"}],"status":"completed"}}
{"type":"item.started","item":{"id":"item_24","type":"file_change","changes":[{"path":"/mnt/c/Users/barlo/projects/drydock/uat/jq/runs/20260822.044627/build/jq/jq_interpreter/evaluator.py","kind":"update"}],"status":"in_progress"}}
{"type":"item.completed","item":{"id":"item_24","type":"file_change","changes":[{"path":"/mnt/c/Users/barlo/projects/drydock/uat/jq/runs/20260822.044627/build/jq/jq_interpreter/evaluator.py","kind":"update"}],"status":"completed"}}
{"type":"item.started","item":{"id":"item_25","type":"command_execution","command":"/bin/bash -lc \"python3 -m py_compile jq_interpreter/*.py && python3 - <<'PY'\nimport subprocess\nfor p,i in [('(0):1','null'),('{(0):1}','null'),('\\\"a\\\"*3','null'),('{\\\"a\\\":{\\\"x\\\":1}} * {\\\"a\\\":{\\\"y\\\":2}}','null')]:\n r=subprocess.run(['./jq','-c',p],input=i+'\\\\n',text=True,capture_output=True);print(p,r.returncode,repr(r.stdout),repr(r.stderr))\nPY\nJQ=\\\"\"'$PWD/jq\" python3 sources/run_conformance.py --select '\"'\\\\.\\\\|\\\\[|\\\\{|\\\\+|\\\\-|\\\\*|/|%' --json > /tmp/final3.json; python3 -c 'import json; print(json.load(open(\\\"/tmp/final3.json\\\"))[\\\"summary\\\"])'\"","aggregated_output":"","exit_code":null,"status":"in_progress"}}
{"type":"item.completed","item":{"id":"item_25","type":"command_execution","command":"/bin/bash -lc \"python3 -m py_compile jq_interpreter/*.py && python3 - <<'PY'\nimport subprocess\nfor p,i in [('(0):1','null'),('{(0):1}','null'),('\\\"a\\\"*3','null'),('{\\\"a\\\":{\\\"x\\\":1}} * {\\\"a\\\":{\\\"y\\\":2}}','null')]:\n r=subprocess.run(['./jq','-c',p],input=i+'\\\\n',text=True,capture_output=True);print(p,r.returncode,repr(r.stdout),repr(r.stderr))\nPY\nJQ=\\\"\"'$PWD/jq\" python3 sources/run_conformance.py --select '\"'\\\\.\\\\|\\\\[|\\\\{|\\\\+|\\\\-|\\\\*|/|%' --json > /tmp/final3.json; python3 -c 'import json; print(json.load(open(\\\"/tmp/final3.json\\\"))[\\\"summary\\\"])'\"","aggregated_output":"  File \"jq_interpreter/evaluator.py\", line 235\n    merged[key]=next(_node(Node('binary',('*',Node('literal',(json.dumps(merged[key])),),Node('literal',(json.dumps(item)),)),None,env), merged[key])\n                    ^\nSyntaxError: '(' was never closed\n{'pass': 0, 'fail': 209, 'error': 0, 'skip': 1}\n","exit_code":0,"status":"completed"}}
{"type":"item.started","item":{"id":"item_26","type":"file_change","changes":[{"path":"/mnt/c/Users/barlo/projects/drydock/uat/jq/runs/20260822.044627/build/jq/jq_interpreter/evaluator.py","kind":"update"}],"status":"in_progress"}}
{"type":"item.completed","item":{"id":"item_26","type":"file_change","changes":[{"path":"/mnt/c/Users/barlo/projects/drydock/uat/jq/runs/20260822.044627/build/jq/jq_interpreter/evaluator.py","kind":"update"}],"status":"completed"}}
{"type":"item.started","item":{"id":"item_27","type":"command_execution","command":"/bin/bash -lc \"python3 -m py_compile jq_interpreter/*.py && python3 - <<'PY'\nimport subprocess\nfor p,i in [('\\\"a\\\"*3','null'),('{\\\"a\\\":{\\\"x\\\":1}} * {\\\"a\\\":{\\\"y\\\":2}}','null'),('{(0):1}','null')]:\n r=subprocess.run(['./jq','-c',p],input=i+'\\\\n',text=True,capture_output=True);print(p,r.returncode,repr(r.stdout),repr(r.stderr))\nPY\nJQ=\\\"\"'$PWD/jq\" python3 sources/run_conformance.py --select '\"'\\\\.\\\\|\\\\[|\\\\{|\\\\+|\\\\-|\\\\*|/|%' --json > /tmp/final3.json; python3 -c 'import json; print(json.load(open(\\\"/tmp/final3.json\\\"))[\\\"summary\\\"])'\"","aggregated_output":"","exit_code":null,"status":"in_progress"}}
{"type":"item.completed","item":{"id":"item_27","type":"command_execution","command":"/bin/bash -lc \"python3 -m py_compile jq_interpreter/*.py && python3 - <<'PY'\nimport subprocess\nfor p,i in [('\\\"a\\\"*3','null'),('{\\\"a\\\":{\\\"x\\\":1}} * {\\\"a\\\":{\\\"y\\\":2}}','null'),('{(0):1}','null')]:\n r=subprocess.run(['./jq','-c',p],input=i+'\\\\n',text=True,capture_output=True);print(p,r.returncode,repr(r.stdout),repr(r.stderr))\nPY\nJQ=\\\"\"'$PWD/jq\" python3 sources/run_conformance.py --select '\"'\\\\.\\\\|\\\\[|\\\\{|\\\\+|\\\\-|\\\\*|/|%' --json > /tmp/final3.json; python3 -c 'import json; print(json.load(open(\\\"/tmp/final3.json\\\"))[\\\"summary\\\"])'\"","aggregated_output":"\"a\"*3 0 '\"aaa\"\\n' ''\n{\"a\":{\"x\":1}} * {\"a\":{\"y\":2}} 0 '{\"a\":{\"x\":1,\"y\":2}}\\n' ''\n{(0):1} 3 '' 'jq: compile error: object key must be a string\\n'\nTraceback (most recent call last):\n  File \"<string>\", line 1, in <module>\n  File \"/home/barlo/.local/share/uv/python/cpython-3.12.13-linux-x86_64-gnu/lib/python3.12/json/__init__.py\", line 293, in load\n    return loads(fp.read(),\n           ^^^^^^^^^^^^^^^^\n  File \"/home/barlo/.local/share/uv/python/cpython-3.12.13-linux-x86_64-gnu/lib/python3.12/json/__init__.py\", line 346, in loads\n    return _default_decoder.decode(s)\n           ^^^^^^^^^^^^^^^^^^^^^^^^^^\n  File \"/home/barlo/.local/share/uv/python/cpython-3.12.13-linux-x86_64-gnu/lib/python3.12/json/decoder.py\", line 338, in decode\n    obj, end = self.raw_decode(s, idx=_w(s, 0).end())\n               ^^^^^^^^^^^^^^^^^^^^^^^^^^^^^^^^^^^^^^\n  File \"/home/barlo/.local/share/uv/python/cpython-3.12.13-linux-x86_64-gnu/lib/python3.12/json/decoder.py\", line 354, in raw_decode\n    obj, end = self.scan_once(s, idx)\n               ^^^^^^^^^^^^^^^^^^^^^^\njson.decoder.JSONDecodeError: Invalid control character at: line 647 column 2147463254 (char 2147479552)\n","exit_code":1,"status":"failed"}}
{"type":"item.started","item":{"id":"item_28","type":"command_execution","command":"/bin/bash -lc 'ls -lh /tmp/final3.json; tail -c 200 /tmp/final3.json | head -c 200; JQ=\"$PWD/jq\" timeout 90 python3 sources/run_conformance.py --select '\"'%%FAIL|if |try |reduce |foreach |def | as |label |module|include' --json > /tmp/final4.json; echo exit:\"'$?; ls -lh /tmp/final4.json'","aggregated_output":"","exit_code":null,"status":"in_progress"}}
{"type":"item.completed","item":{"id":"item_29","type":"agent_message","text":"A regression check revealed a safety issue in the partial evaluator: jq’s corpus includes a deliberately oversized string multiplication case, and the current implementation materializes that output before the harness can classify it. I’m correcting this bounded-result behavior so the candidate fails cleanly at runtime instead of producing unbounded output, then I’ll run syntax/tests and report the exact scoped status."}}
{"type":"item.started","item":{"id":"item_30","type":"file_change","changes":[{"path":"/mnt/c/Users/barlo/projects/drydock/uat/jq/runs/20260822.044627/build/jq/jq_interpreter/evaluator.py","kind":"update"}],"status":"in_progress"}}
{"type":"item.completed","item":{"id":"item_30","type":"file_change","changes":[{"path":"/mnt/c/Users/barlo/projects/drydock/uat/jq/runs/20260822.044627/build/jq/jq_interpreter/evaluator.py","kind":"update"}],"status":"completed"}}
{"type":"item.completed","item":{"id":"item_28","type":"command_execution","command":"/bin/bash -lc 'ls -lh /tmp/final3.json; tail -c 200 /tmp/final3.json | head -c 200; JQ=\"$PWD/jq\" timeout 90 python3 sources/run_conformance.py --select '\"'%%FAIL|if |try |reduce |foreach |def | as |label |module|include' --json > /tmp/final4.json; echo exit:\"'$?; ls -lh /tmp/final4.json'","aggregated_output":"exit:1\n-rw-r--r-- 1 barlo barlo 2.0G Aug 22 17:02 /tmp/final4.json\n","exit_code":0,"status":"completed"}}
{"type":"item.started","item":{"id":"item_31","type":"command_execution","command":"/bin/bash -lc 'python3 -m py_compile jq_interpreter/*.py && pytest -q'","aggregated_output":"","exit_code":null,"status":"in_progress"}}
{"type":"item.completed","item":{"id":"item_31","type":"command_execution","command":"/bin/bash -lc 'python3 -m py_compile jq_interpreter/*.py && pytest -q'","aggregated_output":"................................                                         [100%]\n32 passed in 5.15s\n","exit_code":0,"status":"completed"}}
{"type":"item.started","item":{"id":"item_32","type":"command_execution","command":"/bin/bash -lc 'JQ=\"$PWD/jq\" timeout 60 python3 sources/run_conformance.py --select '\"'\\\\.\\\\|\\\\[|\\\\{|\\\\+|\\\\-|\\\\*|/|%' --json > /tmp/p3-final.json; p3=\"'$?; JQ=\"$PWD/jq\" timeout 60 python3 sources/run_conformance.py --select '\"'%%FAIL|if |try |reduce |foreach |def | as |label |module|include' --json > /tmp/p4-final.json; p4=\"'$?; python3 - <<'\"'PY'\nimport json, os\nfor n in ('p3-final.json','p4-final.json'):\n try: print(n, os.path.getsize('/tmp/'+n), json.load(open('/tmp/'+n))['summary'])\n except Exception as e: print(n,'unavailable',e)\nPY\nprintf 'exit %s %s\\\\n' \\\"\"'$p3\" \"$p4\"'","aggregated_output":"","exit_code":null,"status":"in_progress"}}
{"type":"item.completed","item":{"id":"item_32","type":"command_execution","command":"/bin/bash -lc 'JQ=\"$PWD/jq\" timeout 60 python3 sources/run_conformance.py --select '\"'\\\\.\\\\|\\\\[|\\\\{|\\\\+|\\\\-|\\\\*|/|%' --json > /tmp/p3-final.json; p3=\"'$?; JQ=\"$PWD/jq\" timeout 60 python3 sources/run_conformance.py --select '\"'%%FAIL|if |try |reduce |foreach |def | as |label |module|include' --json > /tmp/p4-final.json; p4=\"'$?; python3 - <<'\"'PY'\nimport json, os\nfor n in ('p3-final.json','p4-final.json'):\n try: print(n, os.path.getsize('/tmp/'+n), json.load(open('/tmp/'+n))['summary'])\n except Exception as e: print(n,'unavailable',e)\nPY\nprintf 'exit %s %s\\\\n' \\\"\"'$p3\" \"$p4\"'","aggregated_output":"p3-final.json 30892 {'pass': 115, 'fail': 94, 'error': 0, 'skip': 1}\np4-final.json 48447 {'pass': 87, 'fail': 124, 'error': 0, 'skip': 13}\nexit 1 1\n","exit_code":0,"status":"completed"}}
{"type":"item.started","item":{"id":"item_33","type":"command_execution","command":"/bin/bash -lc \"find jq_interpreter -maxdepth 1 -type f -newermt '2026-08-22 16:00' -printf '%p\\\\n'; ls -lh /tmp/p3-final.json /tmp/p4-final.json 2>/dev/null || true\"","aggregated_output":"","exit_code":null,"status":"in_progress"}}
{"type":"item.completed","item":{"id":"item_33","type":"command_execution","command":"/bin/bash -lc \"find jq_interpreter -maxdepth 1 -type f -newermt '2026-08-22 16:00' -printf '%p\\\\n'; ls -lh /tmp/p3-final.json /tmp/p4-final.json 2>/dev/null || true\"","aggregated_output":"jq_interpreter/ast.py\njq_interpreter/evaluator.py\njq_interpreter/parser.py\n-rw-r--r-- 1 barlo barlo 31K Aug 22 17:03 /tmp/p3-final.json\n-rw-r--r-- 1 barlo barlo 48K Aug 22 17:03 /tmp/p4-final.json\n","exit_code":0,"status":"completed"}}
{"type":"item.started","item":{"id":"item_34","type":"command_execution","command":"/bin/bash -lc \"python3 - <<'PY'\nimport json\nfor n in ('p3-final.json','p4-final.json'):\n x=json.load(open('/tmp/'+n)); print(n,x['summary'])\nPY\"","aggregated_output":"","exit_code":null,"status":"in_progress"}}
{"type":"item.completed","item":{"id":"item_34","type":"command_execution","command":"/bin/bash -lc \"python3 - <<'PY'\nimport json\nfor n in ('p3-final.json','p4-final.json'):\n x=json.load(open('/tmp/'+n)); print(n,x['summary'])\nPY\"","aggregated_output":"p3-final.json {'pass': 115, 'fail': 94, 'error': 0, 'skip': 1}\np4-final.json {'pass': 87, 'fail': 124, 'error': 0, 'skip': 13}\n","exit_code":0,"status":"completed"}}
{"type":"item.completed","item":{"id":"item_35","type":"agent_message","text":"RESULT: FAILED\n\nFILES CHANGED:\n- jq_interpreter/parser.py\n- jq_interpreter/evaluator.py\n\nSUMMARY:\nImplemented parser postfix binding support, pattern validation, arithmetic/string/object operations, core builtins, and safer oversized string handling. Local tests pass: 32 passed. Scoped conformance remains failing: PARSE-003 115 passed/94 failed; PARSE-004 87 passed/124 failed.\n\nBLOCKERS:\n- Significant evaluator and advanced jq builtin coverage remains incomplete.\n\nFAILURE_SUMMARY: Scoped conformance criteria still fail.\nFAILURE_DETAIL: Both authoritative acceptance checks ran successfully but reported failing corpus cases; further implementation is required across advanced builtins, assignments, function scoping, destructuring, and control semantics."}}
{"type":"turn.completed","usage":{"input_tokens":2868167,"cached_input_tokens":2768384,"cache_write_input_tokens":0,"output_tokens":10233,"reasoning_output_tokens":2423}}
