{"type":"thread.started","thread_id":"01a02bf6-3d63-7472-9017-1942fae9ceea"}
{"type":"turn.started"}
{"type":"item.completed","item":{"id":"item_0","type":"agent_message","text":"I’m inspecting the existing interpreter and rerunning both authoritative scoped checks first, then I’ll fix the highest-leverage parser/evaluator gaps and re-run the exact gates."}}
{"type":"item.started","item":{"id":"item_1","type":"command_execution","command":"/bin/bash -lc \"ls -la && find . -maxdepth 3 -type f -not -path './sources/*' -print && sed -n '1,240p' jq_interpreter/evaluator.py\"","aggregated_output":"","exit_code":null,"status":"in_progress"}}
{"type":"item.completed","item":{"id":"item_1","type":"command_execution","command":"/bin/bash -lc \"ls -la && find . -maxdepth 3 -type f -not -path './sources/*' -print && sed -n '1,240p' jq_interpreter/evaluator.py\"","aggregated_output":"total 0\ndrwxrwxrwx 1 barlo barlo 512 Aug 22 17:18 .\ndrwxrwxrwx 1 barlo barlo 512 Aug 22 00:46 ..\n-rwxrwxrwx 1 barlo barlo 493 Aug 22 15:49 jq\ndrwxrwxrwx 1 barlo barlo 512 Aug 22 19:49 jq_interpreter\ndrwxrwxrwx 1 barlo barlo 512 Aug 22 19:58 sources\ndrwxrwxrwx 1 barlo barlo 512 Aug 22 19:58 tests\n./jq\n./jq_interpreter/architecture.py\n./jq_interpreter/ast.py\n./jq_interpreter/builtins.py\n./jq_interpreter/cli.py\n./jq_interpreter/diagnostics.py\n./jq_interpreter/errors.py\n./jq_interpreter/evaluator.py\n./jq_interpreter/interpreter.py\n./jq_interpreter/lexer.py\n./jq_interpreter/parser.py\n./jq_interpreter/paths.py\n./jq_interpreter/runtime.py\n./jq_interpreter/__init__.py\n./jq_interpreter/__pycache__/architecture.cpython-310.pyc\n./jq_interpreter/__pycache__/architecture.cpython-312.pyc\n./jq_interpreter/__pycache__/ast.cpython-310.pyc\n./jq_interpreter/__pycache__/ast.cpython-312.pyc\n./jq_interpreter/__pycache__/cli.cpython-310.pyc\n./jq_interpreter/__pycache__/cli.cpython-312.pyc\n./jq_interpreter/__pycache__/diagnostics.cpython-310.pyc\n./jq_interpreter/__pycache__/diagnostics.cpython-312.pyc\n./jq_interpreter/__pycache__/errors.cpython-310.pyc\n./jq_interpreter/__pycache__/errors.cpython-312.pyc\n./jq_interpreter/__pycache__/evaluator.cpython-310.pyc\n./jq_interpreter/__pycache__/evaluator.cpython-312.pyc\n./jq_interpreter/__pycache__/interpreter.cpython-310.pyc\n./jq_interpreter/__pycache__/interpreter.cpython-312.pyc\n./jq_interpreter/__pycache__/lexer.cpython-310.pyc\n./jq_interpreter/__pycache__/lexer.cpython-312.pyc\n./jq_interpreter/__pycache__/parser.cpython-310.pyc\n./jq_interpreter/__pycache__/parser.cpython-312.pyc\n./jq_interpreter/__pycache__/paths.cpython-310.pyc\n./jq_interpreter/__pycache__/paths.cpython-312.pyc\n./jq_interpreter/__pycache__/runtime.cpython-310.pyc\n./jq_interpreter/__pycache__/runtime.cpython-312.pyc\n./jq_interpreter/__pycache__/__init__.cpython-310.pyc\n./jq_interpreter/__pycache__/__init__.cpython-312.pyc\n./tests/conftest.py\n./tests/test_architecture.py\n./tests/test_conformance_assets.py\n./tests/test_conf_001_acceptance.py\n./tests/test_json_io.py\n./tests/test_lexer.py\n./tests/test_parse_002.py\n./tests/__pycache__/conftest.cpython-310-pytest-9.0.2.pyc\n./tests/__pycache__/conftest.cpython-312-pytest-9.1.1.pyc\n./tests/__pycache__/test_architecture.cpython-310-pytest-9.0.2.pyc\n./tests/__pycache__/test_architecture.cpython-312-pytest-9.1.1.pyc\n./tests/__pycache__/test_conformance_assets.cpython-310-pytest-9.0.2.pyc\n./tests/__pycache__/test_conformance_assets.cpython-312-pytest-9.1.1.pyc\n./tests/__pycache__/test_conf_001_acceptance.cpython-310-pytest-9.0.2.pyc\n./tests/__pycache__/test_conf_001_acceptance.cpython-312-pytest-9.1.1.pyc\n./tests/__pycache__/test_json_io.cpython-310-pytest-9.0.2.pyc\n./tests/__pycache__/test_json_io.cpython-312-pytest-9.1.1.pyc\n./tests/__pycache__/test_lexer.cpython-310-pytest-9.0.2.pyc\n./tests/__pycache__/test_lexer.cpython-312-pytest-9.1.1.pyc\n./tests/__pycache__/test_parse_002.cpython-310-pytest-9.0.2.pyc\n./tests/__pycache__/test_parse_002.cpython-312-pytest-9.1.1.pyc\n\"\"\"Ordered generator evaluator boundary.\"\"\"\nimport json\nimport math\n\nfrom .ast import Add, Array, Comma, Filter, Format, Identity, Iterate, Literal, Limit, Node, Pipe, Raise, StringTemplate\nfrom .errors import RuntimeError\nfrom .runtime import JsonValue, ValueStream, identity_stream\n\n\ndef evaluate(program: Filter, value: JsonValue) -> ValueStream:\n    \"\"\"Evaluate one input as an ordered stream of output values.\"\"\"\n    if isinstance(program, Node):\n        yield from _node(program, value, {})\n        return\n    if isinstance(program, Identity):\n        yield from identity_stream(value)\n        return\n    if isinstance(program, Iterate):\n        if isinstance(value, list):\n            yield from value\n        elif isinstance(value, dict):\n            yield from value.values()\n        else:\n            raise RuntimeError(f\"Cannot iterate over {_type_name(value)} ({_stringify(value)})\")\n        return\n    if isinstance(program, Literal):\n        yield program.value\n        return\n    if isinstance(program, Pipe):\n        for intermediate in evaluate(program.left, value): yield from evaluate(program.right, intermediate)\n        return\n    if isinstance(program, Add):\n        left = list(evaluate(program.left, value))\n        right = list(evaluate(program.right, value))\n        for first in left:\n            for second in right:\n                if isinstance(first, (int, float)) and isinstance(second, (int, float)):\n                    yield first + second\n                elif isinstance(first, str) and isinstance(second, str): yield first + second\n                elif first is None: yield second\n                elif second is None: yield first\n                else: raise RuntimeError(\"cannot add values\")\n        return\n    if isinstance(program, StringTemplate):\n        pieces: list[str] = []\n        for part in program.parts:\n            pieces.append(part if isinstance(part, str) else \"\".join(_stringify(x) for x in evaluate(part, value)))\n        yield \"\".join(pieces)\n        return\n    if isinstance(program, Format):\n        if program.template is None: yield _apply_format(program.name, value)\n        else:\n            pieces: list[str] = []\n            for part in program.template.parts:\n                if isinstance(part, str): pieces.append(part)\n                else:\n                    pieces.extend(_apply_format(program.name, item) for item in evaluate(part, value))\n            yield \"\".join(pieces)\n        return\n    if isinstance(program, Comma):\n        yield from evaluate(program.left, value)\n        yield from evaluate(program.right, value)\n        return\n    if isinstance(program, Raise):\n        raise RuntimeError(program.message)\n    if isinstance(program, Array):\n        yield list(evaluate(program.expression, value))\n        return\n    if isinstance(program, Limit):\n        outputs = iter(evaluate(program.expression, value))\n        for _ in range(program.count):\n            try:\n                yield next(outputs)\n            except StopIteration:\n                break\n        return\n    raise RuntimeError(\"unknown compiled filter\")\n\ndef _node(node: Node, value: object, env: dict[str, object]) -> ValueStream:\n    op, a = node.operation, node.arguments\n    if op == \"identity\": yield value\n    elif op == \"literal\":\n        text=a[0]; special={\"true\":True,\"false\":False,\"null\":None,\"nan\":float(\"nan\"),\"infinite\":float(\"inf\"),\"-infinite\":float(\"-inf\"),\"-nan\":float(\"nan\")}; yield special[text] if text in special else json.loads(text)\n    elif op == \"string\": yield _decode_string(a[0], value, env)\n    elif op == \"format\": yield _apply_format(a[0], value)\n    elif op == \"format_template\": yield _decode_string(a[1], value, env).replace(_decode_string(a[1], value, env), _apply_format(a[0], value))\n    elif op == \"var\":\n        if a[0] not in env: raise RuntimeError(f\"variable ${a[0]} is not defined\")\n        bound = env[a[0]]\n        if isinstance(bound, tuple) and bound and bound[0] == '__closure__':\n            yield from _node(bound[1], value, {**env, **bound[2]})\n        elif isinstance(bound, Node):\n            yield from _node(bound, value, env)\n        else:\n            yield bound\n    elif op == \"bind\":\n        for item in _node(a[0], value, env):\n            bound=dict(env)\n            _initialize_pattern(a[1], bound)\n            if not _bind_pattern(a[1], item, bound):\n                continue\n            # `exp as $x | rest` binds the value produced by exp while the\n            # remainder continues with the original input.\n            yield from _node(a[2], value, bound)\n    elif op == \"field\": yield _index(value, a[0])\n    elif op == \"recurse\":\n        def walk(item):\n            yield item\n            if isinstance(item, list):\n                for child in item: yield from walk(child)\n            elif isinstance(item, dict):\n                for child in item.values(): yield from walk(child)\n        yield from walk(value)\n    elif op == \"index\":\n        for base in _node(a[0],value,env): yield _index(base,a[1])\n    elif op == \"iterate\":\n        for base in _node(a[0],value,env):\n            if isinstance(base,dict): yield from base.values()\n            elif isinstance(base,list): yield from base\n            else: raise RuntimeError(f\"Cannot iterate over {_type_name(base)} ({_stringify(base)})\")\n    elif op in (\"indexexpr\",\"slice\"):\n        for base in _node(a[0],value,env):\n            if op==\"slice\":\n                start=_one(a[1],base,env); end=None if a[2] is None else _one(a[2],base,env)\n                import math as _math\n                first = 0 if start is None or (isinstance(start, float) and _math.isnan(start)) else _math.floor(start)\n                last = None if end is None or (isinstance(end, float) and _math.isnan(end)) else _math.ceil(end)\n                if isinstance(base, (list, str)):\n                    yield base[int(first):None if last is None else int(last)]\n                else:\n                    raise RuntimeError(f\"Cannot index {_type_name(base)} with slice\")\n            else:\n                for key in _node(a[1], base, env):\n                    yield _index(base, key)\n    elif op == \"array\": yield [] if a[0] is None else list(_node(a[0],value,env))\n    elif op == \"object\":\n        results=[{}]\n        for key, expr in a[0]:\n            keys=list(_node(key,value,env))\n            values=list(_node(expr,value,env))\n            expanded=[]\n            for prior in results:\n                for k in keys:\n                    for v in values:\n                        item=dict(prior); item[str(k)]=v; expanded.append(item)\n            results=expanded\n        yield from results\n    elif op == \"binary\": yield from _binary(a[0],a[1],a[2],value,env)\n    elif op == \"unary\":\n        # Unary operators are filters and must preserve generator\n        # multiplicity (``-.[]`` negates every array element).\n        for x in _node(a[1], value, env):\n            if not isinstance(x, (int, float)) or isinstance(x, bool):\n                raise RuntimeError(f\"{_type_name(x)} ({_short(x)}) cannot be negated\")\n            yield -x\n    elif op == \"optional\":\n        try: yield from _node(a[0],value,env)\n        except (RuntimeError, ValueError, TypeError, IndexError): return\n    elif op == \"if\":\n        # The condition is a filter, not a scalar expression.  jq evaluates\n        # each condition result independently and therefore may select both\n        # branches for one input.\n        for condition in _node(a[0], value, env):\n            branch = a[1] if _truth(condition) else a[2]\n            yield from _node(branch, value, env)\n    elif op == \"try\":\n        try: yield from _node(a[0],value,env)\n        except (RuntimeError, ValueError, TypeError, IndexError) as error:\n            if a[1] is not None:\n                caught = error.args[0] if error.args else str(error)\n                yield from _node(a[1],caught,env)\n    elif op == \"label\":\n        try: yield from _node(a[1], value, {**env, '__label__': a[0]})\n        except _Break as exc:\n            if exc.name != a[0]: raise\n    elif op == \"break\":\n        raise _Break(a[0])\n    elif op in (\"reduce\", \"foreach\"):\n        states=list(_node(a[0], value, env)); initial=list(_node(a[2], value, env))\n        if op == 'foreach':\n            for start in initial:\n                current = start\n                for item in states:\n                    bound=dict(env)\n                    if not _bind_pattern(a[1], item, bound): continue\n                    outputs=list(_node(a[3], current, bound))\n                    for result in outputs:\n                        current = result\n                        if a[4] is None: yield result\n                        else: yield from _node(a[4], result, bound)\n            return\n        currents=initial\n        for item in states:\n            next_currents=[]\n            for current in currents:\n                bound=dict(env)\n                _initialize_pattern(a[1], bound)\n                if not _bind_pattern(a[1], item, bound):\n                    continue\n                next_currents.extend(_node(a[3], current, bound))\n            currents=next_currents\n            if op == \"foreach\":\n                if a[4] is None:\n                    yield from currents\n                else:\n                    for result in currents: yield from _node(a[4], result, env)\n        if op==\"reduce\": yield from currents\n    elif op == \"call\": yield from _call(a[0],a[1],value,env)\n    elif op == \"def\":\n        env.setdefault('__funcs__',{})[(a[0], len(a[1]))]=(a[1],a[2])\n        yield value\n    elif op == \"defprog\":\n        funcs=dict(env.get('__funcs__',{}))\n        program: Node = node\n        while program.operation == 'defprog':\n            definition = program.arguments[0]\n            funcs[(definition.arguments[0], len(definition.arguments[1]))] = (definition.arguments[1], definition.arguments[2])\n            program = program.arguments[1]\n        yield from _node(program, value, {**env, '__funcs__': funcs})\n    elif op == \"unsupported\": raise RuntimeError(\"unsupported syntax\")\n\nclass _Break(Exception):\n    def __init__(self, name): self.name=name\n\ndef _bind_pattern(pattern, value, env):\n    op, args=pattern.operation, pattern.arguments\n    if op=='pattern_alt':\n        first, second=args\n        trial=dict(env)\n        if _bind_pattern(first,value,trial): env.update(trial); return True\n        return _bind_pattern(second,value,env)\n    if op=='pattern_var': env[args[0]]=value; return True\n    elif op == 'pattern_bind':\n        env[args[0]] = value\n        return _bind_pattern(args[1], value, env)\n    elif op=='pattern_array':\n        if not isinstance(value,list): return False\n        for i,p in enumerate(args[0]):\n            if not _bind_pattern(p, value[i] if i<len(value) else None, env): return False\n        return True\n","exit_code":0,"status":"completed"}}
{"type":"item.started","item":{"id":"item_2","type":"command_execution","command":"/bin/bash -lc \"sed -n '240,520p' jq_interpreter/evaluator.py && sed -n '1,280p' jq_interpreter/parser.py\"","aggregated_output":"","exit_code":null,"status":"in_progress"}}
{"type":"item.completed","item":{"id":"item_2","type":"command_execution","command":"/bin/bash -lc \"sed -n '240,520p' jq_interpreter/evaluator.py && sed -n '1,280p' jq_interpreter/parser.py\"","aggregated_output":"        return True\n    elif op=='pattern_object':\n        if not isinstance(value,dict): return False\n        for key,p in args[0]:\n            if isinstance(key, Node):\n                key = _one(key, value, env)\n            if not _bind_pattern(p, value.get(key), env): return False\n        return True\n    return False\n\ndef _initialize_pattern(pattern, env):\n    op, args = pattern.operation, pattern.arguments\n    if op == 'pattern_var': env.setdefault(args[0], None)\n    elif op == 'pattern_bind':\n        env.setdefault(args[0], None); _initialize_pattern(args[1], env)\n    elif op == 'pattern_array':\n        for item in args[0]: _initialize_pattern(item, env)\n    elif op == 'pattern_object':\n        for _, item in args[0]: _initialize_pattern(item, env)\n    elif op == 'pattern_alt':\n        _initialize_pattern(args[0], env); _initialize_pattern(args[1], env)\n\ndef _one(node, value, env):\n    vals=list(_node(node,value,env)); return vals[0] if vals else None\ndef _truth(x): return x is not None and x is not False\ndef _index(v,k):\n    if v is None:\n        return None\n    if isinstance(v,dict): return v.get(str(k))\n    if isinstance(v,list):\n        if isinstance(k, bool) or not isinstance(k, (int, float)) or int(k) != k:\n            raise RuntimeError(f'Cannot index array with string ({json.dumps(k)})')\n        index = int(k)\n        return v[index] if -len(v) <= index < len(v) else None\n    if isinstance(v,str):\n        if isinstance(k, bool) or not isinstance(k, (int, float)) or int(k) != k:\n            raise RuntimeError(f'Cannot index string with number ({_short(k)})')\n        index = int(k)\n        return v[index] if -len(v) <= index < len(v) else None\n    raise RuntimeError(f'Cannot index {_type_name(v)} with {_type_name(k)} ({json.dumps(k)})')\ndef _binary(op,left,right,value,env):\n    if op==',': yield from _node(left,value,env); yield from _node(right,value,env); return\n    if op=='|':\n        for x in _node(left,value,env): yield from _node(right,x,env)\n        return\n    if op=='//':\n        try: candidates = list(_node(left, value, env))\n        except RuntimeError: candidates = []\n        emitted = False\n        for item in candidates:\n            if _truth(item): emitted = True; yield item\n        if not emitted: yield from _node(right, value, env)\n        return\n    if op in ('=', '|=', '+=', '-=', '*=', '/=', '%=', '//='):\n        if op == '=' and left.operation == 'slice':\n            for replacement in _node(right, value, env):\n                yield _assign_slice(left, value, replacement, env)\n            return\n        paths = _paths(left, value, env)\n        if op == '|=':\n            result = value\n            for path in reversed(paths):\n                old = _get_path(result, path)\n                outputs = list(_node(right, old, env))\n                if outputs:\n                    result = _set_path(result, path, outputs[0])\n                else:\n                    result = _delete_path(result, path)\n            if paths: yield result\n            return\n        replacements = [None] if op == '|=' else list(_node(right, value, env))\n        for replacement in replacements:\n            result = value\n            for path in paths:\n                old = _get_path(result, path)\n                new = replacement if op in ('=',) else (_one(right, old, env) if op == '|=' else replacement)\n                if op not in ('=', '|='):\n                    new = _arithmetic(op[0], old, replacement)\n                result = _set_path(result, path, new)\n            if paths: yield result\n        return\n    ls=list(_node(left,value,env)); rs=list(_node(right,value,env))\n    for x in ls:\n      for y in rs:\n        if op=='+':\n            if x is None: yield y\n            elif y is None: yield x\n            elif isinstance(x, (int,float)) and isinstance(y, (int,float)): yield x+y\n            elif isinstance(x, str) and isinstance(y, str): yield x+y\n            elif isinstance(x, list) and isinstance(y, list): yield x+y\n            elif isinstance(x, dict) and isinstance(y, dict): yield {**x, **y}\n            else: raise RuntimeError(f\"{_type_name(x)} ({_short(x)}) and {_type_name(y)} ({_short(y)}) cannot be added\")\n        elif op=='-':\n            if isinstance(x, list) and isinstance(y, list):\n                yield [item for item in x if not any(_deep_equal(item, candidate) for candidate in y)]\n                continue\n            if not isinstance(x,(int,float)) or not isinstance(y,(int,float)):\n                raise RuntimeError(f\"{_type_name(x)} ({_short(x)}) and {_type_name(y)} ({_short(y)}) cannot be subtracted\")\n            yield x-y\n        elif op=='*':\n            if isinstance(x, str) and isinstance(y, (int,float)):\n                count = max(0, int(y))\n                if len(x) * count > 100000000:\n                    raise RuntimeError('Repeat string result too long')\n                yield x * count\n            elif isinstance(y, str) and isinstance(x, (int,float)):\n                count = max(0, int(x))\n                if len(y) * count > 100000000:\n                    raise RuntimeError('Repeat string result too long')\n                yield y * count\n            elif isinstance(x, dict) and isinstance(y, dict):\n                yield _merge_objects(x, y)\n            else: yield x*y\n        elif op=='/':\n            if y==0: raise RuntimeError(f\"number ({_short(x)}) and number ({_short(y)}) cannot be divided because the divisor is zero\")\n            if isinstance(x,str) and isinstance(y,str): yield x.split(y)\n            else: yield x/y\n        elif op=='%':\n            if y==0: raise RuntimeError(f\"number ({_short(x)}) and number ({_short(y)}) cannot be divided (remainder) because the divisor is zero\")\n            yield math.fmod(x,y)\n        elif op in ('==','!=','<','>','<=','>='):\n            if op in ('==', '!='):\n                equal = _deep_equal(x, y)\n                yield equal if op == '==' else not equal\n            else:\n                yield {'<':x<y,'>':x>y,'<=':x<=y,'>=':x>=y}[op]\n        elif op in ('and','or'): yield (_truth(x) and _truth(y)) if op=='and' else (_truth(x) or _truth(y))\n        else: yield x\n\ndef _arithmetic(op, left, right):\n    if op == '+': return left + right\n    if op == '-': return left - right\n    if op == '*': return left * right\n    if op == '/': return left / right\n    if op == '%': return math.fmod(left, right)\n    return right\n\ndef _merge_objects(left: dict, right: dict, depth: int = 0) -> dict:\n    if depth > 1000: raise RuntimeError('Object merge too deep')\n    merged = dict(left)\n    for key, item in right.items():\n        if key in merged and isinstance(merged[key], dict) and isinstance(item, dict):\n            merged[key] = _merge_objects(merged[key], item, depth + 1)\n        else:\n            merged[key] = item\n    return merged\n\n\ndef _deep_equal(left: object, right: object, limit: int = 10000) -> bool:\n    \"\"\"Compare JSON values iteratively, preserving jq's deep-value guard.\"\"\"\n    pending: list[tuple[object, object, int]] = [(left, right, 0)]\n    while pending:\n        first, second, depth = pending.pop()\n        if depth > limit:\n            raise RuntimeError('Equality check too deep')\n        if type(first) is not type(second):\n            # jq treats integral and floating-point numbers as one number type.\n            if isinstance(first, (int, float)) and not isinstance(first, bool) and isinstance(second, (int, float)) and not isinstance(second, bool):\n                if first != second:\n                    return False\n                continue\n            return False\n        if isinstance(first, (dict, list)):\n            if isinstance(first, list):\n                if len(first) != len(second):\n                    return False\n                pending.extend((a, b, depth + 1) for a, b in zip(first, second))\n            else:\n                if first.keys() != second.keys():\n                    return False\n                pending.extend((first[key], second[key], depth + 1) for key in first)\n            continue\n        if isinstance(first, float) and math.isnan(first) and math.isnan(second):\n            continue\n        if first != second:\n            return False\n    return True\n\n\ndef _deep_json_dumps(value: object) -> str:\n    \"\"\"Encode deeply nested values without json.encoder's C recursion limit.\"\"\"\n    depth = 0\n    probe = value\n    while isinstance(probe, list) and len(probe) == 1:\n        depth += 1\n        probe = probe[0]\n    if depth >= 10000:\n        return json.dumps('<skipped: too deep>')\n    pieces: list[str] = []\n    stack: list[object] = [value]\n    while stack:\n        item = stack.pop()\n        if isinstance(item, list):\n            pieces.append('[')\n            if item:\n                stack.append(('close', ']'))\n                for index in range(len(item) - 1, -1, -1):\n                    if index < len(item) - 1:\n                        stack.append(('raw', ','))\n                    stack.append(item[index])\n            else:\n                pieces.append(']')\n        elif isinstance(item, dict):\n            pieces.append('{')\n            entries = list(item.items())\n            if entries:\n                stack.append(('close', '}'))\n                for index in range(len(entries) - 1, -1, -1):\n                    key, child = entries[index]\n                    if index < len(entries) - 1:\n                        stack.append(('raw', ','))\n                    stack.append(child)\n                    stack.append(('raw', ':'))\n                    stack.append(('raw', json.dumps(str(key), ensure_ascii=False)))\n            else:\n                pieces.append('}')\n        elif isinstance(item, tuple) and item[0] == 'raw':\n            pieces.append(item[1])\n        elif isinstance(item, tuple) and item[0] == 'close':\n            pieces.append(item[1])\n        else:\n            if isinstance(item, float) and not math.isfinite(item):\n                pieces.append('null')\n            else:\n                pieces.append(json.dumps(item, separators=(',', ':'), ensure_ascii=False))\n    return ''.join(pieces)\n\n\ndef _deep_json_loads(text: str) -> object:\n    try:\n        parsed = json.loads(text, parse_constant=lambda x: float('nan'))\n        if parsed == '<skipped: too deep>':\n            raise RuntimeError('Exceeds depth limit for parsing')\n        return parsed\n    except RecursionError:\n        if text and set(text) <= {'[', ']'} and text.startswith('['):\n            depth = text.count('[')\n            value: object = []\n            for _ in range(depth - 1):\n                value = [value]\n            return value\n        raise\n\ndef _paths(node, value, env):\n    op, args = node.operation, node.arguments\n    if op == 'identity': return [()]\n    if op == 'field': return [(args[0],)]\n    if op == 'index': return [p + (args[1],) for p in _paths(args[0], value, env)]\n    if op == 'indexexpr':\n        result = []\n        for p in _paths(args[0], value, env):\n            current = _get_path(value, p)\n            for key in _node(args[1], value, env):\n                if isinstance(key, (int, float)) and not isinstance(key, bool) and int(key) >= 10000000:\n                    raise RuntimeError('Array index too large')\n                if isinstance(current, list) and isinstance(key, (int, float)):\n                    if int(key) < 0 and abs(int(key)) > len(current): raise RuntimeError('Out of bounds negative array index')\n                    if int(key) >= 10000000: raise RuntimeError('Array index too large')\n                elif isinstance(key, (int, float)) and key < 0 and current is None:\n                    raise RuntimeError('Out of bounds negative array index')\n                result.append(p + (key,))\n        return result\n    if op == 'slice':\n        result = []\n        for p in _paths(args[0], value, env):\n            current = _get_path(value, p)\n            if not isinstance(current, (list, str)):\n                continue\n            start = _one(args[1], current, env)\n            end = None if args[2] is None else _one(args[2], current, env)\n            first = 0 if start is None or (isinstance(start, float) and math.isnan(start)) else math.floor(start)\n            last = len(current) if end is None or (isinstance(end, float) and math.isnan(end)) else math.ceil(end)\n            result.extend(p + (i,) for i in range(max(0, int(first)), min(len(current), int(last))))\n        return result\n    if op == 'iterate':\n        result = []\n        for p in _paths(args[0], value, env):\n            current = _get_path(value, p)\n            if isinstance(current, list): result.extend(p + (i,) for i in range(len(current)))\n            elif isinstance(current, dict): result.extend(p + (k,) for k in current)\n        return result\n\"\"\"Precedence-aware jq expression parser.\"\"\"\nimport json\nimport re\nfrom dataclasses import dataclass\nfrom .ast import Filter, Node, StringTemplate, Format\nfrom .errors import CompileError\nfrom .lexer import tokenize\n\n@dataclass(frozen=True)\nclass T: text: str\nOPS=(\"//=\",\"?//\",\"!=\",\"==\",\"|=\",\"+=\",\"-=\",\"*=\",\"/=\",\"%=\",\"<=\",\">=\",\"..\",\"//\")\n# jq's query grammar gives the pipe lower precedence than comma.  This is\n# significant for ``a | b, c``: it means ``a | (b, c)`` and keeps the input\n# stream attached to both branches.  The parser's numeric levels increase\n# with binding strength.\nPREC={\"|\":1,\",\":2,\"=\":3,\"|=\":3,\"+=\":3,\"-=\":3,\"*=\":3,\"/=\":3,\"%=\":3,\"//=\":3,\"//\":4,\"or\":5,\"and\":6,\"==\":7,\"!=\":7,\"<\":7,\">\":7,\"<=\":7,\">=\":7,\"+\":8,\"-\":8,\"*\":9,\"/\":9,\"%\":9}\n\ndef lex(s: str) -> list[T]:\n    s=re.sub(r\"#[^\\n]*\",\"\",s); out=[]; i=0\n    while i<len(s):\n        if s[i].isspace(): i+=1; continue\n        if s[i]=='\"':\n            a=i; i+=1; esc=False\n            while i<len(s):\n                c=s[i]; i+=1\n                if esc: esc=False\n                elif c=='\\\\': esc=True\n                elif c=='\"': break\n            else: raise CompileError(\"unterminated string\")\n            out.append(T(s[a:i])); continue\n        op=next((x for x in OPS if s.startswith(x,i)),None)\n        if op: out.append(T(op)); i+=len(op); continue\n        m=re.match(r\"(?:[0-9]+(?:\\.[0-9]*)?|\\.[0-9]+)(?:[eE][+-]?[0-9]+)?\",s[i:])\n        if m: out.append(T(m.group())); i+=len(m.group()); continue\n        m=re.match(r\"(?:[A-Za-z_][A-Za-z_0-9]*::)*[A-Za-z_][A-Za-z_0-9]*\",s[i:])\n        if m: out.append(T(m.group())); i+=len(m.group()); continue\n        if s[i]=='$':\n            m=re.match(r\"\\$[A-Za-z_][A-Za-z_0-9]*(?:::[A-Za-z_][A-Za-z_0-9]*)*\",s[i:])\n            if not m: raise CompileError(\"invalid binding\")\n            out.append(T(m.group())); i+=len(m.group()); continue\n        if s[i]=='.' and i+1<len(s) and re.match(r\"[A-Za-z_]\",s[i+1]):\n            m=re.match(r\"\\.[A-Za-z_][A-Za-z_0-9]*\",s[i:]); out.append(T(m.group())); i+=len(m.group()); continue\n        if s[i]=='@':\n            m=re.match(r\"@[A-Za-z_][A-Za-z_0-9]*\",s[i:])\n            if not m: raise CompileError(\"invalid format\")\n            out.append(T(m.group())); i+=len(m.group()); continue\n        if s[i] in \".?=;,:|+-*/%$<>()[]{}\": out.append(T(s[i])); i+=1; continue\n        raise CompileError(\"unexpected character\")\n    out.append(T(\"<eof>\")); return out\n\nclass Parser:\n    def __init__(self,s:str): self.t=lex(s); self.i=0\n    def p(self): return self.t[self.i].text\n    def take(self,x=None):\n        v=self.p()\n        if x is not None and v!=x: raise CompileError(f\"expected {x}\")\n        self.i+=1; return v\n    def parse(self):\n        if self.p()==\"<eof>\": raise CompileError(\"empty program\")\n        x=self.expr(0)\n        while self.p()==';': self.take()\n        if self.p()!='<eof>': raise CompileError(\"unexpected token\")\n        return x\n    def expr(self,n, stop_comma=False):\n        x=self.prefix()\n        # Binding is a query construct, below all ordinary operators.\n        if self.p()=='as' and n <= 2:\n            self.take('as'); pattern=self.pattern(); self.take('|')\n            return Node('bind',(x,pattern,self.expr(0)))\n        while (self.p() in PREC or self.p() in ('and','or')) and PREC.get(self.p(), 0)>=n:\n            if stop_comma and self.p() == ',': break\n            op=self.take(); q=PREC[op]; x=Node(\"binary\",(op,x,self.expr(q if op in (\"=\",\"|=\",\"+=\",\"-=\",\"*=\",\"/=\",\"%=\",\"//=\") else q+1, stop_comma)))\n        if self.p()=='as' and n <= 2:\n            self.take('as'); pattern=self.pattern(); self.take('|')\n            return Node('bind',(x,pattern,self.expr(0)))\n        return x\n    def prefix(self):\n        t=self.p()\n        if t=='-':\n            # Unary minus binds to the complete postfix term.  In particular\n            # ``-.?`` is try-able arithmetic, not an optional identity.\n            self.take(); return Node('unary',('-',self.prefix()))\n        if t=='if': return self.post(self.if_expr())\n        if t in ('try','reduce','foreach','label','break','def','module','import','include'): return self.post(self.control(t))\n        if t=='(': self.take(); x=self.expr(0); self.take(')'); return self.post(x)\n        if t=='[':\n            self.take()\n            if self.p()==']': x=Node('array',(None,))\n            else:\n                # Commas delimit array elements here; query commas inside an\n                # element remain available through parentheses.\n                parts=[self.expr(1, True)]\n                while self.p()==',': self.take(); parts.append(self.expr(1, True))\n                combined=parts[0]\n                for part in parts[1:]: combined=Node('binary',(',',combined,part))\n                x=Node('array',(combined,))\n            self.take(']'); return self.post(x)\n        if t=='{': return self.object()\n        if t=='.': self.take(); return self.post(Node('identity'))\n        if t=='..': self.take(); return self.post(Node('recurse'))\n        if t.startswith('.'): self.take(); return self.post(Node('field',(t[1:],)))\n        if t.startswith('$'): self.take(); return self.post(Node('var',(t[1:],)))\n        if t.startswith('\"'): self.take(); return self.post(Node('string',(t,)))\n        if t.startswith('@'): self.take(); return self.post(Node('format',(t[1:],)))\n        self.take()\n        if t in ('true','false','null','nan','infinite','-infinite','-nan') or re.fullmatch(r'(?:[0-9]+(?:\\.[0-9]*)?|\\.[0-9]+)(?:[eE][+-]?[0-9]+)?',t): return self.post(Node('literal',(t,)))\n        return self.post(Node('call',(t,())))\n    def post(self,x):\n        while True:\n            if self.p().startswith('\"') and isinstance(x,Node) and x.operation=='format':\n                x=Node('format_template',(x.arguments[0],self.take())); continue\n            if self.p().startswith('\"'):\n                x=Node('indexexpr',(x,Node('string',(self.take(),)))); continue\n            if self.p()=='?': self.take(); x=Node('optional',(x,)); continue\n            if self.p().startswith('.') and len(self.p())>1: x=Node('index',(x,self.take()[1:],False)); continue\n            if self.p()=='.' and self.t[self.i+1].text.startswith('\"'):\n                self.take('.'); x=Node('indexexpr',(x,Node('string',(self.take(),)))); continue\n            if self.p()=='.' and self.t[self.i+1].text=='[':\n                self.take('.'); continue\n            if self.p()=='[':\n                self.take()\n                if self.p()==']': self.take(); x=Node('iterate',(x,)); continue\n                a = Node('literal', ('null',)) if self.p()==':' else self.expr(0)\n                if self.p()==':': self.take(); b=None if self.p()==']' else self.expr(0); self.take(']'); x=Node('slice',(x,a,b))\n                else: self.take(']'); x=Node('indexexpr',(x,a))\n                continue\n            if self.p()=='(' and isinstance(x,Node) and x.operation=='call':\n                name=x.arguments[0]; self.take(); args=[]\n                if self.p()!=')':\n                    args.append(self.expr(1))\n                    # jq's grammar uses semicolons for filter arguments.  The\n                    # corpus also exercises the permissive comma spelling.\n                    while self.p()==';': self.take(); args.append(self.expr(1))\n                self.take(')'); x=Node('call',(name,tuple(args))); continue\n            break\n        return x\n    def object(self):\n        self.take('{'); pairs=[]\n        while self.p()!='}':\n            if self.p()=='(':\n                self.take('('); key=self.expr(0); self.take(')')\n            else:\n                k=self.take()\n                if k.startswith('\"'):\n                    key=Node('string',(k,))\n                elif k.startswith('$'):\n                    key=Node('var',(k[1:],))\n                else:\n                    key=Node('string',(json.dumps(k.lstrip('$').lstrip('.')),))\n            if self.p()==':': self.take(); v=self.expr(1, True)\n            else:\n                # `{name}` and `{$name}` abbreviate an access using the key.\n                if k.startswith('\"'):\n                    # The key itself may be an interpolated jq string; keep\n                    # it as a filter so decoding happens at evaluation time.\n                    raw = None\n                    v = Node('indexexpr',(Node('identity'), key))\n                else:\n                    raw = k.lstrip('$').lstrip('.')\n                if k.startswith('$'):\n                    key = Node('string',(json.dumps(raw),))\n                    v=Node('var',(raw,))\n                elif not k.startswith('\"'):\n                    v=Node('index',(Node('identity'),raw,False))\n            if key.operation == 'literal':\n                raise CompileError('object key must be a string')\n            if key.operation == 'literal':\n                raise CompileError('object key must be a string')\n            pairs.append((key,v))\n            if self.p()!= '}': self.take(',')\n        self.take('}'); return Node('object',(tuple(pairs),))\n\n    def pattern(self):\n        t=self.p()\n        if t.startswith('$'):\n            result=Node('pattern_var',(self.take()[1:],))\n            return self._pattern_alt(result)\n        if t=='[':\n            self.take()\n            if self.p()==']': raise CompileError('empty destructuring pattern')\n            items=[]\n            if self.p()!=']':\n                items.append(self.pattern())\n                while self.p()==',': self.take(); items.append(self.pattern())\n            self.take(']'); return self._pattern_alt(Node('pattern_array',(tuple(items),)))\n        if t=='{':\n            self.take()\n            if self.p()=='}': raise CompileError('empty destructuring pattern')\n            items=[]\n            if self.p()!='}':\n                while True:\n                    if self.p() == '(':\n                        self.take('('); key_node = self.expr(0); self.take(')')\n                        if key_node.operation == 'literal':\n                            raise CompileError('object key must be a string')\n                        key = '<computed>'\n                    else:\n                        key=self.take(); key_node = None\n                        if key.startswith('\"'): key = json.loads(key)\n                    if self.p()==':':\n                        self.take(); pat=self.pattern()\n                        if key.startswith('$'):\n                            pat = Node('pattern_bind',(key[1:],pat))\n                    elif key.startswith('$'): pat=Node('pattern_var',(key[1:],))\n                    else: pat=Node('pattern_var',(key,))\n                    items.append((key_node if key_node is not None else key.lstrip('$'),pat))\n                    if self.p()!='}': self.take(',')\n                    else: break\n            self.take('}'); return self._pattern_alt(Node('pattern_object',(tuple(items),)))\n        raise CompileError('expected binding pattern')\n\n    def _pattern_alt(self, result):\n        if self.p()=='?//':\n            self.take('?//'); return Node('pattern_alt',(result,self.pattern()))\n        return result\n    def if_expr(self):\n        self.take('if'); c=self.expr(0); self.take('then'); a=self.expr(0); b=Node('literal',('null',))\n        if self.p()=='else': self.take(); b=self.expr(0); self.take('end')\n        elif self.p()=='elif':\n            b=self._elif_expr()\n        else: self.take('end'); b=Node('identity')\n        return Node('if',(c,a,b))\n    def _elif_expr(self):\n        self.take('elif'); c=self.expr(0); self.take('then'); a=self.expr(0)\n        if self.p()=='elif': b=self._elif_expr()\n        elif self.p()=='else': self.take(); b=self.expr(0); self.take('end')\n        else: self.take('end'); b=Node('identity')\n        return Node('if',(c,a,b))\n    def control(self,w):\n        self.take(w)\n        if w in ('module', 'import', 'include'):\n            raise CompileError('module directives are not available')\n        if w=='try':\n            # In object values the following comma belongs to the object,\n            # while the try/catch body still admits the full query pipe.\n            # `try` binds more tightly than defined-or and comma.  Its\n            # optional catch clause is consequently visible to this control\n            # production rather than being swallowed by the protected query.\n            a=self.expr(10, True); b=None\n            if self.p()=='catch': self.take(); b=self.expr(10, True)\n            return Node('try',(a,b))\n        if w=='def':\n            name=self.take(); ps=[]\n            if self.p()=='(': self.take();\n            while self.p() not in (')',':'):\n                ps.append(self.take().lstrip('$'))\n                if self.p()==';': self.take()\n            if ps: self.take(')')\n            self.take(':'); b=self.expr(0); self.take(';')\n            definition=Node('def',(name,tuple(ps),b))\n            if self.p()!='<eof>': return Node('defprog',(definition,self.expr(0)))\n            return definition\n        if w in ('reduce','foreach'):\n            src=self.expr(3); self.take('as'); pat=self.pattern(); self.take('('); init=self.expr(0); self.take(';'); upd=self.expr(2); ext=None\n            if self.p()==';': self.take(); ext=self.expr(2)\n            self.take(')'); return Node(w,(src,pat,init,upd,ext))\n        if w=='label': name=self.take().lstrip('$'); self.take('|'); return Node('label',(name,self.expr(0)))\n        if w=='break': return Node('break',(self.take().lstrip('$'),))\n        return Node('unsupported',(w,))\n\ndef parse(source: str) -> Filter:\n    tokenize(source)\n    if source.strip() == 'not-a-filter': raise CompileError('unknown filter')\n    for label in re.findall(r'\\blabel\\s+\\$([A-Za-z_]\\w*)', source):\n        pass\n    for name in re.findall(r'\\bbreak\\s+\\$([A-Za-z_]\\w*)', source):\n        if not re.search(r'\\blabel\\s+\\$' + re.escape(name) + r'\\b', source):\n            raise CompileError('break label is not defined')\n    stripped=source.strip()\n    if stripped.startswith('\"') and '\\\\(' in stripped:\n        parts=[]; pos=1; end=len(stripped)-1\n        while pos<end:\n            mark=stripped.find('\\\\(',pos)\n            if mark<0:\n                parts.append(json.loads('\"'+stripped[pos:end]+'\"')); break\n            if mark>pos: parts.append(json.loads('\"'+stripped[pos:mark]+'\"'))\n            depth=1; cursor=mark+2\n            while depth and cursor<end:\n                if stripped[cursor]=='(': depth+=1\n                elif stripped[cursor]==')': depth-=1\n","exit_code":0,"status":"completed"}}
{"type":"item.started","item":{"id":"item_3","type":"command_execution","command":"/bin/bash -lc 'set +e; JQ=\"$PWD/jq\" python3 sources/run_conformance.py --select '\"'\\\\.|\\\\[|\\\\{|\\\\+|\\\\-|\\\\*|/|%' --json > /tmp/p3.json; echo p3:\"'$?; JQ=\"$PWD/jq\" python3 sources/run_conformance.py --select '\"'%%FAIL|if |try |reduce |foreach |def | as |label |module|include' --json > /tmp/p4.json; echo p4:\"'$?; python3 - <<'\"'PY'\nimport json\nfor f in ['/tmp/p3.json','/tmp/p4.json']:\n d=json.load(open(f)); print(f,d['summary']);\n for x in d.get('failures',[])[:12]: print(x.get('program'), 'exp',x.get('expected'),'act',x.get('actual'),'exit',x.get('exit_code'))\n for x in d.get('errors',[])[:5]: print('ERR',x)\nPY\"","aggregated_output":"","exit_code":null,"status":"in_progress"}}
{"type":"item.started","item":{"id":"item_4","type":"command_execution","command":"/bin/bash -lc \"sed -n '1,220p' jq_interpreter/interpreter.py; sed -n '520,900p' jq_interpreter/evaluator.py; sed -n '1,160p' sources/run_conformance.py\"","aggregated_output":"","exit_code":null,"status":"in_progress"}}
{"type":"item.completed","item":{"id":"item_4","type":"command_execution","command":"/bin/bash -lc \"sed -n '1,220p' jq_interpreter/interpreter.py; sed -n '520,900p' jq_interpreter/evaluator.py; sed -n '1,160p' sources/run_conformance.py\"","aggregated_output":"\"\"\"Application-facing interpreter orchestration.\"\"\"\n\nimport json\nfrom collections.abc import Iterable, Iterator\n\nfrom .evaluator import evaluate\nfrom .parser import parse\nfrom .runtime import JsonValue\n\n\nclass Interpreter:\n    \"\"\"Compile once, then evaluate each JSON input in order.\"\"\"\n\n    def __init__(self, program: str) -> None:\n        self._compiled = parse(program)\n\n    def run(self, inputs: Iterable[JsonValue]) -> Iterator[JsonValue]:\n        \"\"\"Yield every output, preserving input and generator ordering.\"\"\"\n        for value in inputs:\n            yield from evaluate(self._compiled, value)\n\n\ndef parse_input(line: str) -> JsonValue:\n    \"\"\"Decode one JSON input value.\"\"\"\n    return json.loads(line.lstrip(\"\\ufeff\"), parse_constant=_parse_json_constant)\n\n\ndef parse_inputs(text: str) -> Iterator[JsonValue]:\n    \"\"\"Decode every whitespace-separated JSON value in an input stream.\n\n    ``jq`` accepts JSON values separated by arbitrary whitespace, so a value may\n    span multiple physical lines.  ``raw_decode`` preserves the boundary\n    between successive values without requiring a non-standard JSON parser.\n    \"\"\"\n    decoder = json.JSONDecoder(parse_constant=_parse_json_constant)\n    position = 0\n    while True:\n        while position < len(text) and text[position].isspace():\n            position += 1\n        if position >= len(text):\n            return\n        if position == 0 and text.startswith(\"\\ufeff\"):\n            position += 1\n            continue\n        value, position = decoder.raw_decode(text, position)\n        yield value\n\n\ndef _parse_json_constant(value: str) -> float:\n    \"\"\"Decode jq's accepted non-standard numeric constants.\"\"\"\n    return {\"NaN\": float(\"nan\"), \"Infinity\": float(\"inf\"),\n            \"-Infinity\": float(\"-inf\")}[value]\n        return result\n    if op == 'bind':\n        return _paths(args[2], value, env)\n    if op == 'binary' and args[0] == '|':\n        result = []\n        for p in _paths(args[1], value, env):\n            current = _get_path(value, p)\n            result.extend(p + tail for tail in _paths(args[2], current, env))\n        return result\n    if op == 'call' and not args[1] and args[0] in env.get('__funcs__', {}):\n        return _paths(env['__funcs__'][args[0]][1], value, env)\n    if op == 'call' and args[0] == 'select' and args[1]:\n        return [()] if _truth(_one(args[1][0], value, env)) else []\n    if op == 'call' and not args[1] and args[0] == 'last':\n        return [(-1,)]\n    return []\n\ndef _assign_slice(node, value, replacement, env):\n    base_node, start_node, end_node = node.arguments\n    result = value\n    for parent in _paths(base_node, value, env):\n        current = _get_path(result, parent)\n        if not isinstance(current, (list, str)):\n            continue\n        start = _one(start_node, current, env)\n        end = None if end_node is None else _one(end_node, current, env)\n        first = 0 if start is None or (isinstance(start, float) and math.isnan(start)) else math.floor(start)\n        last = len(current) if end is None or (isinstance(end, float) and math.isnan(end)) else math.ceil(end)\n        if isinstance(current, str):\n            raise RuntimeError('Cannot update string slices')\n        updated = list(current)\n        updated[int(first):int(last)] = replacement if isinstance(replacement, list) else [replacement]\n        result = _set_path(result, parent, updated)\n    return result\n\ndef _get_path(value, path):\n    current = value\n    for key in path:\n        if isinstance(current, dict): current = current.get(str(key))\n        elif isinstance(current, list):\n            index = int(key); current = current[index] if -len(current) <= index < len(current) else None\n        else: return None\n    return current\n\ndef _set_path(value, path, replacement):\n    if not path: return replacement\n    if isinstance(value, dict):\n        result = dict(value); key = str(path[0]); result[key] = _set_path(result.get(key), path[1:], replacement); return result\n    if isinstance(value, list):\n        result = list(value); index = int(path[0]); index = index + len(result) if index < 0 else index\n        while index >= len(result): result.append(None)\n        result[index] = _set_path(result[index], path[1:], replacement); return result\n    if isinstance(path[0], (int, float)) and not isinstance(path[0], bool):\n        result = []\n        index = int(path[0])\n        while len(result) <= index: result.append(None)\n        result[index] = _set_path(result[index], path[1:], replacement)\n        return result\n    return {str(path[0]): _set_path(None, path[1:], replacement)}\n\ndef _delete_path(value, path):\n    if not path: return None\n    if isinstance(value, list):\n        index = int(path[0]); index = index + len(value) if index < 0 else index\n        result = list(value)\n        if len(path) == 1:\n            if 0 <= index < len(result): result.pop(index)\n        elif 0 <= index < len(result): result[index] = _delete_path(result[index], path[1:])\n        return result\n    if isinstance(value, dict):\n        result = dict(value); key = str(path[0])\n        if len(path) == 1: result.pop(key, None)\n        elif key in result: result[key] = _delete_path(result[key], path[1:])\n        return result\n    return value\ndef _call(name,args,value,env):\n    if not args and name in env:\n        bound = env[name]\n        if isinstance(bound, tuple) and bound and bound[0] == '__closure__':\n            yield from _node(bound[1], value, {**env, **bound[2]})\n        elif isinstance(bound, Node):\n            yield from _node(bound, value, env)\n        else:\n            yield bound\n        return\n    function = env.get('__funcs__',{}).get((name, len(args)))\n    if function is not None:\n        params,body=function\n        if not args:\n            yield from _node(body,value,env); return\n        # Function parameters are filters, not eagerly evaluated values.  A\n        # parameter is evaluated against the function's current input each\n        # time its name is used, which preserves jq's generator semantics.\n        local=dict(env)\n        local.update({param:('__closure__', arg, dict(env)) for param,arg in zip(params,args)})\n        yield from _node(body,value,local); return\n    if name == 'empty': return\n    if name == 'error': raise RuntimeError(_one(args[0],value,env) if args else value)\n    if name=='length': yield len(value); return\n    if name == 'add':\n        items = list(_node(args[0], value, env)) if args else list(value)\n        if not items: yield None\n        else:\n            result = items[0]\n            for item in items[1:]:\n                if result is None: result = item\n                elif item is None: continue\n                elif isinstance(result, (int,float)) and isinstance(item,(int,float)): result += item\n                elif isinstance(result, str) and isinstance(item,str): result += item\n                elif isinstance(result,list) and isinstance(item,list): result += item\n                elif isinstance(result,dict) and isinstance(item,dict): result = {**result,**item}\n                else: raise RuntimeError('cannot add values')\n            yield result\n        return\n    if name=='type': yield 'null' if value is None else 'boolean' if isinstance(value,bool) else 'number' if isinstance(value,(int,float)) else 'string' if isinstance(value,str) else 'array' if isinstance(value,list) else 'object'; return\n    if name=='not': yield not _truth(value); return\n    if name == 'have_decnum': yield False; return\n    if name in ('any', 'all'):\n        stream = _node(args[0], value, env) if args else iter(value if isinstance(value, list) else [])\n        desired = name == 'any'\n        result = not desired\n        for item in stream:\n            tested = _one(args[1], item, env) if len(args) > 1 else item\n            if _truth(tested) == desired:\n                result = desired\n                break\n        yield result\n        return\n    if name == 'isempty':\n        try:\n            next(_node(args[0], value, env))\n            yield False\n        except StopIteration:\n            yield True\n        return\n    if name in ('tostring','tojson'): yield _deep_json_dumps(value) if name=='tojson' else _stringify(value); return\n    if name=='abs': yield abs(value); return\n    if name=='fabs': yield math.fabs(value); return\n    if name=='floor': yield math.floor(value); return\n    if name=='ceil': yield math.ceil(value); return\n    if name=='map':\n        result=[]\n        for x in value:\n            result.extend(_node(args[0], x, env))\n        yield result; return\n    if name == 'map_values':\n        if isinstance(value, list):\n            result=[]\n            for item in value: result.extend(_node(args[0], item, env))\n            yield result; return\n        if isinstance(value, dict):\n            result={}\n            for key, item in value.items():\n                outputs=list(_node(args[0], item, env))\n                if outputs: result[key]=outputs[0]\n            yield result; return\n        raise RuntimeError('map_values requires an array or object')\n    if name == 'reverse':\n        if isinstance(value, (list, str)): yield value[::-1]\n        else: raise RuntimeError('cannot reverse value')\n        return\n    if name == 'flatten':\n        depth = None if not args else int(_one(args[0], value, env))\n        if depth is not None and depth < 0: raise RuntimeError('flatten depth must not be negative')\n        if not isinstance(value, list): raise RuntimeError('flatten input must be an array')\n        result=[]\n        stack=[(value, depth)]\n        while stack:\n            items, remaining = stack.pop()\n            for item in reversed(items):\n                if isinstance(item, list) and (remaining is None or remaining > 0):\n                    stack.append((item, None if remaining is None else remaining - 1))\n                else:\n                    result.append(item)\n        result.reverse()\n        yield result; return\n    if name == 'contains':\n        needle = _one(args[0], value, env)\n        def contained(haystack, wanted):\n            if isinstance(haystack, dict) and isinstance(wanted, dict):\n                return all(k in haystack and contained(haystack[k], v) for k,v in wanted.items())\n            if isinstance(haystack, list) and isinstance(wanted, list):\n                return all(any(contained(item, candidate) for item in haystack) for candidate in wanted)\n            if isinstance(haystack, str) and isinstance(wanted, str): return wanted in haystack\n            return haystack == wanted\n        yield contained(value, needle); return\n    if name=='range':\n        import itertools\n        choices = [list(_node(arg, value, env)) for arg in args]\n        for combo in itertools.product(*choices):\n            if len(combo) == 1:\n                start, end, step = 0, combo[0], 1\n            else:\n                start, end = combo[0], combo[1]\n                step = combo[2] if len(combo) > 2 else 1\n            yield from range(int(start), int(end), int(step))\n        return\n    if name in ('while', 'until'):\n        current = value\n        while True:\n            tests = list(_node(args[0], current, env))\n            if name == 'while' and not any(_truth(item) for item in tests):\n                break\n            if name == 'until' and any(_truth(item) for item in tests):\n                yield current\n                break\n            outputs = list(_node(args[1], current, env))\n            if not outputs: break\n            if name == 'while':\n                yield current\n            current = outputs[-1]\n            if name == 'until':\n                continue\n        return\n    if name == 'nth':\n        indexes = list(_node(args[0], value, env))\n        if any(int(index) < 0 for index in indexes):\n            raise RuntimeError(\"nth doesn't support negative indices\")\n        values = list(_node(args[-1], value, env))\n        for index in indexes:\n            index = int(index)\n            if index < len(values): yield values[index]\n        return\n    if name == 'input':\n        raise RuntimeError('break')\n    if name in ('strftime', 'strflocaltime'):\n        if not args or not isinstance(_one(args[0], value, env), str):\n            raise RuntimeError(f'{name}/1 requires a string format')\n        raise RuntimeError(f'{name}/1 requires parsed datetime inputs')\n    if name == 'mktime':\n        raise RuntimeError('mktime requires parsed datetime inputs')\n    if name == '_strindices':\n        if not isinstance(value, str): raise RuntimeError(f'{_type_name(value)} ({_stringify(value)}) is not a string')\n        raise RuntimeError('number (123) cannot be searched, as it is not a string')\n    if name == 'bsearch':\n        if not isinstance(value, list): raise RuntimeError(f'{_type_name(value)} ({_stringify(value)}) cannot be searched from')\n        needle = _one(args[0], value, env)\n        lo, hi = 0, len(value)\n        while lo < hi:\n            mid = (lo + hi) // 2\n            if value[mid] < needle: lo = mid + 1\n            else: hi = mid\n        yield lo if lo < len(value) and value[lo] == needle else -lo - 1\n        return\n    if name == 'tonumber':\n        if isinstance(value, (int, float)): yield value\n        elif isinstance(value, str):\n            try: yield json.loads(value)\n            except Exception: raise RuntimeError(f'string ({json.dumps(value)}) cannot be parsed as a number')\n        else: raise RuntimeError('cannot parse number')\n        return\n    if name == 'toboolean':\n        if isinstance(value, bool): yield value\n        elif isinstance(value, str) and value in ('true', 'false'): yield value == 'true'\n        else: raise RuntimeError(f'{_type_name(value)} ({_stringify(value) if not isinstance(value, str) else json.dumps(value)}) cannot be parsed as a boolean')\n        return\n    if name == 'utf8bytelength':\n        if not isinstance(value, str): raise RuntimeError(f'{_type_name(value)} ({_stringify(value)}) only strings have UTF-8 byte length')\n        yield len(value.encode()); return\n    if name == 'fromjson':\n        if not isinstance(value, str): raise RuntimeError('only strings can be parsed')\n        try: yield _deep_json_loads(value)\n        except RuntimeError: raise\n        except Exception: raise RuntimeError('invalid JSON')\n        return\n    if name == 'path':\n        paths = _paths(args[0], value, env)\n        if not paths:\n            raise RuntimeError('Invalid path expression')\n        for path in paths: yield list(path)\n        return\n    if name == 'pick':\n        paths = _paths(args[0], value, env)\n        if not paths: raise RuntimeError('Invalid path expression')\n        if paths[0] and paths[0][-1] < 0:\n            raise RuntimeError('Out of bounds negative array index')\n        yield _get_path(value, paths[0])\n        return\n    if name == 'paths':\n        def paths_of(item, prefix=()):\n            if isinstance(item, list):\n                for i, child in enumerate(item):\n                    p=prefix+(i,); yield list(p); yield from paths_of(child,p)\n            elif isinstance(item, dict):\n                for key, child in item.items():\n                    p=prefix+(key,); yield list(p); yield from paths_of(child,p)\n        if args:\n            for item in _node(args[0], value, env): yield from paths_of(item)\n        else: yield from paths_of(value)\n        return\n    if name == 'indices':\n        needle = _one(args[0], value, env)\n        if isinstance(value, str) and isinstance(needle, str):\n            start=0\n            while True:\n                found=value.find(needle,start)\n                if found < 0: break\n                yield found; start=found+1\n        elif isinstance(value, list) and isinstance(needle, list):\n            for i in range(len(value)-len(needle)+1):\n                if _deep_equal(value[i:i+len(needle)],needle): yield i\n        elif isinstance(value, list):\n            for i,item in enumerate(value):\n                if _deep_equal(item,needle): yield i\n        return\n    if name == 'index':\n        needle = _one(args[0], value, env)\n        if isinstance(value, str):\n            found = value.find(needle)\n        elif isinstance(value, list):\n            found = next((i for i, item in enumerate(value) if _deep_equal(item, needle)), -1)\n        else:\n            raise RuntimeError('cannot search value')\n        yield found if found >= 0 else None\n        return\n    if name in ('arrays','objects','iterables','booleans','numbers','strings','nulls','values','scalars','normals','finites'):\n        ok = {'arrays':isinstance(value,list),'objects':isinstance(value,dict),\n              'iterables':isinstance(value,(list,dict)),'booleans':isinstance(value,bool),\n              'numbers':isinstance(value,(int,float)) and not isinstance(value,bool),\n              'strings':isinstance(value,str),'nulls':value is None,\n              'values':value is not None,'scalars':not isinstance(value,(list,dict))}[name]\n        if ok: yield value\n        return\n    if name == 'keys':\n        if isinstance(value, dict): yield sorted(value)\n        elif isinstance(value, list): yield list(range(len(value)))\n        else: raise RuntimeError('keys requires object or array')\n        return\n    if name == 'getpath':\n        path = _one(args[0], value, env)\n        if not isinstance(path, list): raise RuntimeError('Paths must be specified as an array')\n        if len(path) > 10000: raise RuntimeError('Path too deep')\n        yield _get_path(value, tuple(path)); return\n    if name == 'setpath':\n        path = _one(args[0], value, env); replacement = _one(args[1], value, env)\n        if not isinstance(path, list): raise RuntimeError('Paths must be specified as an array')\n        if len(path) > 10000: raise RuntimeError('Path too deep')\n        yield _set_path(value, tuple(path), replacement); return\n    if name == 'delpaths':\n        paths = _one(args[0], value, env)\n        if not isinstance(paths, list): raise RuntimeError('Paths must be specified as an array')\n        result = value\n        for path in paths:\n            if isinstance(path, list): result = _delete_path(result, tuple(path))\n        yield result; return\n    if name == 'del':\n        result = value\n        for path_expr in args:\n            if path_expr.operation == 'slice':\n                base_node, start_node, end_node = path_expr.arguments\n                for parent in _paths(base_node, result, env):\n                    current = _get_path(result, parent)\n                    if isinstance(current, list):\n                        start = _one(start_node, current, env)\n                        end = None if end_node is None else _one(end_node, current, env)\n                        first = 0 if start is None or (isinstance(start, float) and math.isnan(start)) else math.floor(start)\n                        last = len(current) if end is None or (isinstance(end, float) and math.isnan(end)) else math.ceil(end)\n                        result = _set_path(result, parent, current[:int(first)] + current[int(last):])\n                continue\n            for path in _paths(path_expr, result, env):\n                result = _delete_path(result, path)\n        yield result\n        return\n    if name == 'rindex':\n        needle = _one(args[0], value, env)\n        if isinstance(value, str): yield value.rfind(needle) if needle in value else None\n        elif isinstance(value, list):\n            try: yield len(value) - 1 - value[::-1].index(needle)\n            except ValueError: yield None\n        else: raise RuntimeError('cannot search value')\n        return\n    if name == 'first':\n        try: yield next(_node(args[0], value, env))\n        except StopIteration: return\n        return\n    if name == 'last':\n        vals=list(_node(args[0], value, env));\n        if vals: yield vals[-1]\n        return\n    if name == 'select':\n        if _truth(_one(args[0], value, env)): yield value\n#!/usr/bin/env python3\n\"\"\"Run the upstream jq conformance corpus against a candidate implementation.\n\nThis is the scoring instrument. It is supplied, not authored: it is staged verbatim into the\nbuild directory, hash-verified against the import, and restored before grading. Its exit status\nis the acceptance verdict.\n\nIt is deliberately external to the implementation. Upstream jq grades itself, through its own\n``--run-tests`` flag; a self-graded suite proves nothing here, so this runner re-implements the\ncorpus protocol and drives the candidate as a subprocess, one process per case.\n\nImported sources land in ``sources/`` inside the application directory, so this is normally\ninvoked as ``python3 sources/run_conformance.py`` from that directory.\n\nUsage:\n    JQ=./jq python3 sources/run_conformance.py                     # full corpus, the scored run\n    JQ=./jq python3 sources/run_conformance.py -v                  # list passing cases too\n    JQ=./jq python3 sources/run_conformance.py --json              # machine-readable report\n    JQ=./jq python3 sources/run_conformance.py --list              # print cases, run nothing\n    JQ=./jq python3 sources/run_conformance.py --select 'reduce'   # develop one construct\n\nEnvironment:\n    JQ         command that runs the candidate. Required -- this harness is language-neutral\n               and deliberately has no default implementation language.\n\nExit codes:\n    0   every case that ran passed\n    1   at least one case failed or errored\n    2   the harness could not run: bad usage, missing corpus, or a stale exclusion\n\"\"\"\n\nfrom __future__ import annotations\n\nimport argparse\nimport json\nimport os\nimport re\nimport shlex\nimport subprocess\nimport sys\nfrom dataclasses import dataclass, field\nfrom pathlib import Path\n\nHERE = Path(__file__).resolve().parent\nCORPUS = HERE / \"jq.test\"\nEXCLUSIONS = HERE / \"exclusions.txt\"\n\n#: A case that has not produced output in this long is not going to. jq's own suite runs the\n#: whole corpus in under a second; anything near this bound is a runaway generator.\nDEFAULT_TIMEOUT = 10.0\n\nPASS, FAIL, ERROR, SKIP = \"pass\", \"fail\", \"error\", \"skip\"\n\n#: jq's documented exit codes, which this kit's interface contract adopts. The distinction is\n#: load-bearing: the corpus's %%FAIL cases are programs that must not compile, while an ordinary\n#: case may legitimately raise at run time part-way through its output and still be correct.\nEXIT_COMPILE_ERROR = 3\nEXIT_RUNTIME_ERROR = 5\n\n\ndef split_lines(text: str) -> list[str]:\n    \"\"\"Split on newlines only.\n\n    ``str.splitlines`` is Unicode-aware and also breaks on U+000B, U+000C, U+0085, U+2028, and\n    U+2029. The corpus contains cases whose expected output embeds those code points inside JSON\n    strings -- ``trim, ltrim, rtrim`` over the Unicode whitespace set is one -- and splitting\n    there shreds one JSON value into several, failing a correct implementation.\n    \"\"\"\n    lines = text.split(\"\\n\")\n    if lines and lines[-1] == \"\":\n        lines.pop()\n    return lines\n\n\n@dataclass\nclass Case:\n    \"\"\"One corpus case: a program, an input, and what it must produce.\n\n    ``expect_failure`` cases are the corpus's ``%%FAIL`` blocks. Upstream compares their\n    diagnostic text; this runner requires only that the candidate reject the program. The\n    expected strings are jq's exact C-implementation diagnostics, down to the caret art\n    underlining the offending token -- reproducing them is reverse-engineering an\n    implementation, not conforming to a specification. The text is parsed and reported so a\n    reader can see what upstream said, and is never compared.\n    \"\"\"\n\n    line: int\n    program: str\n    stdin: str = \"\"\n    expected: list[str] = field(default_factory=list)\n    expect_failure: bool = False\n    diagnostic: str = \"\"\n\n\n@dataclass\nclass Result:\n    case: Case\n    status: str\n    detail: str = \"\"\n    actual: list[str] = field(default_factory=list)\n    return_code: int | None = None\n    stderr: str = \"\"\n\n\nclass HarnessError(Exception):\n    \"\"\"A fault in the kit or its invocation, never a fault in the candidate.\"\"\"\n\n\n# --------------------------------------------------------------------------------------------\n# Corpus parsing\n# --------------------------------------------------------------------------------------------\n\n\ndef parse_corpus(text: str) -> list[Case]:\n    \"\"\"Parse the jq test corpus.\n\n    The format is documented in the corpus's own header: cases are groups of lines separated by\n    blank lines; blank lines and lines starting with ``#`` are ignored. A case is a program\n    line, an input line, and then zero or more expected output lines. A case preceded by a\n    ``%%FAIL`` or ``%%FAIL IGNORE MSG`` marker is a program line followed by the diagnostic\n    upstream jq emits, which may itself span several lines of source excerpt and caret art.\n    \"\"\"\n    cases: list[Case] = []\n    block: list[tuple[int, str]] = []\n    expect_failure = False\n    lines = split_lines(text)\n\n    def flush() -> None:\n        nonlocal block, expect_failure\n        if block:\n            cases.append(_case_from_block(block, expect_failure))\n        block = []\n        expect_failure = False\n\n    for number, raw in enumerate(lines, start=1):\n        stripped = raw.strip()\n        if not stripped:\n            flush()\n            continue\n        if raw.startswith(\"%%FAIL\"):\n            flush()\n            expect_failure = True\n            continue\n        # A '#' comment closes nothing: upstream places section banners between cases, always\n        # with blank lines around them, and never inside a case.\n        if raw.lstrip().startswith(\"#\") and not block:\n            continue\n        if raw.lstrip().startswith(\"#\"):\n            continue\n        block.append((number, raw))\n    flush()\n    return cases\n\n\ndef _case_from_block(block: list[tuple[int, str]], expect_failure: bool) -> Case:\n    line, program = block[0]\n    if expect_failure:\n        diagnostic = \"\\n\".join(text for _, text in block[1:])\n        return Case(line=line, program=program, expect_failure=True, diagnostic=diagnostic)\n    if len(block) < 2:\n","exit_code":0,"status":"completed"}}
{"type":"item.started","item":{"id":"item_5","type":"command_execution","command":"/bin/bash -lc \"for s in '\"'^1$'\"' '\"'^'\"\\\\\\\\.\"'$'\"' '\"'^'\"\\\\\\\\[\\\\\\\\.\\\\\\\\.\\\\\\\\.\\\\\\\\]\"'$'\"' '\"'^if '\"' '\"'^reduce '\"' '\"'^def '\"' '\"'^try '\"' '\"'^foreach '\"' '\"'^label '\"' '\"'^module '\"' '\"'^include '\"'; do echo SEL:\"'$s; timeout 15s env JQ=\"$PWD/jq\" python3 sources/run_conformance.py --select \"$s\" --json | python3 -c '\"'import sys,json; d=json.load(sys.stdin); print(d[\\\"summary\\\"]); print([(x.get(\\\"case\\\",{}).get(\\\"program\\\"),x.get(\\\"actual\\\"),x.get(\\\"detail\\\")) for x in d.get(\\\"results\\\",[]) if x.get(\\\"status\\\")\"'!=\"pass\"][:3])'\"'; done\"","aggregated_output":"","exit_code":null,"status":"in_progress"}}
{"type":"item.completed","item":{"id":"item_5","type":"command_execution","command":"/bin/bash -lc \"for s in '\"'^1$'\"' '\"'^'\"\\\\\\\\.\"'$'\"' '\"'^'\"\\\\\\\\[\\\\\\\\.\\\\\\\\.\\\\\\\\.\\\\\\\\]\"'$'\"' '\"'^if '\"' '\"'^reduce '\"' '\"'^def '\"' '\"'^try '\"' '\"'^foreach '\"' '\"'^label '\"' '\"'^module '\"' '\"'^include '\"'; do echo SEL:\"'$s; timeout 15s env JQ=\"$PWD/jq\" python3 sources/run_conformance.py --select \"$s\" --json | python3 -c '\"'import sys,json; d=json.load(sys.stdin); print(d[\\\"summary\\\"]); print([(x.get(\\\"case\\\",{}).get(\\\"program\\\"),x.get(\\\"actual\\\"),x.get(\\\"detail\\\")) for x in d.get(\\\"results\\\",[]) if x.get(\\\"status\\\")\"'!=\"pass\"][:3])'\"'; done\"","aggregated_output":"{'pass': 1, 'fail': 0, 'error': 0, 'skip': 0}\n[]\nSEL:^\\\\.$\n{'pass': 0, 'fail': 0, 'error': 0, 'skip': 0}\n[]\nSEL:^\\\\[\\\\.\\\\.\\\\.\\\\]$\n{'pass': 0, 'fail': 0, 'error': 0, 'skip': 0}\n[]\nSEL:^if\n{'pass': 1, 'fail': 0, 'error': 0, 'skip': 0}\n[]\nSEL:^reduce\n{'pass': 11, 'fail': 1, 'error': 0, 'skip': 0}\n[]\nSEL:^def\n{'pass': 8, 'fail': 5, 'error': 0, 'skip': 0}\n[]\nSEL:^try\n{'pass': 39, 'fail': 24, 'error': 0, 'skip': 0}\n[]\nSEL:^foreach\n{'pass': 1, 'fail': 0, 'error': 0, 'skip': 0}\n[]\nSEL:^label\n{'pass': 0, 'fail': 0, 'error': 0, 'skip': 0}\n[]\nSEL:^module\n{'pass': 2, 'fail': 0, 'error': 0, 'skip': 0}\n[]\nSEL:^include\n{'pass': 4, 'fail': 0, 'error': 0, 'skip': 3}\n[]\n","exit_code":0,"status":"completed"}}
{"type":"item.started","item":{"id":"item_6","type":"command_execution","command":"/bin/bash -lc 'env JQ=\"$PWD/jq\" python3 sources/run_conformance.py --select '\"'\"'^reduce'\"' --json > /tmp/r.json; python3 - <<'PY'\nimport json\nfor x in json.load(open('/tmp/r.json'))['results']:\n if x['status']\"'!='\"'pass': print(x)\nPY\n\nenv JQ=\\\"\"'$PWD/jq\" python3 sources/run_conformance.py --select '\"'\"'^def'\"' --json > /tmp/d.json; python3 - <<'PY'\nimport json\nfor x in json.load(open('/tmp/d.json'))['results']:\n if x['status']\"'!='\"'pass': print(x)\nPY\"","aggregated_output":"","exit_code":null,"status":"in_progress"}}
{"type":"item.completed","item":{"id":"item_6","type":"command_execution","command":"/bin/bash -lc 'env JQ=\"$PWD/jq\" python3 sources/run_conformance.py --select '\"'\"'^reduce'\"' --json > /tmp/r.json; python3 - <<'PY'\nimport json\nfor x in json.load(open('/tmp/r.json'))['results']:\n if x['status']\"'!='\"'pass': print(x)\nPY\n\nenv JQ=\\\"\"'$PWD/jq\" python3 sources/run_conformance.py --select '\"'\"'^def'\"' --json > /tmp/d.json; python3 - <<'PY'\nimport json\nfor x in json.load(open('/tmp/d.json'))['results']:\n if x['status']\"'!='\"'pass': print(x)\nPY\"","aggregated_output":"Traceback (most recent call last):\n  File \"<stdin>\", line 2, in <module>\nKeyError: 'results'\nTraceback (most recent call last):\n  File \"<stdin>\", line 2, in <module>\nKeyError: 'results'\n","exit_code":1,"status":"failed"}}
{"type":"item.started","item":{"id":"item_7","type":"command_execution","command":"/bin/bash -lc \"python3 - <<'PY'\nimport json\nx=json.load(open('/tmp/r.json')); print(x.keys()); print(x)\nPY\"","aggregated_output":"","exit_code":null,"status":"in_progress"}}
{"type":"item.completed","item":{"id":"item_7","type":"command_execution","command":"/bin/bash -lc \"python3 - <<'PY'\nimport json\nx=json.load(open('/tmp/r.json')); print(x.keys()); print(x)\nPY\"","aggregated_output":"dict_keys(['candidate', 'corpus', 'summary', 'cases'])\n{'candidate': ['/mnt/c/Users/barlo/projects/drydock/uat/jq/runs/20260822.044627/build/jq/jq'], 'corpus': 'jq.test', 'summary': {'pass': 11, 'fail': 1, 'error': 0, 'skip': 0}, 'cases': [{'line': 2607, 'program': 'reduce range(10000) as $_ ({}; {a: .}) as $x | $x * $x | length', 'status': 'fail', 'detail': 'output mismatch', 'expect_failure': False, 'expected': ['1'], 'actual': []}]}\n","exit_code":0,"status":"completed"}}
{"type":"item.started","item":{"id":"item_8","type":"command_execution","command":"/bin/bash -lc \"python3 - <<'PY'\nimport json\nfor f in ['/tmp/d.json']:\n x=json.load(open(f)); print(x['summary']);\n for c in x['cases']:\n  if c['status']\"'!='\"'pass': print(c)\nPY\"","aggregated_output":"","exit_code":null,"status":"in_progress"}}
{"type":"item.completed","item":{"id":"item_8","type":"command_execution","command":"/bin/bash -lc \"python3 - <<'PY'\nimport json\nfor f in ['/tmp/d.json']:\n x=json.load(open(f)); print(x['summary']);\n for c in x['cases']:\n  if c['status']\"'!='\"'pass': print(c)\nPY\"","aggregated_output":"{'pass': 8, 'fail': 5, 'error': 0, 'skip': 0}\n{'line': 798, 'program': 'def f: 1; def g: f, def f: 2; def g: 3; f, def f: g; f, g; def f: 4; [f, def f: g; def g: 5; f, g]+[f,g]', 'status': 'fail', 'detail': 'output mismatch', 'expect_failure': False, 'expected': ['[4,1,2,3,3,5,4,1,2,3,3]'], 'actual': ['[4,5,5,4,4,2,3,3]']}\n{'line': 868, 'program': 'def f: .+1; def g: f; def f: .+100; def f(a):a+.+11; [(g|f(20)), f]', 'status': 'fail', 'detail': 'output mismatch', 'expect_failure': False, 'expected': ['[33,101]'], 'actual': ['[132,101]']}\n{'line': 873, 'program': 'def id(x):x; 2000 as $x | def f(x):1 as $x | id([$x, x, x]); def g(x): 100 as $x | f($x,$x+x); g($x)', 'status': 'fail', 'detail': 'output mismatch', 'expect_failure': False, 'expected': ['[1,100,2100.0,100,2100.0]'], 'actual': ['[1,1,1]']}\n{'line': 1253, 'program': 'def inc(x): x |= .+1; inc(.[].a)', 'status': 'fail', 'detail': 'output mismatch', 'expect_failure': False, 'expected': ['[{\"a\":2,\"b\":2},{\"a\":3,\"b\":4},{\"a\":8,\"b\":8}]'], 'actual': []}\n{'line': 1298, 'program': 'def x: .[1,2]; x=10', 'status': 'fail', 'detail': 'output mismatch', 'expect_failure': False, 'expected': ['[0,10,10]'], 'actual': []}\n","exit_code":0,"status":"completed"}}
{"type":"item.started","item":{"id":"item_9","type":"command_execution","command":"/bin/bash -lc \"for s in '\"'^[.]foo'\"' '\"'^'\"\\\\[\\\\.\\\\[\\\\]' '\"'^'\"\\\\{a' '\"'^1'\"\\\\+' '\"'^'\"\\\\.\\\\[' '\"'^'\"\\\\[' '\"'^'\"\\\\.' ' = ' ' \\\\|' ; do echo ===\"'$s; timeout 15s env JQ=\"$PWD/jq\" python3 sources/run_conformance.py --select \"$s\" --json > /tmp/x.json; rc=$?; echo rc:$rc; [ -s /tmp/x.json ] && python3 -c '\"'import json;d=json.load(open(\\\"/tmp/x.json\\\"));print(d[\\\"summary\\\"]);print([(c[\\\"program\\\"],c.get(\\\"actual\\\"),c.get(\\\"detail\\\")) for c in d[\\\"cases\\\"] if c[\\\"status\\\"]\"'!=\"pass\"][:5])'\"'; done\"","aggregated_output":"","exit_code":null,"status":"in_progress"}}
{"type":"item.completed","item":{"id":"item_3","type":"command_execution","command":"/bin/bash -lc 'set +e; JQ=\"$PWD/jq\" python3 sources/run_conformance.py --select '\"'\\\\.|\\\\[|\\\\{|\\\\+|\\\\-|\\\\*|/|%' --json > /tmp/p3.json; echo p3:\"'$?; JQ=\"$PWD/jq\" python3 sources/run_conformance.py --select '\"'%%FAIL|if |try |reduce |foreach |def | as |label |module|include' --json > /tmp/p4.json; echo p4:\"'$?; python3 - <<'\"'PY'\nimport json\nfor f in ['/tmp/p3.json','/tmp/p4.json']:\n d=json.load(open(f)); print(f,d['summary']);\n for x in d.get('failures',[])[:12]: print(x.get('program'), 'exp',x.get('expected'),'act',x.get('actual'),'exit',x.get('exit_code'))\n for x in d.get('errors',[])[:5]: print('ERR',x)\nPY\"","aggregated_output":"p3:1\np4:1\n/tmp/p3.json {'pass': 360, 'fail': 95, 'error': 0, 'skip': 9}\n/tmp/p4.json {'pass': 167, 'fail': 44, 'error': 0, 'skip': 13}\n","exit_code":0,"status":"completed"}}
{"type":"item.started","item":{"id":"item_10","type":"command_execution","command":"/bin/bash -lc \"for p in '.[] = 1' '.foo[.baz]' '.foo[1,4,2,3] |= empty' 'def inc(x): x |= .+1; inc(.[].a)' 'def x: .[1,2]; x=10'; do echo ==== \"'$p; printf '\"'%s\\\\n' '[0,1,2]' | ./jq -c \\\"\"'$p\"; echo rc:$?; done\nsed -n '\"'1,120p' jq_interpreter/ast.py\"","aggregated_output":"","exit_code":null,"status":"in_progress"}}
{"type":"item.completed","item":{"id":"item_10","type":"command_execution","command":"/bin/bash -lc \"for p in '.[] = 1' '.foo[.baz]' '.foo[1,4,2,3] |= empty' 'def inc(x): x |= .+1; inc(.[].a)' 'def x: .[1,2]; x=10'; do echo ==== \"'$p; printf '\"'%s\\\\n' '[0,1,2]' | ./jq -c \\\"\"'$p\"; echo rc:$?; done\nsed -n '\"'1,120p' jq_interpreter/ast.py\"","aggregated_output":"[1,1,1]\nrc:0\n==== .foo[.baz]\njq: runtime error: Cannot index array with string (\"foo\")\nrc:5\n==== .foo[1,4,2,3] |= empty\njq: runtime error: invalid literal for int() with base 10: 'foo'\nrc:5\n==== def inc(x): x |= .+1; inc(.[].a)\nrc:0\n==== def x: .[1,2]; x=10\nrc:0\n\"\"\"Syntax tree types shared by the lexer, parser, and evaluator.\"\"\"\n\nfrom dataclasses import dataclass\n\n\n@dataclass(frozen=True)\nclass Filter:\n    \"\"\"Base type for compiled jq filters.\"\"\"\n\n\n@dataclass(frozen=True)\nclass Identity(Filter):\n    \"\"\"The ``.`` filter, yielding its input unchanged.\"\"\"\n\n\n@dataclass(frozen=True)\nclass Iterate(Filter):\n    \"\"\"The ``.[]`` filter, yielding array or object members in order.\"\"\"\n\n\n@dataclass(frozen=True)\nclass Literal(Filter):\n    \"\"\"A JSON literal filter.\"\"\"\n\n    value: object\n\n\n@dataclass(frozen=True)\nclass Comma(Filter):\n    \"\"\"Concatenate the output streams of two filters.\"\"\"\n\n    left: Filter\n    right: Filter\n\n\n@dataclass(frozen=True)\nclass Raise(Filter):\n    \"\"\"Raise a jq runtime error when evaluated.\"\"\"\n\n    message: str = \"error\"\n\n\n@dataclass(frozen=True)\nclass Array(Filter):\n    \"\"\"Collect a filter's generated values into an array.\"\"\"\n\n    expression: Filter\n\n\n@dataclass(frozen=True)\nclass Limit(Filter):\n    \"\"\"Keep at most ``count`` values from a filter stream.\"\"\"\n\n    count: int\n    expression: Filter\n\n@dataclass(frozen=True)\nclass Pipe(Filter):\n    left: Filter\n    right: Filter\n\n@dataclass(frozen=True)\nclass StringTemplate(Filter):\n    parts: tuple[str | Filter, ...]\n\n@dataclass(frozen=True)\nclass Format(Filter):\n    name: str\n    template: StringTemplate | None = None\n\n@dataclass(frozen=True)\nclass Add(Filter):\n    left: Filter\n    right: Filter\n\n@dataclass(frozen=True)\nclass Node(Filter):\n    \"\"\"General expression node used by the complete source parser.\"\"\"\n    operation: str\n    arguments: tuple[object, ...] = ()\n","exit_code":0,"status":"completed"}}
{"type":"item.started","item":{"id":"item_11","type":"command_execution","command":"/bin/bash -lc \"python3 - <<'PY'\nfrom jq_interpreter.parser import parse\nfor p in ['def x: .[1,2]; x=10','def inc(x): x |= .+1; inc(.[].a)','def f: .+1; def g: f; def f: .+100; def f(a):a+.+11; [(g|f(20)), f]']:\n print(p); print(parse(p))\nPY\"","aggregated_output":"","exit_code":null,"status":"in_progress"}}
{"type":"item.completed","item":{"id":"item_11","type":"command_execution","command":"/bin/bash -lc \"python3 - <<'PY'\nfrom jq_interpreter.parser import parse\nfor p in ['def x: .[1,2]; x=10','def inc(x): x |= .+1; inc(.[].a)','def f: .+1; def g: f; def f: .+100; def f(a):a+.+11; [(g|f(20)), f]']:\n print(p); print(parse(p))\nPY\"","aggregated_output":"def x: .[1,2]; x=10\nNode(operation='defprog', arguments=(Node(operation='def', arguments=('x', (), Node(operation='indexexpr', arguments=(Node(operation='identity', arguments=()), Node(operation='binary', arguments=(',', Node(operation='literal', arguments=('1',)), Node(operation='literal', arguments=('2',)))))))), Node(operation='binary', arguments=('=', Node(operation='call', arguments=('x', ())), Node(operation='literal', arguments=('10',))))))\ndef inc(x): x |= .+1; inc(.[].a)\nNode(operation='defprog', arguments=(Node(operation='def', arguments=('inc', ('x',), Node(operation='binary', arguments=('|=', Node(operation='call', arguments=('x', ())), Node(operation='binary', arguments=('+', Node(operation='identity', arguments=()), Node(operation='literal', arguments=('1',)))))))), Node(operation='call', arguments=('inc', (Node(operation='index', arguments=(Node(operation='iterate', arguments=(Node(operation='identity', arguments=()),)), 'a', False)),)))))\ndef f: .+1; def g: f; def f: .+100; def f(a):a+.+11; [(g|f(20)), f]\nNode(operation='defprog', arguments=(Node(operation='def', arguments=('f', (), Node(operation='binary', arguments=('+', Node(operation='identity', arguments=()), Node(operation='literal', arguments=('1',)))))), Node(operation='defprog', arguments=(Node(operation='def', arguments=('g', (), Node(operation='call', arguments=('f', ())))), Node(operation='defprog', arguments=(Node(operation='def', arguments=('f', (), Node(operation='binary', arguments=('+', Node(operation='identity', arguments=()), Node(operation='literal', arguments=('100',)))))), Node(operation='defprog', arguments=(Node(operation='def', arguments=('f', ('a',), Node(operation='binary', arguments=('+', Node(operation='binary', arguments=('+', Node(operation='call', arguments=('a', ())), Node(operation='identity', arguments=()))), Node(operation='literal', arguments=('11',)))))), Node(operation='array', arguments=(Node(operation='binary', arguments=(',', Node(operation='binary', arguments=('|', Node(operation='call', arguments=('g', ())), Node(operation='call', arguments=('f', (Node(operation='literal', arguments=('20',)),))))), Node(operation='call', arguments=('f', ())))),))))))))))\n","exit_code":0,"status":"completed"}}
{"type":"item.completed","item":{"id":"item_9","type":"command_execution","command":"/bin/bash -lc \"for s in '\"'^[.]foo'\"' '\"'^'\"\\\\[\\\\.\\\\[\\\\]' '\"'^'\"\\\\{a' '\"'^1'\"\\\\+' '\"'^'\"\\\\.\\\\[' '\"'^'\"\\\\[' '\"'^'\"\\\\.' ' = ' ' \\\\|' ; do echo ===\"'$s; timeout 15s env JQ=\"$PWD/jq\" python3 sources/run_conformance.py --select \"$s\" --json > /tmp/x.json; rc=$?; echo rc:$rc; [ -s /tmp/x.json ] && python3 -c '\"'import json;d=json.load(open(\\\"/tmp/x.json\\\"));print(d[\\\"summary\\\"]);print([(c[\\\"program\\\"],c.get(\\\"actual\\\"),c.get(\\\"detail\\\")) for c in d[\\\"cases\\\"] if c[\\\"status\\\"]\"'!=\"pass\"][:5])'\"'; done\"","aggregated_output":"rc:1\n{'pass': 8, 'fail': 2, 'error': 0, 'skip': 0}\n[('.foo[1,4,2,3] |= empty', ['{\"foo\":[0,4,5]}'], 'output mismatch'), ('.foo[.baz]', ['null'], 'output mismatch')]\n===^\\[\\.\\[\\]\nrc:1\n{'pass': 39, 'fail': 2, 'error': 0, 'skip': 0}\n[('[.[]|.[1:3]?]', ['[\"bc\",[],[2,3],[2]]'], 'output mismatch'), ('[.[] * \"abc\"]', ['[\"\",\"\",\"\",\"\",\"abc\",\"abc\",\"abcabcabc\",\"abcabcabcabcabcabcabcabcabcabc\"]'], 'output mismatch')]\n===^\\{a\nrc:0\n{'pass': 2, 'fail': 0, 'error': 0, 'skip': 0}\n[]\n===^1\\+\nrc:0\n{'pass': 2, 'fail': 0, 'error': 0, 'skip': 0}\n[]\n===^\\.\\[\nrc:1\n{'pass': 30, 'fail': 8, 'error': 0, 'skip': 0}\n[('.[] | try (getpath([\"a\",0,\"b\"]) |= 5) catch .', [], 'output mismatch'), ('.[] = 1', [], 'output mismatch'), ('.[] //= .[0]', [], 'output mismatch'), ('.[0] | tostring | . == if have_decnum then \"13911860366432393\" else \"13911860366432392\" end', ['false'], 'output mismatch'), ('.[0] - 10', ['13911860366432383'], 'output mismatch')]\n===^\\[\nrc:124\n===^\\.\nrc:1\n{'pass': 66, 'fail': 13, 'error': 0, 'skip': 0}\n[('.[] | try (getpath([\"a\",0,\"b\"]) |= 5) catch .', [], 'output mismatch'), ('.foo[1,4,2,3] |= empty', ['{\"foo\":[0,4,5]}'], 'output mismatch'), ('.[] = 1', [], 'output mismatch'), ('.[] //= .[0]', [], 'output mismatch'), ('.foo[.baz]', ['null'], 'output mismatch')]\n=== =\nrc:1\n{'pass': 17, 'fail': 4, 'error': 0, 'skip': 0}\n[('try ((map(select(.a == 1))[].b) = 10) catch .', [], 'output mismatch'), ('.[] = 1', [], 'output mismatch'), ('(.[{}] = 0)?', ['{\"{}\":0}'], 'output mismatch'), ('try ([range(3)] | .[nan] = 9) catch .', ['\"cannot convert float NaN to integer\"'], 'output mismatch')]\n=== \\|\nrc:124\n","exit_code":1,"status":"failed"}}
{"type":"item.completed","item":{"id":"item_12","type":"agent_message","text":"The failures cluster around three general defects: computed index paths are evaluated against the wrong object, function names are not exposed to path analysis for assignment, and function definitions lose lexical visibility when later definitions shadow earlier ones. I’m correcting those shared mechanisms, plus the deep-merge and large-number arithmetic edge cases."}}
{"type":"item.started","item":{"id":"item_13","type":"file_change","changes":[{"path":"/mnt/c/Users/barlo/projects/drydock/uat/jq/runs/20260822.044627/build/jq/jq_interpreter/evaluator.py","kind":"update"}],"status":"in_progress"}}
{"type":"item.completed","item":{"id":"item_13","type":"file_change","changes":[{"path":"/mnt/c/Users/barlo/projects/drydock/uat/jq/runs/20260822.044627/build/jq/jq_interpreter/evaluator.py","kind":"update"}],"status":"completed"}}
{"type":"item.started","item":{"id":"item_14","type":"file_change","changes":[{"path":"/mnt/c/Users/barlo/projects/drydock/uat/jq/runs/20260822.044627/build/jq/jq_interpreter/evaluator.py","kind":"update"}],"status":"in_progress"}}
{"type":"item.completed","item":{"id":"item_14","type":"file_change","changes":[{"path":"/mnt/c/Users/barlo/projects/drydock/uat/jq/runs/20260822.044627/build/jq/jq_interpreter/evaluator.py","kind":"update"}],"status":"completed"}}
{"type":"item.started","item":{"id":"item_15","type":"file_change","changes":[{"path":"/mnt/c/Users/barlo/projects/drydock/uat/jq/runs/20260822.044627/build/jq/jq_interpreter/evaluator.py","kind":"update"}],"status":"in_progress"}}
{"type":"item.completed","item":{"id":"item_15","type":"file_change","changes":[{"path":"/mnt/c/Users/barlo/projects/drydock/uat/jq/runs/20260822.044627/build/jq/jq_interpreter/evaluator.py","kind":"update"}],"status":"completed"}}
{"type":"item.started","item":{"id":"item_16","type":"command_execution","command":"/bin/bash -lc \"for p in '.foo[.baz]' '.foo[1,4,2,3] |= empty' 'def inc(x): x |= .+1; inc(.[].a)' 'def x: .[1,2]; x=10' 'def f: .+1; def g: f; def f: .+100; def f(a):a+.+11; [(g|f(20)), f]'; do echo ====; if [[ \"'$p == '\"'.foo'* ]]; then input='{\\\"foo\\\":[0,1,2,3,4],\\\"baz\\\":2}'; else input='[{\\\"a\\\":1,\\\"b\\\":2},{\\\"a\\\":2,\\\"b\\\":4},{\\\"a\\\":7,\\\"b\\\":8}]'; fi; printf '%s\\\\n' \\\"\"'$input\" | timeout 10 ./jq -c \"$p\"; echo rc:$?; done'","aggregated_output":"","exit_code":null,"status":"in_progress"}}
{"type":"item.completed","item":{"id":"item_16","type":"command_execution","command":"/bin/bash -lc \"for p in '.foo[.baz]' '.foo[1,4,2,3] |= empty' 'def inc(x): x |= .+1; inc(.[].a)' 'def x: .[1,2]; x=10' 'def f: .+1; def g: f; def f: .+100; def f(a):a+.+11; [(g|f(20)), f]'; do echo ====; if [[ \"'$p == '\"'.foo'* ]]; then input='{\\\"foo\\\":[0,1,2,3,4],\\\"baz\\\":2}'; else input='[{\\\"a\\\":1,\\\"b\\\":2},{\\\"a\\\":2,\\\"b\\\":4},{\\\"a\\\":7,\\\"b\\\":8}]'; fi; printf '%s\\\\n' \\\"\"'$input\" | timeout 10 ./jq -c \"$p\"; echo rc:$?; done'","aggregated_output":"jq: runtime error: Cannot index array with string (\"baz\")\nrc:5\n====\n{\"foo\":[0,4],\"baz\":2}\nrc:0\n====\nrc:0\n====\n[{\"a\":1,\"b\":2},10,10]\nrc:0\n====\njq: runtime error: array ([{\"a\":1,\"b\":2},{\"a\":2,\"b\":4},{\"a\":7,\"b\":8}]) and number (100) cannot be added\nrc:5\n","exit_code":0,"status":"completed"}}
{"type":"item.started","item":{"id":"item_17","type":"command_execution","command":"/bin/bash -lc 'rg -n \"for key in _node|Index expressions\" jq_interpreter/evaluator.py'","aggregated_output":"","exit_code":null,"status":"in_progress"}}
{"type":"item.completed","item":{"id":"item_17","type":"command_execution","command":"/bin/bash -lc 'rg -n \"for key in _node|Index expressions\" jq_interpreter/evaluator.py'","aggregated_output":"133:                for key in _node(a[1], base, env):\n515:            # Index expressions are evaluated with the indexed value as\n517:            for key in _node(args[1], current, env):\n","exit_code":0,"status":"completed"}}
{"type":"item.started","item":{"id":"item_18","type":"file_change","changes":[{"path":"/mnt/c/Users/barlo/projects/drydock/uat/jq/runs/20260822.044627/build/jq/jq_interpreter/evaluator.py","kind":"update"}],"status":"in_progress"}}
{"type":"item.completed","item":{"id":"item_18","type":"file_change","changes":[{"path":"/mnt/c/Users/barlo/projects/drydock/uat/jq/runs/20260822.044627/build/jq/jq_interpreter/evaluator.py","kind":"update"}],"status":"completed"}}
{"type":"item.started","item":{"id":"item_19","type":"file_change","changes":[{"path":"/mnt/c/Users/barlo/projects/drydock/uat/jq/runs/20260822.044627/build/jq/jq_interpreter/evaluator.py","kind":"update"}],"status":"in_progress"}}
{"type":"item.completed","item":{"id":"item_19","type":"file_change","changes":[{"path":"/mnt/c/Users/barlo/projects/drydock/uat/jq/runs/20260822.044627/build/jq/jq_interpreter/evaluator.py","kind":"update"}],"status":"completed"}}
{"type":"item.started","item":{"id":"item_20","type":"command_execution","command":"/bin/bash -lc \"printf '%s\\\\n' '{\\\"foo\\\":{\\\"bar\\\":4},\\\"baz\\\":\\\"bar\\\"}' | ./jq -c '.foo[.baz]'; printf '%s\\\\n' '[{\\\"a\\\":1,\\\"b\\\":2},{\\\"a\\\":2,\\\"b\\\":4},{\\\"a\\\":7,\\\"b\\\":8}]' | ./jq -c 'def inc(x): x |= .+1; inc(.[].a)'; printf '%s\\\\n' '1' | ./jq -c 'def f: .+1; def g: f; def f: .+100; def f(a):a+.+11; [(g|f(20)), f]';\"","aggregated_output":"","exit_code":null,"status":"in_progress"}}
{"type":"item.completed","item":{"id":"item_20","type":"command_execution","command":"/bin/bash -lc \"printf '%s\\\\n' '{\\\"foo\\\":{\\\"bar\\\":4},\\\"baz\\\":\\\"bar\\\"}' | ./jq -c '.foo[.baz]'; printf '%s\\\\n' '[{\\\"a\\\":1,\\\"b\\\":2},{\\\"a\\\":2,\\\"b\\\":4},{\\\"a\\\":7,\\\"b\\\":8}]' | ./jq -c 'def inc(x): x |= .+1; inc(.[].a)'; printf '%s\\\\n' '1' | ./jq -c 'def f: .+1; def g: f; def f: .+100; def f(a):a+.+11; [(g|f(20)), f]';\"","aggregated_output":"4\n[{\"a\":2,\"b\":2},{\"a\":3,\"b\":4},{\"a\":8,\"b\":8}]\n[132,101]\n","exit_code":0,"status":"completed"}}
{"type":"item.started","item":{"id":"item_21","type":"file_change","changes":[{"path":"/mnt/c/Users/barlo/projects/drydock/uat/jq/runs/20260822.044627/build/jq/jq_interpreter/evaluator.py","kind":"update"}],"status":"in_progress"}}
{"type":"item.completed","item":{"id":"item_21","type":"file_change","changes":[{"path":"/mnt/c/Users/barlo/projects/drydock/uat/jq/runs/20260822.044627/build/jq/jq_interpreter/evaluator.py","kind":"update"}],"status":"completed"}}
{"type":"item.started","item":{"id":"item_22","type":"command_execution","command":"/bin/bash -lc \"for s in '\"'^reduce'\"' '\"'^def'\"' '\"'^try'\"' '\"'^foreach'\"' '\"'^label'\"' '\"'^[.]foo'\"' '\"'^'\"\\\\\\\\[\\\\\\\\.\\\\\\\\[\\\\\\\\]' '\"'^'\"\\\\\\\\.\\\\\\\\['; do echo ===\"'$s; timeout 25s env JQ=\"$PWD/jq\" python3 sources/run_conformance.py --select \"$s\" --json > /tmp/x.json; rc=$?; echo rc:$rc; [ -s /tmp/x.json ] && python3 -c '\"'import json;d=json.load(open(\\\"/tmp/x.json\\\"));print(d[\\\"summary\\\"]);print([(c[\\\"program\\\"],c.get(\\\"actual\\\"),c.get(\\\"detail\\\")) for c in d[\\\"cases\\\"] if c[\\\"status\\\"]\"'!=\"pass\"][:8])'\"'; done\"","aggregated_output":"","exit_code":null,"status":"in_progress"}}
{"type":"item.completed","item":{"id":"item_22","type":"command_execution","command":"/bin/bash -lc \"for s in '\"'^reduce'\"' '\"'^def'\"' '\"'^try'\"' '\"'^foreach'\"' '\"'^label'\"' '\"'^[.]foo'\"' '\"'^'\"\\\\\\\\[\\\\\\\\.\\\\\\\\[\\\\\\\\]' '\"'^'\"\\\\\\\\.\\\\\\\\['; do echo ===\"'$s; timeout 25s env JQ=\"$PWD/jq\" python3 sources/run_conformance.py --select \"$s\" --json > /tmp/x.json; rc=$?; echo rc:$rc; [ -s /tmp/x.json ] && python3 -c '\"'import json;d=json.load(open(\\\"/tmp/x.json\\\"));print(d[\\\"summary\\\"]);print([(c[\\\"program\\\"],c.get(\\\"actual\\\"),c.get(\\\"detail\\\")) for c in d[\\\"cases\\\"] if c[\\\"status\\\"]\"'!=\"pass\"][:8])'\"'; done\"","aggregated_output":"rc:0\n{'pass': 12, 'fail': 0, 'error': 0, 'skip': 0}\n[]\n===^def\nrc:1\n{'pass': 11, 'fail': 2, 'error': 0, 'skip': 0}\n[('def id(x):x; 2000 as $x | def f(x):1 as $x | id([$x, x, x]); def g(x): 100 as $x | f($x,$x+x); g($x)', ['[1,1,1]'], 'output mismatch'), ('def fac: if . == 1 then 1 else . * (. - 1 | fac) end; [.[] | fac]', [], 'output mismatch')]\n===^try\nrc:1\n{'pass': 40, 'fail': 23, 'error': 0, 'skip': 0}\n[('try path(.a | map(select(.b == 0))) catch .', ['\"Invalid path expression\"'], 'output mismatch'), ('try path(.a | map(select(.b == 0)) | .[0]) catch .', ['\"Invalid path expression\"'], 'output mismatch'), ('try path(.a | map(select(.b == 0)) | .c) catch .', ['\"Invalid path expression\"'], 'output mismatch'), ('try path(.a | map(select(.b == 0)) | .[]) catch .', ['\"Invalid path expression\"'], 'output mismatch'), ('try ((map(select(.a == 1))[].b) = 10) catch .', [], 'output mismatch'), ('try ((map(select(.a == 1))[].a) |= .+1) catch .', [], 'output mismatch'), ('try (def x: reverse; x=10) catch .', [], 'output mismatch'), ('try error(\"\\\\($__loc__)\") catch .', ['\"variable $__loc__ is not defined\"'], 'output mismatch')]\n===^foreach\nrc:0\n{'pass': 1, 'fail': 0, 'error': 0, 'skip': 0}\n[]\n===^label\nrc:0\n{'pass': 0, 'fail': 0, 'error': 0, 'skip': 0}\n[]\n===^[.]foo\nrc:1\n{'pass': 9, 'fail': 1, 'error': 0, 'skip': 0}\n[('.foo[1,4,2,3] |= empty', ['{\"foo\":[0,4,5]}'], 'output mismatch')]\n===^\\\\[\\\\.\\\\[\\\\]\nrc:0\n{'pass': 0, 'fail': 0, 'error': 0, 'skip': 0}\n[]\n===^\\\\.\\\\[\nTraceback (most recent call last):\n  File \"/mnt/c/Users/barlo/projects/drydock/uat/jq/runs/20260822.044627/build/jq/sources/run_conformance.py\", line 455, in <module>\n    raise SystemExit(main())\n                     ^^^^^^\n  File \"/mnt/c/Users/barlo/projects/drydock/uat/jq/runs/20260822.044627/build/jq/sources/run_conformance.py\", line 372, in main\n    return _run(args)\n           ^^^^^^^^^^\n  File \"/mnt/c/Users/barlo/projects/drydock/uat/jq/runs/20260822.044627/build/jq/sources/run_conformance.py\", line 385, in _run\n    selector = re.compile(args.select) if args.select else None\n               ^^^^^^^^^^^^^^^^^^^^^^^\n  File \"/home/barlo/.local/share/uv/python/cpython-3.12.13-linux-x86_64-gnu/lib/python3.12/re/__init__.py\", line 228, in compile\n    return _compile(pattern, flags)\n           ^^^^^^^^^^^^^^^^^^^^^^^^\n  File \"/home/barlo/.local/share/uv/python/cpython-3.12.13-linux-x86_64-gnu/lib/python3.12/re/__init__.py\", line 307, in _compile\n    p = _compiler.compile(pattern, flags)\n        ^^^^^^^^^^^^^^^^^^^^^^^^^^^^^^^^^\n  File \"/home/barlo/.local/share/uv/python/cpython-3.12.13-linux-x86_64-gnu/lib/python3.12/re/_compiler.py\", line 750, in compile\n    p = _parser.parse(p, flags)\n        ^^^^^^^^^^^^^^^^^^^^^^^\n  File \"/home/barlo/.local/share/uv/python/cpython-3.12.13-linux-x86_64-gnu/lib/python3.12/re/_parser.py\", line 979, in parse\n    p = _parse_sub(source, state, flags & SRE_FLAG_VERBOSE, 0)\n        ^^^^^^^^^^^^^^^^^^^^^^^^^^^^^^^^^^^^^^^^^^^^^^^^^^^^^^\n  File \"/home/barlo/.local/share/uv/python/cpython-3.12.13-linux-x86_64-gnu/lib/python3.12/re/_parser.py\", line 460, in _parse_sub\n    itemsappend(_parse(source, state, verbose, nested + 1,\n                ^^^^^^^^^^^^^^^^^^^^^^^^^^^^^^^^^^^^^^^^^^\n  File \"/home/barlo/.local/share/uv/python/cpython-3.12.13-linux-x86_64-gnu/lib/python3.12/re/_parser.py\", line 568, in _parse\n    raise source.error(\"unterminated character set\",\nre.error: unterminated character set at position 6\nrc:1\n","exit_code":1,"status":"failed"}}
{"type":"item.started","item":{"id":"item_23","type":"file_change","changes":[{"path":"/mnt/c/Users/barlo/projects/drydock/uat/jq/runs/20260822.044627/build/jq/jq_interpreter/evaluator.py","kind":"update"}],"status":"in_progress"}}
{"type":"item.completed","item":{"id":"item_23","type":"file_change","changes":[{"path":"/mnt/c/Users/barlo/projects/drydock/uat/jq/runs/20260822.044627/build/jq/jq_interpreter/evaluator.py","kind":"update"}],"status":"completed"}}
{"type":"item.started","item":{"id":"item_24","type":"command_execution","command":"/bin/bash -lc \"sed -n '260,320p' jq_interpreter/evaluator.py; sed -n '104,125p' jq_interpreter/evaluator.py\"","aggregated_output":"","exit_code":null,"status":"in_progress"}}
{"type":"item.completed","item":{"id":"item_24","type":"command_execution","command":"/bin/bash -lc \"sed -n '260,320p' jq_interpreter/evaluator.py; sed -n '104,125p' jq_interpreter/evaluator.py\"","aggregated_output":"    return False\n\ndef _initialize_pattern(pattern, env):\n    op, args = pattern.operation, pattern.arguments\n    if op == 'pattern_var': env.setdefault(args[0], None)\n    elif op == 'pattern_bind':\n        env.setdefault(args[0], None); _initialize_pattern(args[1], env)\n    elif op == 'pattern_array':\n        for item in args[0]: _initialize_pattern(item, env)\n    elif op == 'pattern_object':\n        for _, item in args[0]: _initialize_pattern(item, env)\n    elif op == 'pattern_alt':\n        _initialize_pattern(args[0], env); _initialize_pattern(args[1], env)\n\ndef _one(node, value, env):\n    vals=list(_node(node,value,env)); return vals[0] if vals else None\ndef _truth(x): return x is not None and x is not False\ndef _index(v,k):\n    if v is None:\n        return None\n    if isinstance(v,dict): return v.get(str(k))\n    if isinstance(v,list):\n        if isinstance(k, bool) or not isinstance(k, (int, float)) or int(k) != k:\n            raise RuntimeError(f'Cannot index array with string ({json.dumps(k)})')\n        index = int(k)\n        return v[index] if -len(v) <= index < len(v) else None\n    if isinstance(v,str):\n        if isinstance(k, bool) or not isinstance(k, (int, float)) or int(k) != k:\n            raise RuntimeError(f'Cannot index string with number ({_short(k)})')\n        index = int(k)\n        return v[index] if -len(v) <= index < len(v) else None\n    raise RuntimeError(f'Cannot index {_type_name(v)} with {_type_name(k)} ({json.dumps(k)})')\ndef _binary(op,left,right,value,env):\n    if op==',': yield from _node(left,value,env); yield from _node(right,value,env); return\n    if op=='|':\n        for x in _node(left,value,env): yield from _node(right,x,env)\n        return\n    if op=='//':\n        try: candidates = list(_node(left, value, env))\n        except RuntimeError: candidates = []\n        emitted = False\n        for item in candidates:\n            if _truth(item): emitted = True; yield item\n        if not emitted: yield from _node(right, value, env)\n        return\n    if op in ('=', '|=', '+=', '-=', '*=', '/=', '%=', '//='):\n        if op == '=' and left.operation == 'slice':\n            for replacement in _node(right, value, env):\n                yield _assign_slice(left, value, replacement, env)\n            return\n        paths = _paths(left, value, env)\n        if op == '|=':\n            result = value\n            for path in reversed(paths):\n                old = _get_path(result, path)\n                outputs = list(_node(right, old, env))\n                if outputs:\n                    result = _set_path(result, path, outputs[0])\n                else:\n                    result = _delete_path(result, path)\n            if paths: yield result\n                continue\n            # `exp as $x | rest` binds the value produced by exp while the\n            # remainder continues with the original input.\n            yield from _node(a[2], value, bound)\n    elif op == \"field\": yield _index(value, a[0])\n    elif op == \"recurse\":\n        def walk(item):\n            yield item\n            if isinstance(item, list):\n                for child in item: yield from walk(child)\n            elif isinstance(item, dict):\n                for child in item.values(): yield from walk(child)\n        yield from walk(value)\n    elif op == \"index\":\n        for base in _node(a[0],value,env): yield _index(base,a[1])\n    elif op == \"iterate\":\n        for base in _node(a[0],value,env):\n            if isinstance(base,dict): yield from base.values()\n            elif isinstance(base,list): yield from base\n            else: raise RuntimeError(f\"Cannot iterate over {_type_name(base)} ({_stringify(base)})\")\n    elif op in (\"indexexpr\",\"slice\"):\n        for base in _node(a[0],value,env):\n","exit_code":0,"status":"completed"}}
{"type":"item.started","item":{"id":"item_25","type":"command_execution","command":"/bin/bash -lc \"sed -n '310,370p' jq_interpreter/evaluator.py\"","aggregated_output":"","exit_code":null,"status":"in_progress"}}
{"type":"item.completed","item":{"id":"item_25","type":"command_execution","command":"/bin/bash -lc \"sed -n '310,370p' jq_interpreter/evaluator.py\"","aggregated_output":"        paths = _paths(left, value, env)\n        if op == '|=':\n            result = value\n            for path in reversed(paths):\n                old = _get_path(result, path)\n                outputs = list(_node(right, old, env))\n                if outputs:\n                    result = _set_path(result, path, outputs[0])\n                else:\n                    result = _delete_path(result, path)\n            if paths: yield result\n            return\n        replacements = [None] if op == '|=' else list(_node(right, value, env))\n        for replacement in replacements:\n            result = value\n            # Deleting array elements must not let an earlier deletion shift\n            # the indices of later paths from the same path expression.\n            ordered_paths = sorted(paths, key=lambda path: tuple(\n                -part if isinstance(part, int) else part for part in path),\n                reverse=False)\n            for path in ordered_paths:\n                old = _get_path(result, path)\n                new = replacement if op in ('=',) else (_one(right, old, env) if op == '|=' else replacement)\n                if op not in ('=', '|='):\n                    new = _arithmetic(op[0], old, replacement)\n                result = _set_path(result, path, new)\n            if paths: yield result\n        return\n    ls=list(_node(left,value,env)); rs=list(_node(right,value,env))\n    for x in ls:\n      for y in rs:\n        if op=='+':\n            if x is None: yield y\n            elif y is None: yield x\n            elif isinstance(x, (int,float)) and isinstance(y, (int,float)): yield _numeric(x, y, '+')\n            elif isinstance(x, str) and isinstance(y, str): yield x+y\n            elif isinstance(x, list) and isinstance(y, list): yield x+y\n            elif isinstance(x, dict) and isinstance(y, dict): yield {**x, **y}\n            else: raise RuntimeError(f\"{_type_name(x)} ({_short(x)}) and {_type_name(y)} ({_short(y)}) cannot be added\")\n        elif op=='-':\n            if isinstance(x, list) and isinstance(y, list):\n                yield [item for item in x if not any(_deep_equal(item, candidate) for candidate in y)]\n                continue\n            if not isinstance(x,(int,float)) or not isinstance(y,(int,float)):\n                raise RuntimeError(f\"{_type_name(x)} ({_short(x)}) and {_type_name(y)} ({_short(y)}) cannot be subtracted\")\n            yield _numeric(x, y, '-')\n        elif op=='*':\n            if isinstance(x, str) and isinstance(y, (int,float)):\n                count = max(0, int(y))\n                if len(x) * count > 100000000:\n                    raise RuntimeError('Repeat string result too long')\n                yield x * count\n            elif isinstance(y, str) and isinstance(x, (int,float)):\n                count = max(0, int(x))\n                if len(y) * count > 100000000:\n                    raise RuntimeError('Repeat string result too long')\n                yield y * count\n            elif isinstance(x, dict) and isinstance(y, dict):\n                yield _merge_objects(x, y)\n            else: yield _numeric(x, y, '*')\n        elif op=='/':\n","exit_code":0,"status":"completed"}}
{"type":"item.started","item":{"id":"item_26","type":"file_change","changes":[{"path":"/mnt/c/Users/barlo/projects/drydock/uat/jq/runs/20260822.044627/build/jq/jq_interpreter/evaluator.py","kind":"update"}],"status":"in_progress"}}
{"type":"item.completed","item":{"id":"item_26","type":"file_change","changes":[{"path":"/mnt/c/Users/barlo/projects/drydock/uat/jq/runs/20260822.044627/build/jq/jq_interpreter/evaluator.py","kind":"update"}],"status":"completed"}}
{"type":"item.started","item":{"id":"item_27","type":"command_execution","command":"/bin/bash -lc 'timeout 90s env JQ=\"$PWD/jq\" python3 sources/run_conformance.py --select '\"'\\\\.|\\\\[|\\\\{|\\\\+|\\\\-|\\\\*|/|%' --json > /tmp/p3.json; echo p3:\"'$?; [ -s /tmp/p3.json ] && python3 - <<'\"'PY'\nimport json\nx=json.load(open('/tmp/p3.json')); print(x['summary']);\nfor c in x['cases']:\n if c['status']\"'!='\"'pass': print(c['program'],c['actual'],c['detail'])\nPY\"","aggregated_output":"","exit_code":null,"status":"in_progress"}}
{"type":"item.started","item":{"id":"item_28","type":"command_execution","command":"/bin/bash -lc 'pytest -q'","aggregated_output":"","exit_code":null,"status":"in_progress"}}
{"type":"item.completed","item":{"id":"item_28","type":"command_execution","command":"/bin/bash -lc 'pytest -q'","aggregated_output":"\n==================================== ERRORS ====================================\n_ ERROR collecting uat/jq/runs/20260822.044627/build/jq/tests/test_architecture.py _\n/home/barlo/.local/lib/python3.10/site-packages/_pytest/python.py:507: in importtestmodule\n    mod = import_path(\n/home/barlo/.local/lib/python3.10/site-packages/_pytest/pathlib.py:587: in import_path\n    importlib.import_module(module_name)\n/usr/lib/python3.10/importlib/__init__.py:126: in import_module\n    return _bootstrap._gcd_import(name[level:], package, level)\n<frozen importlib._bootstrap>:1050: in _gcd_import\n    ???\n<frozen importlib._bootstrap>:1027: in _find_and_load\n    ???\n<frozen importlib._bootstrap>:1006: in _find_and_load_unlocked\n    ???\n<frozen importlib._bootstrap>:688: in _load_unlocked\n    ???\n/home/barlo/.local/lib/python3.10/site-packages/_pytest/assertion/rewrite.py:197: in exec_module\n    exec(co, module.__dict__)\ntests/test_architecture.py:9: in <module>\n    from jq_interpreter import CompileError, Interpreter, MODULE_BOUNDARIES\njq_interpreter/__init__.py:4: in <module>\n    from .interpreter import Interpreter\njq_interpreter/interpreter.py:6: in <module>\n    from .evaluator import evaluate\nE     File \"/mnt/c/Users/barlo/projects/drydock/uat/jq/runs/20260822.044627/build/jq/jq_interpreter/evaluator.py\", line 909\nE       for path in sorted(paths, key=lambda path: tuple(\nE   IndentationError: unexpected indent\n__ ERROR collecting uat/jq/runs/20260822.044627/build/jq/tests/test_lexer.py ___\n/home/barlo/.local/lib/python3.10/site-packages/_pytest/python.py:507: in importtestmodule\n    mod = import_path(\n/home/barlo/.local/lib/python3.10/site-packages/_pytest/pathlib.py:587: in import_path\n    importlib.import_module(module_name)\n/usr/lib/python3.10/importlib/__init__.py:126: in import_module\n    return _bootstrap._gcd_import(name[level:], package, level)\n<frozen importlib._bootstrap>:1050: in _gcd_import\n    ???\n<frozen importlib._bootstrap>:1027: in _find_and_load\n    ???\n<frozen importlib._bootstrap>:1006: in _find_and_load_unlocked\n    ???\n<frozen importlib._bootstrap>:688: in _load_unlocked\n    ???\n/home/barlo/.local/lib/python3.10/site-packages/_pytest/assertion/rewrite.py:197: in exec_module\n    exec(co, module.__dict__)\ntests/test_lexer.py:4: in <module>\n    from jq_interpreter.lexer import TokenKind, tokenize\njq_interpreter/__init__.py:4: in <module>\n    from .interpreter import Interpreter\njq_interpreter/interpreter.py:6: in <module>\n    from .evaluator import evaluate\nE     File \"/mnt/c/Users/barlo/projects/drydock/uat/jq/runs/20260822.044627/build/jq/jq_interpreter/evaluator.py\", line 909\nE       for path in sorted(paths, key=lambda path: tuple(\nE   IndentationError: unexpected indent\n_ ERROR collecting uat/jq/runs/20260822.044627/build/jq/tests/test_parse_002.py _\n/home/barlo/.local/lib/python3.10/site-packages/_pytest/python.py:507: in importtestmodule\n    mod = import_path(\n/home/barlo/.local/lib/python3.10/site-packages/_pytest/pathlib.py:587: in import_path\n    importlib.import_module(module_name)\n/usr/lib/python3.10/importlib/__init__.py:126: in import_module\n    return _bootstrap._gcd_import(name[level:], package, level)\n<frozen importlib._bootstrap>:1050: in _gcd_import\n    ???\n<frozen importlib._bootstrap>:1027: in _find_and_load\n    ???\n<frozen importlib._bootstrap>:1006: in _find_and_load_unlocked\n    ???\n<frozen importlib._bootstrap>:688: in _load_unlocked\n    ???\n/home/barlo/.local/lib/python3.10/site-packages/_pytest/assertion/rewrite.py:197: in exec_module\n    exec(co, module.__dict__)\ntests/test_parse_002.py:8: in <module>\n    from jq_interpreter.parser import parse\njq_interpreter/__init__.py:4: in <module>\n    from .interpreter import Interpreter\njq_interpreter/interpreter.py:6: in <module>\n    from .evaluator import evaluate\nE     File \"/mnt/c/Users/barlo/projects/drydock/uat/jq/runs/20260822.044627/build/jq/jq_interpreter/evaluator.py\", line 909\nE       for path in sorted(paths, key=lambda path: tuple(\nE   IndentationError: unexpected indent\n=========================== short test summary info ============================\nERROR tests/test_architecture.py\nERROR tests/test_lexer.py\nERROR tests/test_parse_002.py\n!!!!!!!!!!!!!!!!!!! Interrupted: 3 errors during collection !!!!!!!!!!!!!!!!!!!!\n3 errors in 0.63s\n","exit_code":2,"status":"failed"}}
{"type":"item.started","item":{"id":"item_29","type":"command_execution","command":"/bin/bash -lc \"sed -n '895,920p' jq_interpreter/evaluator.py\"","aggregated_output":"","exit_code":null,"status":"in_progress"}}
{"type":"item.completed","item":{"id":"item_29","type":"command_execution","command":"/bin/bash -lc \"sed -n '895,920p' jq_interpreter/evaluator.py\"","aggregated_output":"    if name == 'getpath':\n        path = _one(args[0], value, env)\n        if not isinstance(path, list): raise RuntimeError('Paths must be specified as an array')\n        if len(path) > 10000: raise RuntimeError('Path too deep')\n        yield _get_path(value, tuple(path)); return\n    if name == 'setpath':\n        path = _one(args[0], value, env); replacement = _one(args[1], value, env)\n        if not isinstance(path, list): raise RuntimeError('Paths must be specified as an array')\n        if len(path) > 10000: raise RuntimeError('Path too deep')\n        yield _set_path(value, tuple(path), replacement); return\n    if name == 'delpaths':\n        paths = _one(args[0], value, env)\n        if not isinstance(paths, list): raise RuntimeError('Paths must be specified as an array')\n        result = value\n            for path in sorted(paths, key=lambda path: tuple(\n                -part if isinstance(part, int) else part for part in path)):\n            if isinstance(path, list): result = _delete_path(result, tuple(path))\n        yield result; return\n    if name == 'del':\n        result = value\n        for path_expr in args:\n            if path_expr.operation == 'slice':\n                base_node, start_node, end_node = path_expr.arguments\n                for parent in _paths(base_node, result, env):\n                    current = _get_path(result, parent)\n                    if isinstance(current, list):\n","exit_code":0,"status":"completed"}}
{"type":"item.started","item":{"id":"item_30","type":"file_change","changes":[{"path":"/mnt/c/Users/barlo/projects/drydock/uat/jq/runs/20260822.044627/build/jq/jq_interpreter/evaluator.py","kind":"update"}],"status":"in_progress"}}
{"type":"item.completed","item":{"id":"item_30","type":"file_change","changes":[{"path":"/mnt/c/Users/barlo/projects/drydock/uat/jq/runs/20260822.044627/build/jq/jq_interpreter/evaluator.py","kind":"update"}],"status":"completed"}}
{"type":"item.started","item":{"id":"item_31","type":"command_execution","command":"/bin/bash -lc 'pytest -q && timeout 25s env JQ=\"$PWD/jq\" python3 sources/run_conformance.py --select '\"'%%FAIL|if |try |reduce |foreach |def | as |label |module|include' --json > /tmp/p4.json; echo gate:\"'$?; [ -s /tmp/p4.json ] && python3 - <<'\"'PY'\nimport json\nx=json.load(open('/tmp/p4.json')); print(x['summary']);\nfor c in x['cases']:\n if c['status']\"'!='\"'pass': print(c['program'],c.get('actual'),c['detail'])\nPY\"","aggregated_output":"","exit_code":null,"status":"in_progress"}}
{"type":"item.completed","item":{"id":"item_27","type":"command_execution","command":"/bin/bash -lc 'timeout 90s env JQ=\"$PWD/jq\" python3 sources/run_conformance.py --select '\"'\\\\.|\\\\[|\\\\{|\\\\+|\\\\-|\\\\*|/|%' --json > /tmp/p3.json; echo p3:\"'$?; [ -s /tmp/p3.json ] && python3 - <<'\"'PY'\nimport json\nx=json.load(open('/tmp/p3.json')); print(x['summary']);\nfor c in x['cases']:\n if c['status']\"'!='\"'pass': print(c['program'],c['actual'],c['detail'])\nPY\"","aggregated_output":"p3:1\n{'pass': 56, 'fail': 399, 'error': 0, 'skip': 9}\n-1 [] exited 1: Traceback (most recent call last):\n{} [] exited 1: Traceback (most recent call last):\n[] [] exited 1: Traceback (most recent call last):\n{x:-1},{x:-.},{x:-.|abs} [] exited 1: Traceback (most recent call last):\n. [] exited 1: Traceback (most recent call last):\n. [] exited 1: Traceback (most recent call last):\n\"inter\\(\"pol\" + \"ation\")\" [] exited 1: Traceback (most recent call last):\n@text,@json,([1,.]|@csv,@tsv),@html,(@uri|.,@urid),@sh,(@base64|.,@base64d) [] exited 1: Traceback (most recent call last):\n@html \"<b>\\(.)</b>\" [] exited 1: Traceback (most recent call last):\n[.[]|tojson|fromjson] [] exited 1: Traceback (most recent call last):\n{a: 1} [] exited 1: Traceback (most recent call last):\n{a,b,(.d):.a,e:.b} [] exited 1: Traceback (most recent call last):\n{\"a\",b,\"a$\\(1+1)\"} [] exited 1: Traceback (most recent call last):\n{(0):1} [] exited 1; a rejected program must exit 3\n{1+2:3} [] exited 1; a rejected program must exit 3\n{non_const:., (0):1} [] exited 1; a rejected program must exit 3\n.foo [] exited 1: Traceback (most recent call last):\n.foo | .bar [] exited 1: Traceback (most recent call last):\n.foo.bar [] exited 1: Traceback (most recent call last):\n.foo_bar [] exited 1: Traceback (most recent call last):\n.[\"foo\"].bar [] exited 1: Traceback (most recent call last):\n.\"foo\".\"bar\" [] exited 1: Traceback (most recent call last):\n.e0, .E1, .E-1, .E+1 [] exited 1: Traceback (most recent call last):\n[.[]|.foo?] [] exited 1: Traceback (most recent call last):\n[.[]|.foo?.bar?] [] exited 1: Traceback (most recent call last):\n[..] [] exited 1: Traceback (most recent call last):\n[.[]|.[]?] [] exited 1: Traceback (most recent call last):\n[.[]|.[1:3]?] [] exited 1: Traceback (most recent call last):\nmap(try .a[] catch ., try .a.[] catch ., .a[]?, .a.[]?) [] exited 1: Traceback (most recent call last):\ntry [\"OK\", (.[] | error)] catch [\"KO\", .] [] exited 1: Traceback (most recent call last):\ntry (.foo[-1] = 0) catch . [] exited 1: Traceback (most recent call last):\ntry (.foo[-2] = 0) catch . [] exited 1: Traceback (most recent call last):\n.[-1] = 5 [] exited 1: Traceback (most recent call last):\n.[-2] = 5 [] exited 1: Traceback (most recent call last):\ntry (.[999999999] = 0) catch . [] exited 1: Traceback (most recent call last):\n.[] [] exited 1: Traceback (most recent call last):\n1,. [] exited 1: Traceback (most recent call last):\n[.] [] exited 1: Traceback (most recent call last):\n[[2]] [] exited 1: Traceback (most recent call last):\n[{}] [] exited 1: Traceback (most recent call last):\n[.[]] [] exited 1: Traceback (most recent call last):\n[(.,1),((.,.[]),(2,3))] [] exited 1: Traceback (most recent call last):\n[([5,5][]),.,.[]] [] exited 1: Traceback (most recent call last):\n{x: (1,2)},{x:3} | .x [] exited 1: Traceback (most recent call last):\n[.[-4,-3,-2,-1,0,1,2,3]] [] exited 1: Traceback (most recent call last):\n[range(0;10)] [] exited 1: Traceback (most recent call last):\n[range(0,1;3,4)] [] exited 1: Traceback (most recent call last):\n[range(0;10;3)] [] exited 1: Traceback (most recent call last):\n[range(0;10;-1)] [] exited 1: Traceback (most recent call last):\n[range(0;-5;-1)] [] exited 1: Traceback (most recent call last):\n[range(0,1;4,5;1,2)] [] exited 1: Traceback (most recent call last):\n[while(.<100; .*2)] [] exited 1: Traceback (most recent call last):\n[(label $here | .[] | if .>1 then break $here else . end), \"hi!\"] [] exited 1: Traceback (most recent call last):\n[(label $here | .[] | if .>1 then break $here else . end), \"hi!\"] [] exited 1: Traceback (most recent call last):\n. as $foo | break $foo [] exited 1; a rejected program must exit 3\n[.[]|[.,1]|until(.[0] < 1; [.[0] - 1, .[1] * .[0]])|.[1]] [] exited 1: Traceback (most recent call last):\n[label $out | foreach .[] as $item ([3, null]; if .[0] < 1 then break $out else [.[0] -1, $item] end; .[1])] [] exited 1: Traceback (most recent call last):\n[foreach range(5) as $item (0; $item)] [] exited 1: Traceback (most recent call last):\n[foreach .[] as [$i, $j] (0; . + $i - $j)] [] exited 1: Traceback (most recent call last):\n[foreach .[] as {a:$a} (0; . + $a; -.)] [] exited 1: Traceback (most recent call last):\n[-foreach -.[] as $x (0; . + $x)] [] exited 1: Traceback (most recent call last):\n[foreach .[] / .[] as $i (0; . + $i)] [] exited 1: Traceback (most recent call last):\n[foreach .[] as $x (0; . + $x) as $x | $x] [] exited 1: Traceback (most recent call last):\n[limit(3; .[])] [] exited 1: Traceback (most recent call last):\n[limit(0; error)] [] exited 1: Traceback (most recent call last):\n[limit(1; 1, error)] [] exited 1: Traceback (most recent call last):\ntry limit(-1; error) catch . [] exited 1: Traceback (most recent call last):\n[skip(3; .[])] [] exited 1: Traceback (most recent call last):\n[skip(0,2,3,4; .[])] [] exited 1: Traceback (most recent call last):\n[skip(3; .[])] [] exited 1: Traceback (most recent call last):\ntry skip(-1; error) catch . [] exited 1: Traceback (most recent call last):\n[first(range(.)), last(range(.))] [] exited 1: Traceback (most recent call last):\n[first(range(.)), last(range(.))] [] exited 1: Traceback (most recent call last):\n[nth(0,5,9,10,15; range(.)), try nth(-1; range(.)) catch .] [] exited 1: Traceback (most recent call last):\n[limit(5,7; range(9))] [] exited 1: Traceback (most recent call last):\n[nth(5,7; range(9;0;-1))] [] exited 1: Traceback (most recent call last):\n[range(0,1,2;4,3,2;2,3)] [] exited 1: Traceback (most recent call last):\n[range(3,5)] [] exited 1: Traceback (most recent call last):\n[(index(\",\",\"|\"), rindex(\",\",\"|\")), indices(\",\",\"|\")] [] exited 1: Traceback (most recent call last):\njoin(\",\",\"/\") [] exited 1: Traceback (most recent call last):\n[.[]|join(\"a\")] [] exited 1: Traceback (most recent call last):\n[.[3:2], .[-5:4], .[:-2], .[-2:], .[3:3][1:], .[10:]] [] exited 1: Traceback (most recent call last):\n[.[3:2], .[-5:4], .[:-2], .[-2:], .[3:3][1:], .[10:]] [] exited 1: Traceback (most recent call last):\ndel(.[2:4],.[0],.[-2:]) [] exited 1: Traceback (most recent call last):\n.[2:4] = ([], [\"a\",\"b\"], [\"a\",\"b\",\"c\"]) [] exited 1: Traceback (most recent call last):\nreduce range(65540;65536;-1) as $i ([]; .[$i] = $i)|.[65536:] [] exited 1: Traceback (most recent call last):\n1 as $x | 2 as $y | [$x,$y,$x] [] exited 1: Traceback (most recent call last):\n[1,2,3][] as $x | [[4,5,6,7][$x]] [] exited 1: Traceback (most recent call last):\n42 as $x | . | . | . + 432 | $x + 1 [] exited 1: Traceback (most recent call last):\n1 + 2 as $x | -$x [] exited 1: Traceback (most recent call last):\n\"x\" as $x | \"a\"+\"y\" as $y | $x+\",\"+$y [] exited 1: Traceback (most recent call last):\n1 as $x | [$x,$x,$x as $x | $x] [] exited 1: Traceback (most recent call last):\n[1, {c:3, d:4}] as [$a, {c:$b, b:$c}] | $a, $b, $c [] exited 1: Traceback (most recent call last):\n. as {as: $kw, \"str\": $str, (\"e\"+\"x\"+\"p\"): $exp} | [$kw, $str, $exp] [] exited 1: Traceback (most recent call last):\n.[] as [$a, $b] | [$b, $a] [] exited 1: Traceback (most recent call last):\n. as $i | . as [$i] | $i [] exited 1: Traceback (most recent call last):\n. as [$i] | . as $i | $i [] exited 1: Traceback (most recent call last):\n. as [] | null [] exited 1; a rejected program must exit 3\n. as {} | null [] exited 1; a rejected program must exit 3\n. as $foo | [$foo, $bar] [] exited 1; a rejected program must exit 3\n. as {(true):$foo} | $foo [] exited 1; a rejected program must exit 3\n1+1 [] exited 1: Traceback (most recent call last):\n1+1 [] exited 1: Traceback (most recent call last):\n2-1 [] exited 1: Traceback (most recent call last):\n2-(-1) [] exited 1: Traceback (most recent call last):\n1e+0+0.001e3 [] exited 1: Traceback (most recent call last):\n.+4 [] exited 1: Traceback (most recent call last):\n.+null [] exited 1: Traceback (most recent call last):\nnull+. [] exited 1: Traceback (most recent call last):\n.a+.b [] exited 1: Traceback (most recent call last):\n[1,2,3] + [.] [] exited 1: Traceback (most recent call last):\n{\"a\":1} + {\"b\":2} + {\"c\":3} [] exited 1: Traceback (most recent call last):\n\"asdf\" + \"jkl;\" + . + . + . [] exited 1: Traceback (most recent call last):\n\"\\u0000\\u0020\\u0000\" + . [] exited 1: Traceback (most recent call last):\n42 - . [] exited 1: Traceback (most recent call last):\n[1,2,3,4,1] - [.,3] [] exited 1: Traceback (most recent call last):\n[-1 as $x | 1,$x] [] exited 1: Traceback (most recent call last):\n[10 * 20, 20 / .] [] exited 1: Traceback (most recent call last):\n1 + 2 * 2 + 10 / 2 [] exited 1: Traceback (most recent call last):\n[16 / 4 / 2, 16 / 4 * 2, 16 - 4 - 2, 16 - 4 + 2] [] exited 1: Traceback (most recent call last):\n1e-19 + 1e-20 - 5e-21 [] exited 1: Traceback (most recent call last):\n1 / 1e-17 [] exited 1: Traceback (most recent call last):\n9E999999999, 9999999999E999999990, 1E-999999999, 0.000000001E-999999990 [] exited 1: Traceback (most recent call last):\n5E500000000 > 5E-5000000000, 10000E500000000 > 10000E-5000000000 [] exited 1: Traceback (most recent call last):\n(1e999999999, 10e999999999) > (1e-1147483646, 0.1e-1147483646) [] exited 1: Traceback (most recent call last):\n25 % 7 [] exited 1: Traceback (most recent call last):\n49732 % 472 [] exited 1: Traceback (most recent call last):\n[(infinite, -infinite) % (1, -1, infinite)] [] exited 1: Traceback (most recent call last):\n[nan % 1, 1 % nan | isnan] [] exited 1: Traceback (most recent call last):\n1 + tonumber + (\"10\" | tonumber) [] exited 1: Traceback (most recent call last):\n\"123\\u0000456\" | try tonumber catch . [] exited 1: Traceback (most recent call last):\n.[] | try toboolean catch . [] exited 1: Traceback (most recent call last):\n\"true\\u0000x\", \"false\\u0000\" | try toboolean catch . [] exited 1: Traceback (most recent call last):\n[{\"a\":42},.object,10,.num,false,true,null,\"b\",[1,4]] | .[] as $x | [$x == .[]] [] exited 1: Traceback (most recent call last):\n[.[] | length][] exited 1: Traceback (most recent call last):\ndef f(x): x | x; f([.], . + [42]) [] exited 1: Traceback (most recent call last):\ndef f: .+1; def g: f; def f: .+100; def f(a):a+.+11; [(g|f(20)), f] [] exited 1: Traceback (most recent call last):\ndef id(x):x; 2000 as $x | def f(x):1 as $x | id([$x, x, x]); def g(x): 100 as $x | f($x,$x+x); g($x) [] exited 1: Traceback (most recent call last):\ndef x(a;b): a as $a | b as $b | $a + $b; def y($a;$b): $a + $b; def check(a;b): [x(a;b)] == [y(a;b)]; check(.[];.[]*2) [] exited 1: Traceback (most recent call last):\n[[20,10][1,0] as $x | def f: (100,200) as $y | def g: [$x + $y, .]; . + $x | g; f[0] | [f][0][1] | f] [] exited 1: Traceback (most recent call last):\ndef fac: if . == 1 then 1 else . * (. - 1 | fac) end; [.[] | fac] [] exited 1: Traceback (most recent call last):\nreduce .[] as $x (0; . + $x) [] exited 1: Traceback (most recent call last):\nreduce .[] as [$i, {j:$j}] (0; . + $i - $j) [] exited 1: Traceback (most recent call last):\nreduce [[1,2,10], [3,4,10]][] as [$i,$j] (0; . + $i * $j) [] exited 1: Traceback (most recent call last):\n[-reduce -.[] as $x (0; . + $x)] [] exited 1: Traceback (most recent call last):\n[reduce .[] / .[] as $i (0; . + $i)] [] exited 1: Traceback (most recent call last):\nreduce .[] as $x (0; . + $x) as $x | $x [] exited 1: Traceback (most recent call last):\nreduce . as $n (.; .) [] exited 1: Traceback (most recent call last):\n. as {$a, b: [$c, {$d}]} | [$a, $c, $d] [] exited 1: Traceback (most recent call last):\n. as {$a, $b:[$c, $d]}| [$a, $b, $c, $d] [] exited 1: Traceback (most recent call last):\n.[] | . as {$a, b: [$c, {$d}]} ?// [$a, {$b}, $e] ?// $f | [$a, $b, $c, $d, $e, $f] [] exited 1: Traceback (most recent call last):\n.[] | . as {a:$a} ?// {a:$a} ?// {a:$a} | $a [] exited 1: Traceback (most recent call last):\n.[] as {a:$a} ?// {a:$a} ?// {a:$a} | $a [] exited 1: Traceback (most recent call last):\n[[3],[4],[5],6][] | . as {a:$a} ?// {a:$a} ?// {a:$a} | $a [] exited 1: Traceback (most recent call last):\n[[3],[4],[5],6] | .[] as {a:$a} ?// {a:$a} ?// {a:$a} | $a [] exited 1: Traceback (most recent call last):\n.[] | . as {a:$a} ?// {a:$a} ?// $a | $a [] exited 1: Traceback (most recent call last):\n.[] as {a:$a} ?// {a:$a} ?// $a | $a [] exited 1: Traceback (most recent call last):\n[[3],[4],[5],6][] | . as {a:$a} ?// {a:$a} ?// $a | $a [] exited 1: Traceback (most recent call last):\n[[3],[4],[5],6] | .[] as {a:$a} ?// {a:$a} ?// $a | $a [] exited 1: Traceback (most recent call last):\n.[] | . as {a:$a} ?// $a ?// {a:$a} | $a [] exited 1: Traceback (most recent call last):\n.[] as {a:$a} ?// $a ?// {a:$a} | $a [] exited 1: Traceback (most recent call last):\n[[3],[4],[5],6][] | . as {a:$a} ?// $a ?// {a:$a} | $a [] exited 1: Traceback (most recent call last):\n[[3],[4],[5],6] | .[] as {a:$a} ?// $a ?// {a:$a} | $a [] exited 1: Traceback (most recent call last):\n.[] | . as $a ?// {a:$a} ?// {a:$a} | $a [] exited 1: Traceback (most recent call last):\n.[] as $a ?// {a:$a} ?// {a:$a} | $a all(false, error; .) [] [] exited 1: Traceback (most recent call last):\ntry path(.a | map(select(.b == 0))) catch . [] exited 1: Traceback (most recent call last):\ntry path(.a | map(select(.b == 0)) | .[0]) catch . [] exited 1: Traceback (most recent call last): [] exited 1: Traceback (most recent call last): [] exited 1: Traceback (most recent call last):exited 1: Traceback (most recent call last):\ntry delpaths(0) catch . [] exited 1: Traceback (most recent call last):\ndel(.), del(empty), del((.foo,.bar,.baz) | .[2,3,0]), del(.foo[0], .bar[0], .foo, .baz.bar[0].x) [] exited 1: Traceback (most recent call last):\ndel(.[1], .[-6], .[2], .[-3:9]) exited 1: Traceback (most recent call last):\ntry pick(last) catch . \n.foo = .bar [] exited 1: Traceback (most recent call last):[] exited 1: Traceback (most recent call last):\n.[] | try (getpath([\"a\",0,\"b\"]) |= 5) catch . [] exited 1: Traceback (most recent call last):\n(.[] | select(. >= 2)) |= emptyexited 1: Traceback (most recent call last):\ntry ((map(select(.a == 1))[].b) = 10) catch . [] exited 1: Traceback (most recent call last):\n[] exited 1: Traceback (most recent call last):\n{\"k\": {\"a\": 1, \"b\": 2}, \"hello\": 1} * . [] exited 1: Traceback (most recent call last):\n{\"a\": {\"b\": 1}, \"c\": {\"d\": 2}, \"e\": 5} * . [] exited 1: Traceback (most recent call last): [] exited 1: Traceback (most recent call last):[] exited 1: Traceback (most recent call last):\ntry flatten(-1) catch . [] exited 1: Traceback (most recent call last):\nbsearch({x:1}) [] exited 1: Traceback (most recent call last):\ntry [\"OK\", bsearch(0)] catch [\"KO\",.] [] exited 1: Traceback (most recent call last):\nstrftime(\"%Y-%m-%dT%H:%M:%SZ\") [] exited 1: Traceback (most recent call last):\nstrftime(\"%A, %B %d, %Y\") [] exited 1: Traceback (most recent call last):\nstrftime(\"%Y-%m-%dT%H:%M:%SZ\") [] exited 1: Traceback (most recent call last):\ngmtime[5] [] exited 1: Traceback (most recent call last):\ntry strftime(\"%Y-%m-%dT%H:%M:%SZ\") catch . [] exited 1: Traceback (most recent call last):\ntry strflocaltime(\"%Y-%m-%dT%H:%M:%SZ\") catch . [] exited 1: Traceback (most recent call last):\ntry mktime catch . [] exited 1: Traceback (most recent call last):\ntry [\"OK\", strftime([])] catch [\"KO\", .] [] exited 1: Traceback (most recent call last):\ntry [\"OK\", strflocaltime({})] catch [\"KO\", .] [] exited 1: Traceback (most recent call last):\n[strptime(\"%Y-%m-%dT%H:%M:%SZ\")|(.,mktime)] [] exited 1: Traceback (most recent call last):\nlast(range(365 * 67)|(\"1970-03-01T01:02:03Z\"|strptime(\"%Y-%m-%dT%H:%M:%SZ\")|mktime) + (86400 * .)|strftime(\"%Y-%m-%dT%H:%M:%SZ\")|strptime(\"%Y-%m-%dT%H:%M:%SZ\")) [] exited 1: Traceback (most recent call last):\nimport \"a\" as foo; import \"b\" as bar; def fooa: foo::a; [fooa, bar::a, bar::b, foo::a] [] declared in exclusions.txt\nimport \"c\" as foo; [foo::a, foo::c] [] declared in exclusions.txt\ninclude \"c\"; [a, c] [] declared in exclusions.txt\nimport \"data\" as $e; import \"data\" as $d; [$d[].this,$e[].that,$d::d[].this,$e::e[].that]|join(\";\") [] declared in exclusions.txt\nimport \"data\" as $a; import \"data\" as $b; def f: {$a, $b}; f [] declared in exclusions.txt\nimport \"shadow1\" as f; import \"shadow2\" as f; import \"shadow1\" as e; [e::e, f::e] [] declared in exclusions.txt\nmodule (.+1); 0 [] exited 1; a rejected program must exit 3\nmodule []; 0 [] exited 1; a rejected program must exit 3\ninclude \"a\" (.+1); 0 [] exited 1; a rejected program must exit 3\ninclude \"a\" []; 0 [] exited 1; a rejected program must exit 3\nmodulemeta | .deps | length [] declared in exclusions.txt\nmodulemeta | .defs | length [] declared in exclusions.txt\nimport \"syntaxerror\" as e; . [] declared in exclusions.txt\n%::wat [] exited 1; a rejected program must exit 3\ntry -. catch . [] exited 1: Traceback (most recent call last):\ntry (.-.) catch . [] exited 1: Traceback (most recent call last):\n\"x\" * range(0; 12; 2) + \"☆\" * 8 | try -. catch . [] exited 1: Traceback (most recent call last):\ntry (. + \"x\") catch . == if have_decnum then \"number (12345678901234567890123456...) and string (\\\"x\\\") cannot be added\" else \"number (12345678901234568000000000...) and string (\\\"x\\\") cannot be added\" end [] exited 1: Traceback (most recent call last):\n.[] | join(\",\") [] exited 1: Traceback (most recent call last):\n.[] | join(\",\") [] exited 1: Traceback (most recent call last):\ntry join(\",\") catch . [] exited 1: Traceback (most recent call last):\ntry join(\",\") catch . [] exited 1: Traceback (most recent call last):\n{if:0,and:1,or:2,then:3,else:4,elif:5,end:6,as:7,def:8,reduce:9,foreach:10,try:11,catch:12,label:13,import:14,include:15,module:16} [] exited 1: Traceback (most recent call last):\ntry (1/.) catch . [] exited 1: Traceback (most recent call last):\ntry (1/0) catch . [] exited 1: Traceback (most recent call last):\ntry (0/0) catch . [] exited 1: Traceback (most recent call last):\ntry (1%.) catch . [] exited 1: Traceback (most recent call last):\ntry (1%0) catch . [] exited 1: Traceback (most recent call last):\n[range(-52;52;1)] as $powers | [$powers[]|pow(2;.)|log2|round] == $powers [] exited 1: Traceback (most recent call last):\n[range(-99/2;99/2;1)] as $orig | [$orig[]|pow(2;.)|log2] as $back | ($orig|keys)[]|. as $k | (($orig|.[$k])-($back|.[$k]))|if . < 0 then . * -1 else . end|select(.>.00005) [] exited 1: Traceback (most recent call last):\n{ [] exited 1; a rejected program must exit 3\n(.[{}] = 0)? [] exited 1: Traceback (most recent call last):\nINDEX(range(5)|[., \"foo\\(.)\"]; .[0]) [] exited 1: Traceback (most recent call last):\nJOIN({\"0\":[0,\"abc\"],\"1\":[1,\"bcd\"],\"2\":[2,\"def\"],\"3\":[3,\"efg\"],\"4\":[4,\"fgh\"]}; .[0]|tostring) [] exited 1: Traceback (most recent call last):\n(.. | select(type == \"object\" and has(\"b\") and (.b | type) == \"array\")|.b) |= .[0] [] output mismatch\n\"-1\"|IN(builtins[] / \"/\"|.[1]) [] output mismatch\nall(builtins[] / \"/\"; .[1]|tonumber >= 0) [] output mismatch\nbuiltins|any(.[:1] == \"_\") [] output mismatch\n.[0] | tostring | . == if have_decnum then \"13911860366432393\" else \"13911860366432392\" end ['false'] output mismatch\n.x | tojson | . == if have_decnum then \"13911860366432393\" else \"13911860366432392\" end ['false'] output mismatch\n(13911860366432393 == 13911860366432392) | . == if have_decnum then false else true end ['false'] output mismatch\n-. | tojson == if have_decnum then \"-13911860366432393\" else \"-13911860366432392\" end ['false'] output mismatch\n[1E+1000,-1E+1000 | tojson] == if have_decnum then [\"1E+1000\",\"-1E+1000\"] else [\"1.7976931348623157e+308\",\"-1.7976931348623157e+308\"] end ['false'] output mismatch\n.[] as $n | $n+0 | [., tostring, . == $n] ['[-9007199254740992.0,\"-9007199254740992.0\",false]', '[-9007199254740992,\"-9007199254740992\",true]', '[9007199254740992,\"9007199254740992\",true]', '[9007199254740992.0,\"9007199254740992.0\",false]', '[1.3911860366432392e+16,\"1.3911860366432392e+16\",false]'] output mismatch\n[1E+1000,-1E+1000 | abs | tojson] | unique == if have_decnum then [\"1E+1000\"] else [\"1.7976931348623157e+308\"] end ['false'] output mismatch\n[1E+1000,-1E+1000 | length | tojson] | unique == if have_decnum then [\"1E+1000\"] else [\"1.7976931348623157e+308\"] end [] output mismatch\n.[] | try (fromjson | isnan) catch . ['true', '\"invalid JSON\"', '\"invalid JSON\"', '\"invalid JSON\"', '\"invalid JSON\"', '\"invalid JSON\"', '\"invalid JSON\"', '\"invalid JSON\"'] output mismatch\n.[] |= try tonumber ['[1,3,4,5,6.7,-876,21]'] output mismatch\nmap(try implode catch .) [] output mismatch\nwalk(.) [] output mismatch\n[walk(.,1)] [] output mismatch\nwalk(select(IN({}, []) | not)) [] output mismatch\n[[range(10)] | .[1.1,1.5,1.7]] [] output mismatch\n[range(3)] | .[nan] [] output mismatch\ntry ([range(3)] | .[nan] = 9) catch . ['\"cannot convert float NaN to integer\"'] output mismatch\ntry [\"ok\", setpath([1]; 1)] catch [\"ko\", .] ['[\"ok\",{\"hi\":\"hello\",\"1\":1}]'] output mismatch\ntry fromjson catch . ['\"invalid JSON\"'] output mismatch\ntry [\"OK\", setpath([[1]]; 1)] catch [\"KO\", .] ['[\"KO\",\"int() argument must be a string, a bytes-like object or a real number, not \\'list\\'\"]'] output mismatch\nstrflocaltime(\"\" | ., @uri) [] output mismatch\ntry delpaths([[range(10001) | 0]]) catch . ['null'] output mismatch\ntry (reduce range(10001) as $_ ([]; [.]) as $x | $x | contains($x)) catch . [] exited 1: Traceback (most recent call last):\n","exit_code":0,"status":"completed"}}
{"type":"item.completed","item":{"id":"item_31","type":"command_execution","command":"/bin/bash -lc 'pytest -q && timeout 25s env JQ=\"$PWD/jq\" python3 sources/run_conformance.py --select '\"'%%FAIL|if |try |reduce |foreach |def | as |label |module|include' --json > /tmp/p4.json; echo gate:\"'$?; [ -s /tmp/p4.json ] && python3 - <<'\"'PY'\nimport json\nx=json.load(open('/tmp/p4.json')); print(x['summary']);\nfor c in x['cases']:\n if c['status']\"'!='\"'pass': print(c['program'],c.get('actual'),c['detail'])\nPY\"","aggregated_output":"................................                                         [100%]\n32 passed in 2.44s\ngate:124\n","exit_code":1,"status":"failed"}}
{"type":"item.completed","item":{"id":"item_32","type":"agent_message","text":"The local suite is green (32 tests). The scoped control/declaration run now gets past unit validation but still hits the harness timeout on the broad selector; I’m narrowing the remaining failures to distinguish a genuine semantic mismatch from the known deep stress cases before the final gate rerun."}}
{"type":"item.started","item":{"id":"item_33","type":"command_execution","command":"/bin/bash -lc 'env JQ=\"$PWD/jq\" python3 sources/run_conformance.py --select '\"'%%FAIL|if |try |reduce |foreach |def | as |label |module|include' --json > /tmp/p4.json; echo status:\"'$?'","aggregated_output":"","exit_code":null,"status":"in_progress"}}
{"type":"item.completed","item":{"id":"item_33","type":"command_execution","command":"/bin/bash -lc 'env JQ=\"$PWD/jq\" python3 sources/run_conformance.py --select '\"'%%FAIL|if |try |reduce |foreach |def | as |label |module|include' --json > /tmp/p4.json; echo status:\"'$?'","aggregated_output":"status:1\r\n","exit_code":0,"status":"completed"}}
{"type":"item.started","item":{"id":"item_34","type":"command_execution","command":"/bin/bash -lc \"python3 - <<'PY'\nimport json\nx=json.load(open('/tmp/p4.json'));print(x['summary'])\nfor c in x['cases']:\n if c['status']\"'!='\"'pass': print(c['program'],c.get('actual'),c['detail'])\nPY\"","aggregated_output":"","exit_code":null,"status":"in_progress"}}
{"type":"item.completed","item":{"id":"item_34","type":"command_execution","command":"/bin/bash -lc \"python3 - <<'PY'\nimport json\nx=json.load(open('/tmp/p4.json'));print(x['summary'])\nfor c in x['cases']:\n if c['status']\"'!='\"'pass': print(c['program'],c.get('actual'),c['detail'])\nPY\"","aggregated_output":"{'pass': 173, 'fail': 38, 'error': 0, 'skip': 13}\n[foreach .[] / .[] as $i (0; . + $i)] ['[1.0,1.5,3.5,4.5]'] output mismatch\ndef id(x):x; 2000 as $x | def f(x):1 as $x | id([$x, x, x]); def g(x): 100 as $x | f($x,$x+x); g($x) ['[1,1,1]'] output mismatch\ndef fac: if . == 1 then 1 else . * (. - 1 | fac) end; [.[] | fac] [] output mismatch\ntry path(.a | map(select(.b == 0))) catch . ['\"Invalid path expression\"'] output mismatch\ntry path(.a | map(select(.b == 0)) | .[0]) catch . ['\"Invalid path expression\"'] output mismatch\ntry path(.a | map(select(.b == 0)) | .c) catch . ['\"Invalid path expression\"'] output mismatch\ntry path(.a | map(select(.b == 0)) | .[]) catch . ['\"Invalid path expression\"'] output mismatch\n.[] | try (getpath([\"a\",0,\"b\"]) |= 5) catch . [] output mismatch\ntry ((map(select(.a == 1))[].b) = 10) catch . [] output mismatch\ntry ((map(select(.a == 1))[].a) |= .+1) catch . [] output mismatch\ntry (def x: reverse; x=10) catch . [] output mismatch\ntry _strindices(\"abc\") catch . ['\"number (123) is not a string\"'] output mismatch\ntry _strindices(123) catch . ['\"number (123) cannot be searched, as it is not a string\"'] output mismatch\ntry trim catch ., try ltrim catch ., try rtrim catch . ['\"trim input must be a string\"', '\"ltrim input must be a string\"', '\"rtrim input must be a string\"'] output mismatch\ntry [\"OK\", bsearch(0)] catch [\"KO\",.] ['[\"KO\",\"string (aa) cannot be searched from\"]'] output mismatch\nimport \"a\" as foo; import \"b\" as bar; def fooa: foo::a; [fooa, bar::a, bar::b, foo::a] [] declared in exclusions.txt\nimport \"c\" as foo; [foo::a, foo::c] [] declared in exclusions.txt\ninclude \"c\"; [a, c] [] declared in exclusions.txt\nimport \"data\" as $e; import \"data\" as $d; [$d[].this,$e[].that,$d::d[].this,$e::e[].that]|join(\";\") [] declared in exclusions.txt\nimport \"data\" as $a; import \"data\" as $b; def f: {$a, $b}; f [] declared in exclusions.txt\ninclude \"shadow1\"; e [] declared in exclusions.txt\ninclude \"shadow1\"; include \"shadow2\"; e [] declared in exclusions.txt\nimport \"shadow1\" as f; import \"shadow2\" as f; import \"shadow1\" as e; [e::e, f::e] [] declared in exclusions.txt\nmodulemeta [] declared in exclusions.txt\nmodulemeta | .deps | length [] declared in exclusions.txt\nmodulemeta | .defs | length [] declared in exclusions.txt\nimport \"syntaxerror\" as e; . [] declared in exclusions.txt\nimport \"test_bind_order\" as check; check::check [] declared in exclusions.txt\ntry -. catch . ['\"string (\\\\\"very-long-long-long-long-string\\\\\") cannot be negated\"'] output mismatch\ntry (.-.) catch . ['\"string (\\\\\"very-long-long-long-long-string\\\\\") and string (\\\\\"very-long-long-long-long-string\\\\\") cannot be subtracted\"'] output mismatch\n\"x\" * range(0; 12; 2) + \"☆\" * 8 | try -. catch . ['\"string (\\\\\"☆☆☆☆☆☆☆☆\\\\\") cannot be negated\"', '\"string (\\\\\"xx☆☆☆☆☆☆☆☆\\\\\") cannot be negated\"', '\"string (\\\\\"xxxx☆☆☆☆☆☆☆☆\\\\\") cannot be negated\"', '\"string (\\\\\"xxxxxx☆☆☆☆☆☆☆☆\\\\\") cannot be negated\"', '\"string (\\\\\"xxxxxxxx☆☆☆☆☆☆☆☆\\\\\") cannot be negated\"', '\"string (\\\\\"xxxxxxxxxx☆☆☆☆☆☆☆☆\\\\\") cannot be negated\"'] output mismatch\ntry (. + \"x\") catch . == if have_decnum then \"number (12345678901234567890123456...) and string (\\\"x\\\") cannot be added\" else \"number (12345678901234568000000000...) and string (\\\"x\\\") cannot be added\" end ['false'] output mismatch\ntry join(\",\") catch . ['\"1,2,{\\\\\"a\\\\\":{\\\\\"b\\\\\":{\\\\\"c\\\\\":33}}}\"'] output mismatch\ntry join(\",\") catch . ['\"1,2,[3,4,5]\"'] output mismatch\n.[0] | tostring | . == if have_decnum then \"13911860366432393\" else \"13911860366432392\" end ['false'] output mismatch\n.x | tojson | . == if have_decnum then \"13911860366432393\" else \"13911860366432392\" end ['false'] output mismatch\n(13911860366432393 == 13911860366432392) | . == if have_decnum then false else true end ['false'] output mismatch\n-. | tojson == if have_decnum then \"-13911860366432393\" else \"-13911860366432392\" end ['false'] output mismatch\n[1E+1000,-1E+1000 | tojson] == if have_decnum then [\"1E+1000\",\"-1E+1000\"] else [\"1.7976931348623157e+308\",\"-1.7976931348623157e+308\"] end ['false'] output mismatch\n.[] as $n | $n+0 | [., tostring, . == $n] ['[-9007199254740992.0,\"-9007199254740992.0\",false]', '[-9007199254740992,\"-9007199254740992\",true]', '[9007199254740992,\"9007199254740992\",true]', '[9007199254740992.0,\"9007199254740992.0\",false]', '[1.3911860366432392e+16,\"1.3911860366432392e+16\",false]'] output mismatch\n[1E+1000,-1E+1000 | abs | tojson] | unique == if have_decnum then [\"1E+1000\"] else [\"1.7976931348623157e+308\"] end ['false'] output mismatch\n[1E+1000,-1E+1000 | length | tojson] | unique == if have_decnum then [\"1E+1000\"] else [\"1.7976931348623157e+308\"] end [] output mismatch\n.[] | try (fromjson | isnan) catch . ['true', '\"invalid JSON\"', '\"invalid JSON\"', '\"invalid JSON\"', '\"invalid JSON\"', '\"invalid JSON\"', '\"invalid JSON\"', '\"invalid JSON\"'] output mismatch\n.[] |= try tonumber ['[1,3,4,5,6.7,-876,21]'] output mismatch\nmap(try implode catch .) [] output mismatch\ntry ([range(3)] | .[nan] = 9) catch . ['\"cannot convert float NaN to integer\"'] output mismatch\ntry [\"ok\", setpath([1]; 1)] catch [\"ko\", .] ['[\"ok\",{\"hi\":\"hello\",\"1\":1}]'] output mismatch\ntry fromjson catch . ['\"invalid JSON\"'] output mismatch\ntry [\"OK\", setpath([[1]]; 1)] catch [\"KO\", .] ['[\"KO\",\"int() argument must be a string, a bytes-like object or a real number, not \\'list\\'\"]'] output mismatch\ntry delpaths([[range(10001) | 0]]) catch . ['null'] output mismatch\ntry (reduce range(10001) as $_ ([]; [.]) as $x | $x | contains($x)) catch . [] exited 1: Traceback (most recent call last):\n","exit_code":0,"status":"completed"}}
{"type":"item.started","item":{"id":"item_35","type":"command_execution","command":"/bin/bash -lc \"rg -n 'def _short|def _stringify|if name == .trim|if name == .join|isnan|implode' jq_interpreter/evaluator.py\"","aggregated_output":"","exit_code":null,"status":"in_progress"}}
{"type":"item.completed","item":{"id":"item_35","type":"command_execution","command":"/bin/bash -lc \"rg -n 'def _short|def _stringify|if name == .trim|if name == .join|isnan|implode' jq_interpreter/evaluator.py\"","aggregated_output":"129:                first = 0 if start is None or (isinstance(start, float) and _math.isnan(start)) else _math.floor(start)\n130:                last = None if end is None or (isinstance(end, float) and _math.isnan(end)) else _math.ceil(end)\n449:        if isinstance(first, float) and math.isnan(first) and math.isnan(second):\n547:            first = 0 if start is None or (isinstance(start, float) and math.isnan(start)) else math.floor(start)\n548:            last = len(current) if end is None or (isinstance(end, float) and math.isnan(end)) else math.ceil(end)\n591:        first = 0 if start is None or (isinstance(start, float) and math.isnan(start)) else math.floor(start)\n592:        last = len(current) if end is None or (isinstance(end, float) and math.isnan(end)) else math.ceil(end)\n922:                        first = 0 if start is None or (isinstance(start, float) and math.isnan(start)) else math.floor(start)\n923:                        last = len(current) if end is None or (isinstance(end, float) and math.isnan(end)) else math.ceil(end)\n949:    if name == 'isnan': yield isinstance(value, float) and math.isnan(value); return\n951:    if name == 'implode':\n952:        if not isinstance(value, list): raise RuntimeError('implode input must be an array')\n976:    if name == 'join':\n1003:        yield value.strip() if name == 'trim' else value.lstrip() if name == 'ltrim' else value.rstrip(); return\n1055:def _short(value: object) -> str:\n1071:def _stringify(value: object) -> str:\n","exit_code":0,"status":"completed"}}
{"type":"item.started","item":{"id":"item_36","type":"command_execution","command":"/bin/bash -lc \"sed -n '940,1010p' jq_interpreter/evaluator.py; sed -n '1048,1090p' jq_interpreter/evaluator.py\"","aggregated_output":"","exit_code":null,"status":"in_progress"}}
{"type":"item.completed","item":{"id":"item_36","type":"command_execution","command":"/bin/bash -lc \"sed -n '940,1010p' jq_interpreter/evaluator.py; sed -n '1048,1090p' jq_interpreter/evaluator.py\"","aggregated_output":"        except StopIteration: return\n        return\n    if name == 'last':\n        vals=list(_node(args[0], value, env));\n        if vals: yield vals[-1]\n        return\n    if name == 'select':\n        if _truth(_one(args[0], value, env)): yield value\n        return\n    if name == 'isnan': yield isinstance(value, float) and math.isnan(value); return\n    if name == 'pow': yield math.pow(_one(args[0],value,env), _one(args[1],value,env)); return\n    if name == 'implode':\n        if not isinstance(value, list): raise RuntimeError('implode input must be an array')\n        yield ''.join(chr(int(x)) for x in value); return\n    if name == 'explode':\n        if not isinstance(value, str): raise RuntimeError('explode input must be a string')\n        yield [ord(x) for x in value]; return\n    if name == 'limit':\n        counts=list(_node(args[0], value, env))\n        for count_value in counts:\n            count=int(count_value)\n            if count < 0: raise RuntimeError(\"limit doesn't support negative count\")\n            if count == 0: continue\n            for item in _node(args[1], value, env):\n                yield item; count -= 1\n                if count == 0: break\n        return\n    if name == 'skip':\n        counts=list(_node(args[0], value, env))\n        for count_value in counts:\n            count=int(count_value)\n            if count < 0: raise RuntimeError(\"skip doesn't support negative count\")\n            for item in _node(args[1], value, env):\n                if count: count -= 1\n                else: yield item\n        return\n    if name == 'join':\n        for separator in _node(args[0], value, env):\n            if not isinstance(value, list): raise RuntimeError('cannot join value')\n            yield str(separator).join('' if item is None else _stringify(item) for item in value)\n        return\n    if name in ('sin','cos','tan','asin','acos','atan','sqrt','log','log10','exp','exp2','log2'):\n        yield getattr(math, name)(value); return\n    if name in ('round','ceil','floor','fabs'):\n        if name == 'round': yield math.floor(value + 0.5)\n        else: yield getattr(math, name)(value)\n        return\n    if name == 'split':\n        separator = _one(args[0], value, env); yield value.split(separator); return\n    if name in ('ltrimstr','rtrimstr','trimstr'):\n        needle = _one(args[0], value, env)\n        if not isinstance(value, str) or not isinstance(needle, str):\n            raise RuntimeError(('startswith()' if name == 'ltrimstr' else 'endswith()') + ' requires string inputs')\n        if name == 'ltrimstr': yield value[len(needle):] if value.startswith(needle) else value\n        elif name == 'rtrimstr': yield value[:-len(needle)] if needle and value.endswith(needle) else value\n        else:\n            result = value\n            if needle and result.startswith(needle): result = result[len(needle):]\n            if needle and result.endswith(needle): result = result[:-len(needle)]\n            yield result\n        return\n    if name in ('trim','ltrim','rtrim'):\n        if not isinstance(value, str): raise RuntimeError(f'{name} input must be a string')\n        yield value.strip() if name == 'trim' else value.lstrip() if name == 'ltrim' else value.rstrip(); return\n    if name == 'startswith':\n        yield value.startswith(_one(args[0], value, env)); return\n    if name == 'endswith':\n        yield value.endswith(_one(args[0], value, env)); return\n    if name in ('sort', 'unique'):\n        if not isinstance(value, list):\n            raise RuntimeError('cannot sort value')\n            elif inner[end]==')': depth-=1\n            end+=1\n        expression = inner[mark + 2:end - 1]\n        out += _stringify(_one(parse(expression), value, env))\n        pos=end\n    return out\n\ndef _short(value: object) -> str:\n    if isinstance(value, str):\n        return json.dumps(value, ensure_ascii=False)\n    if isinstance(value, float) and value.is_integer():\n        return str(int(value))\n    return _stringify(value)\n\ndef _type_name(value: object) -> str:\n    if value is None: return 'null'\n    if isinstance(value, bool): return 'boolean'\n    if isinstance(value, (int, float)): return 'number'\n    if isinstance(value, str): return 'string'\n    if isinstance(value, list): return 'array'\n    if isinstance(value, dict): return 'object'\n    return type(value).__name__\n\ndef _stringify(value: object) -> str:\n    import json\n    return value if isinstance(value, str) else json.dumps(value, separators=(\",\", \":\"), ensure_ascii=False, allow_nan=False)\n\ndef _apply_format(name: str, value: object, template: bool = False) -> str:\n    import base64, html, json, urllib.parse\n    if name == \"text\": return _stringify(value)\n    if name == \"json\": return json.dumps(value, separators=(\",\", \":\"), ensure_ascii=False)\n    if name == \"html\": return html.escape(_stringify(value), quote=True).replace(\"&#x27;\", \"&apos;\")\n    if name == \"uri\": return urllib.parse.quote(_stringify(value), safe=\"-_.~\")\n    if name == \"urid\": return urllib.parse.unquote(_stringify(value))\n    if name == \"base64\": return base64.b64encode(_stringify(value).encode()).decode()\n    if name == \"base64d\": return base64.b64decode(_stringify(value)).decode()\n    if name == \"csv\": return \",\".join('\"' + str(x).replace('\"', '\"\"') + '\"' if isinstance(x, str) else _stringify(x) for x in value)\n    if name == \"tsv\": return \"\\t\".join(_stringify(x).replace(\"\\\\\", \"\\\\\\\\\").replace(\"\\n\", \"\\\\n\").replace(\"\\r\", \"\\\\r\").replace(\"\\t\", \"\\\\t\") for x in value)\n    if name == \"sh\": return \"'\" + _stringify(value).replace(\"'\", \"'\\\\''\") + \"'\"\n    raise RuntimeError(f\"unknown format @{name}\")\n","exit_code":0,"status":"completed"}}
{"type":"item.completed","item":{"id":"item_37","type":"agent_message","text":"The declaration gate now completes with 173 passing cases and 38 semantic failures (plus the expected excluded module cases); the failures are concentrated in advanced path tracking, lexical parameter semantics, and jq’s exact numeric/error behavior. I’m doing a final syntax/test verification and recording the remaining gate result without weakening the acceptance checks."}}
{"type":"item.started","item":{"id":"item_38","type":"command_execution","command":"/bin/bash -lc \"python3 -m py_compile jq_interpreter/*.py && pytest -q && git diff --stat -- jq_interpreter/evaluator.py && printf '%s\\\\n' '[0,1,2,3,4,5]' | ./jq -c '.foo[1,4,2,3] |= empty' 2>/dev/null || true\"","aggregated_output":"","exit_code":null,"status":"in_progress"}}
{"type":"item.completed","item":{"id":"item_38","type":"command_execution","command":"/bin/bash -lc \"python3 -m py_compile jq_interpreter/*.py && pytest -q && git diff --stat -- jq_interpreter/evaluator.py && printf '%s\\\\n' '[0,1,2,3,4,5]' | ./jq -c '.foo[1,4,2,3] |= empty' 2>/dev/null || true\"","aggregated_output":"................................                                         [100%]\n32 passed in 2.38s\n .../build/jq/jq_interpreter/evaluator.py           | 312 ++++++++++++++++++---\n 1 file changed, 266 insertions(+), 46 deletions(-)\n","exit_code":0,"status":"completed"}}
{"type":"item.started","item":{"id":"item_39","type":"command_execution","command":"/bin/bash -lc 'env JQ=\"$PWD/jq\" python3 sources/run_conformance.py --select '\"'\\\\.|\\\\[|\\\\{|\\\\+|\\\\-|\\\\*|/|%' --json > /tmp/p3.json; echo status:\"'$?'","aggregated_output":"","exit_code":null,"status":"in_progress"}}
{"type":"item.completed","item":{"id":"item_39","type":"command_execution","command":"/bin/bash -lc 'env JQ=\"$PWD/jq\" python3 sources/run_conformance.py --select '\"'\\\\.|\\\\[|\\\\{|\\\\+|\\\\-|\\\\*|/|%' --json > /tmp/p3.json; echo status:\"'$?'","aggregated_output":"status:1\r\n","exit_code":0,"status":"completed"}}
{"type":"item.started","item":{"id":"item_40","type":"command_execution","command":"/bin/bash -lc \"python3 - <<'PY'\nimport json\nx=json.load(open('/tmp/p3.json'));print(x['summary']); print(sum(1 for c in x['cases'] if c['status']\"'!='\"'pass'))\nPY\"","aggregated_output":"","exit_code":null,"status":"in_progress"}}
{"type":"item.completed","item":{"id":"item_40","type":"command_execution","command":"/bin/bash -lc \"python3 - <<'PY'\nimport json\nx=json.load(open('/tmp/p3.json'));print(x['summary']); print(sum(1 for c in x['cases'] if c['status']\"'!='\"'pass'))\nPY\"","aggregated_output":"{'pass': 373, 'fail': 82, 'error': 0, 'skip': 9}\n91\n","exit_code":0,"status":"completed"}}
{"type":"item.completed","item":{"id":"item_41","type":"agent_message","text":"RESULT: FAILED\n\nFILES CHANGED:\n- [jq_interpreter/evaluator.py](/mnt/c/Users/barlo/projects/drydock/uat/jq/runs/20260822.044627/build/jq/jq_interpreter/evaluator.py)\n\nSUMMARY:\nImplemented evaluator fixes for computed paths, lexical function definitions, assignments, deep merges, and large-number arithmetic. Local tests pass: 32 passed. Scoped gates remain failing: PARSE-003 reported 373 passed, 82 failed; PARSE-004 reported 173 passed, 38 failed, with 13 excluded cases.\n\nBLOCKERS:\n- Advanced path tracking, function parameter semantics, and jq-compatible numeric/error behavior remain incomplete.\n\nFAILURE_SUMMARY: Scoped conformance gates still have semantic failures.\nFAILURE_DETAIL: The interpreter passes local tests but does not yet satisfy all PARSE-003 and PARSE-004 corpus cases; further evaluator work is required."}}
{"type":"turn.completed","usage":{"input_tokens":3324985,"cached_input_tokens":3214848,"cache_write_input_tokens":0,"output_tokens":11525,"reasoning_output_tokens":3635}}
