{"type":"thread.started","thread_id":"01a02cfc-0a60-7cc1-b78c-3e27af3e4141"}
{"type":"turn.started"}
{"type":"item.completed","item":{"id":"item_0","type":"agent_message","text":"I’ll inspect the existing interpreter and focus the change on the TEXT-002 conversion/format filters, preserving the staged sources. Then I’ll run both declared scoped acceptance checks and targeted executable tests."}}
{"type":"item.started","item":{"id":"item_1","type":"command_execution","command":"/bin/bash -lc \"pwd && rg --files -g '\"'!sources/**'\"' -g '\"'!*.pyc'\"' | sort && printf '\\\\n--- source files ---\\\\n' && rg --files sources | sort\"","aggregated_output":"","exit_code":null,"status":"in_progress"}}
{"type":"item.completed","item":{"id":"item_1","type":"command_execution","command":"/bin/bash -lc \"pwd && rg --files -g '\"'!sources/**'\"' -g '\"'!*.pyc'\"' | sort && printf '\\\\n--- source files ---\\\\n' && rg --files sources | sort\"","aggregated_output":"/mnt/c/Users/barlo/projects/drydock/uat/jq/runs/20260822.044627/build/jq\njq\njq_interpreter/__init__.py\njq_interpreter/architecture.py\njq_interpreter/ast.py\njq_interpreter/builtins.py\njq_interpreter/cli.py\njq_interpreter/diagnostics.py\njq_interpreter/errors.py\njq_interpreter/evaluator.py\njq_interpreter/interpreter.py\njq_interpreter/lexer.py\njq_interpreter/parser.py\njq_interpreter/paths.py\njq_interpreter/runtime.py\ntests/conftest.py\ntests/test_architecture.py\ntests/test_conf_001_acceptance.py\ntests/test_conformance_assets.py\ntests/test_core_002_composition.py\ntests/test_core_003_errors.py\ntests/test_core_004_truthiness_comparison.py\ntests/test_data_002_sorting.py\ntests/test_data_003_entries_containment.py\ntests/test_flow_001_operators.py\ntests/test_flow_002_boolean_alternative.py\ntests/test_flow_003_conditionals_exceptions.py\ntests/test_flow_004_labels_breaks.py\ntests/test_flow_005_reductions_iteration.py\ntests/test_flow_006_recursive_generators.py\ntests/test_func_002_parameters.py\ntests/test_json_io.py\ntests/test_lexer.py\ntests/test_parse_002.py\ntests/test_path_001_discovery_projection.py\ntests/test_path_002_access_mutation.py\ntests/test_service_lexical_bindings.py\ntests/test_stream_evaluator.py\ntests/test_text_001_string_builtins.py\ntests/test_value_001.py\ntests/test_value_002_access.py\ntests/test_value_003_slices_iteration.py\ntests/test_value_004.py\n\n--- source files ---\nsources/builtin.jq\nsources/exclusions.txt\nsources/full_test.sh\nsources/jq-manual.txt\nsources/jq.test\nsources/lexer.l\nsources/parser.y\nsources/run_conformance.py\n","exit_code":0,"status":"completed"}}
{"type":"item.started","item":{"id":"item_2","type":"command_execution","command":"/bin/bash -lc \"sed -n '1,260p' jq_interpreter/builtins.py && sed -n '1,220p' jq_interpreter/runtime.py\"","aggregated_output":"","exit_code":null,"status":"in_progress"}}
{"type":"item.completed","item":{"id":"item_2","type":"command_execution","command":"/bin/bash -lc \"sed -n '1,260p' jq_interpreter/builtins.py && sed -n '1,220p' jq_interpreter/runtime.py\"","aggregated_output":"\"\"\"Builtin filter ownership boundary.\n\nLanguage-specific builtin definitions will be added here; the evaluator depends on\nthis module rather than embedding standard-library filters in process code.\n\"\"\"\n\n\"\"\"Runtime value and stream contracts.\"\"\"\n\nfrom collections.abc import Iterator\nfrom dataclasses import dataclass, field\nfrom typing import TypeAlias\n\nJsonValue: TypeAlias = None | bool | int | float | str | list[\"JsonValue\"] | dict[str, \"JsonValue\"]\nValueStream: TypeAlias = Iterator[JsonValue]\n\n\nclass InputNumber(float):\n    \"\"\"A JSON number retaining its source spelling until it is transformed.\"\"\"\n\n    def __new__(cls, value: str) -> \"InputNumber\":\n        instance = super().__new__(cls, float(value))\n        instance.source = value\n        return instance\n\n    source: str\n\n\n@dataclass\nclass EvaluationContext:\n    \"\"\"Per-input state for lexical bindings and runtime options.\"\"\"\n\n    bindings: dict[str, JsonValue] = field(default_factory=dict)\n\n\ndef identity_stream(value: JsonValue) -> ValueStream:\n    \"\"\"Yield one value, retaining the stream contract used by the evaluator.\"\"\"\n    yield value\n","exit_code":0,"status":"completed"}}
{"type":"item.started","item":{"id":"item_3","type":"command_execution","command":"/bin/bash -lc \"sed -n '1,260p' jq_interpreter/lexer.py && sed -n '1,260p' jq_interpreter/parser.py\"","aggregated_output":"","exit_code":null,"status":"in_progress"}}
{"type":"item.completed","item":{"id":"item_3","type":"command_execution","command":"/bin/bash -lc \"sed -n '1,260p' jq_interpreter/lexer.py && sed -n '1,260p' jq_interpreter/parser.py\"","aggregated_output":"\"\"\"Lexical scanner for jq source text.\"\"\"\n\nfrom dataclasses import dataclass\nfrom enum import Enum, auto\nimport re\n\nfrom .errors import CompileError\n\n\nclass TokenKind(Enum):\n    IDENTIFIER = auto()\n    NUMBER = auto()\n    STRING = auto()\n    FIELD = auto()\n    BINDING = auto()\n    FORMAT = auto()\n    KEYWORD = auto()\n    OPERATOR = auto()\n    DELIMITER = auto()\n    INTERPOLATION_START = auto()\n    INTERPOLATION_END = auto()\n    END = auto()\n    IDENTITY = auto()\n\n\n@dataclass(frozen=True)\nclass Token:\n    kind: TokenKind\n    text: str\n    position: int\n\n\n_KEYWORDS = {\"as\", \"def\", \"module\", \"import\", \"include\", \"if\", \"then\", \"else\", \"elif\", \"and\", \"or\", \"end\", \"reduce\", \"foreach\", \"try\", \"catch\", \"label\", \"break\"}\n_OPERATORS = (\"//=\", \"?//\", \"!=\", \"==\", \"|=\", \"+=\", \"-=\", \"*=\", \"/=\", \"%=\", \"<=\", \">=\", \"..\", \"//\")\n_DELIMITERS = set(\".?!=;,,:|+-*/%$<>{}[]()\")\n_NUMBER = re.compile(r\"(?:[0-9]+(?:\\.[0-9]*)?|\\.[0-9]+)(?:[eE][+-]?[0-9]+)?\")\n_NAME = re.compile(r\"[A-Za-z_][A-Za-z_0-9]*\")\n_QUALIFIED_NAME = re.compile(r\"(?:[A-Za-z_][A-Za-z_0-9]*::)*[A-Za-z_][A-Za-z_0-9]*\")\n\n\ndef _error(source: str, position: int, message: str) -> CompileError:\n    line = source.count(\"\\n\", 0, position) + 1\n    line_start = source.rfind(\"\\n\", 0, position) + 1\n    return CompileError(f\"{message} at line {line}, column {position - line_start + 1}\")\n\n\ndef _scan_string(source: str, start: int) -> tuple[list[Token], int]:\n    tokens = [Token(TokenKind.STRING, '\"', start)]\n    position = start + 1\n    text_start = position\n    while position < len(source):\n        character = source[position]\n        if character == \"\\\\\":\n            if position + 1 >= len(source):\n                raise _error(source, position, \"unterminated string\")\n            if source[position + 1] == \"(\":\n                if text_start < position:\n                    tokens.append(Token(TokenKind.STRING, source[text_start:position], text_start))\n                tokens.append(Token(TokenKind.INTERPOLATION_START, \"\\\\(\", position))\n                expression_start = position + 2\n                cursor = expression_start\n                depth = 1\n                quoted_expression = False\n                escaped_expression = False\n                while cursor < len(source):\n                    current = source[cursor]\n                    if quoted_expression:\n                        if escaped_expression:\n                            escaped_expression = False\n                        elif current == \"\\\\\":\n                            escaped_expression = True\n                        elif current == '\"':\n                            quoted_expression = False\n                    elif current == '\"':\n                        quoted_expression = True\n                    elif current == \"(\":\n                        depth += 1\n                    elif current == \")\":\n                        depth -= 1\n                        if depth == 0:\n                            inner = tokenize(source[expression_start:cursor])\n                            tokens.extend(inner[:-1])\n                            tokens.append(Token(TokenKind.INTERPOLATION_END, \")\", cursor))\n                            position = cursor + 1\n                            text_start = position\n                            break\n                    cursor += 1\n                else:\n                    raise _error(source, position, \"unterminated interpolation\")\n                continue\n            if source[position + 1] == \"u\":\n                escape = source[position + 2:position + 6]\n                if len(escape) != 4 or not re.fullmatch(r\"[0-9A-Fa-f]{4}\", escape):\n                    raise _error(source, position, \"invalid unicode escape\")\n                position += 6\n            else:\n                if source[position + 1] not in '\"\\\\/bfnrt':\n                    raise _error(source, position, \"invalid escape\")\n                position += 2\n            continue\n        if character == '\"':\n            if text_start < position:\n                tokens.append(Token(TokenKind.STRING, source[text_start:position], text_start))\n            tokens.append(Token(TokenKind.STRING, '\"', position))\n            return tokens, position + 1\n        if ord(character) < 0x20:\n            raise _error(source, position, \"control character in string\")\n        position += 1\n    raise _error(source, start, \"unterminated string\")\n\n\ndef tokenize(source: str) -> list[Token]:\n    \"\"\"Tokenize jq source, retaining offsets and rejecting lexical errors.\"\"\"\n    tokens: list[Token] = []\n    position = 0\n    while position < len(source):\n        character = source[position]\n        if character.isspace():\n            position += 1\n            continue\n        if character == \"#\":\n            newline = source.find(\"\\n\", position)\n            position = len(source) if newline < 0 else newline + 1\n            continue\n        if character == '\"':\n            string_tokens, position = _scan_string(source, position)\n            tokens.extend(string_tokens)\n            continue\n        number = _NUMBER.match(source, position)\n        if number:\n            tokens.append(Token(TokenKind.NUMBER, number.group(), position))\n            position = number.end()\n            continue\n        if character == \".\" and position + 1 < len(source) and source[position + 1].isalpha():\n            name = _NAME.match(source, position + 1)\n            assert name is not None\n            tokens.append(Token(TokenKind.FIELD, source[position:name.end()], position))\n            position = name.end()\n            continue\n        if character == \"$\":\n            name = _QUALIFIED_NAME.match(source, position + 1)\n            if not name:\n                raise _error(source, position, \"invalid binding\")\n            tokens.append(Token(TokenKind.BINDING, source[position:name.end()], position))\n            position = name.end()\n            continue\n        if character == \"@\":\n            name = _NAME.match(source, position + 1)\n            if not name:\n                raise _error(source, position, \"invalid format\")\n            tokens.append(Token(TokenKind.FORMAT, source[position:name.end()], position))\n            position = name.end()\n            continue\n        qualified = _QUALIFIED_NAME.match(source, position)\n        if qualified:\n            text = qualified.group()\n            kind = TokenKind.KEYWORD if text in _KEYWORDS else TokenKind.IDENTIFIER\n            tokens.append(Token(kind, text, position))\n            position = qualified.end()\n            continue\n        operator = next((value for value in _OPERATORS if source.startswith(value, position)), None)\n        if operator:\n            tokens.append(Token(TokenKind.OPERATOR, operator, position))\n            position += len(operator)\n            continue\n        if character in _DELIMITERS:\n            kind = TokenKind.IDENTITY if character == \".\" else TokenKind.DELIMITER\n            tokens.append(Token(kind, character, position))\n            position += 1\n            continue\n        raise _error(source, position, \"unexpected character\")\n    tokens.append(Token(TokenKind.END, \"\", len(source)))\n    return tokens\n\"\"\"Precedence-aware jq expression parser.\"\"\"\nimport json\nimport re\nfrom dataclasses import dataclass\nfrom .ast import Filter, Node, StringTemplate, Format\nfrom .errors import CompileError\nfrom .lexer import tokenize\n\n@dataclass(frozen=True)\nclass T: text: str\nOPS=(\"//=\",\"?//\",\"!=\",\"==\",\"|=\",\"+=\",\"-=\",\"*=\",\"/=\",\"%=\",\"<=\",\">=\",\"..\",\"//\")\n# jq's query grammar gives the pipe lower precedence than comma.  This is\n# significant for ``a | b, c``: it means ``a | (b, c)`` and keeps the input\n# stream attached to both branches.  The parser's numeric levels increase\n# with binding strength.\nPREC={\"|\":1,\",\":2,\"=\":3,\"|=\":3,\"+=\":3,\"-=\":3,\"*=\":3,\"/=\":3,\"%=\":3,\"//=\":3,\"//\":4,\"or\":5,\"and\":6,\"==\":7,\"!=\":7,\"<\":7,\">\":7,\"<=\":7,\">=\":7,\"+\":8,\"-\":8,\"*\":9,\"/\":9,\"%\":9}\n\ndef lex(s: str) -> list[T]:\n    s=re.sub(r\"#[^\\n]*\",\"\",s); out=[]; i=0\n    while i<len(s):\n        if s[i].isspace(): i+=1; continue\n        if s[i]=='\"':\n            a=i; i+=1; esc=False\n            while i<len(s):\n                c=s[i]; i+=1\n                if esc: esc=False\n                elif c=='\\\\': esc=True\n                elif c=='\"': break\n            else: raise CompileError(\"unterminated string\")\n            out.append(T(s[a:i])); continue\n        op=next((x for x in OPS if s.startswith(x,i)),None)\n        if op: out.append(T(op)); i+=len(op); continue\n        m=re.match(r\"(?:[0-9]+(?:\\.[0-9]*)?|\\.[0-9]+)(?:[eE][+-]?[0-9]+)?\",s[i:])\n        if m: out.append(T(m.group())); i+=len(m.group()); continue\n        m=re.match(r\"(?:[A-Za-z_][A-Za-z_0-9]*::)*[A-Za-z_][A-Za-z_0-9]*\",s[i:])\n        if m: out.append(T(m.group())); i+=len(m.group()); continue\n        if s[i]=='$':\n            m=re.match(r\"\\$[A-Za-z_][A-Za-z_0-9]*(?:::[A-Za-z_][A-Za-z_0-9]*)*\",s[i:])\n            if not m: raise CompileError(\"invalid binding\")\n            out.append(T(m.group())); i+=len(m.group()); continue\n        if s[i]=='.' and i+1<len(s) and re.match(r\"[A-Za-z_]\",s[i+1]):\n            m=re.match(r\"\\.[A-Za-z_][A-Za-z_0-9]*\",s[i:]); out.append(T(m.group())); i+=len(m.group()); continue\n        if s[i]=='@':\n            m=re.match(r\"@[A-Za-z_][A-Za-z_0-9]*\",s[i:])\n            if not m: raise CompileError(\"invalid format\")\n            out.append(T(m.group())); i+=len(m.group()); continue\n        if s[i] in \".?=;,:|+-*/%$<>()[]{}\": out.append(T(s[i])); i+=1; continue\n        raise CompileError(\"unexpected character\")\n    out.append(T(\"<eof>\")); return out\n\nclass Parser:\n    def __init__(self,s:str): self.t=lex(s); self.i=0\n    def p(self): return self.t[self.i].text\n    def take(self,x=None):\n        v=self.p()\n        if x is not None and v!=x: raise CompileError(f\"expected {x}\")\n        self.i+=1; return v\n    def parse(self):\n        if self.p()==\"<eof>\": raise CompileError(\"empty program\")\n        x=self.expr(0)\n        while self.p()==';': self.take()\n        if self.p()!='<eof>': raise CompileError(\"unexpected token\")\n        return x\n    def expr(self,n, stop_comma=False):\n        x=self.prefix()\n        # Binding is a query construct, below all ordinary operators.\n        if self.p()=='as' and n <= 2:\n            self.take('as'); pattern=self.pattern(); self.take('|')\n            return Node('bind',(x,pattern,self.expr(0)))\n        while (self.p() in PREC or self.p() in ('and','or')) and PREC.get(self.p(), 0)>=n:\n            if stop_comma and self.p() == ',': break\n            op=self.take(); q=PREC[op]; x=Node(\"binary\",(op,x,self.expr(q if op in (\"=\",\"|=\",\"+=\",\"-=\",\"*=\",\"/=\",\"%=\",\"//=\") else q+1, stop_comma)))\n        if self.p()=='as' and n <= 2:\n            self.take('as'); pattern=self.pattern(); self.take('|')\n            return Node('bind',(x,pattern,self.expr(0)))\n        return x\n    def prefix(self):\n        t=self.p()\n        if t=='-':\n            # Unary minus binds to the complete postfix term.  In particular\n            # ``-.?`` is try-able arithmetic, not an optional identity.\n            self.take(); return Node('unary',('-',self.prefix()))\n        if t=='if': return self.post(self.if_expr())\n        if t in ('try','reduce','foreach','label','break','def','module','import','include'): return self.post(self.control(t))\n        if t=='(': self.take(); x=self.expr(0); self.take(')'); return self.post(x)\n        if t=='[':\n            self.take()\n            if self.p()==']': x=Node('array',(None,))\n            else:\n                # Commas delimit array elements here; query commas inside an\n                # element remain available through parentheses.\n                parts=[self.expr(1, True)]\n                while self.p()==',': self.take(); parts.append(self.expr(1, True))\n                combined=parts[0]\n                for part in parts[1:]: combined=Node('binary',(',',combined,part))\n                # In an array, a trailing pipe belongs to the complete comma\n                # query (`[a,b | f]` is `[(a,b) | f]`).\n                if (combined.operation == 'binary' and combined.arguments[0] == ','\n                        and combined.arguments[2].operation == 'binary'\n                        and combined.arguments[2].arguments[0] == '|'\n                        and combined.arguments[2].arguments[1].operation in ('unary', 'literal', 'binary')):\n                    tail = combined.arguments[2]\n                    combined = Node('binary', ('|', Node('binary', (',', combined.arguments[1], tail.arguments[1])), tail.arguments[2]))\n                x=Node('array',(combined,))\n            self.take(']'); return self.post(x)\n        if t=='{': return self.object()\n        if t=='.': self.take(); return self.post(Node('identity'))\n        if t=='..': self.take(); return self.post(Node('recurse'))\n        if t.startswith('.'): self.take(); return self.post(Node('field',(t[1:],)))\n        if t.startswith('$'): self.take(); return self.post(Node('var',(t[1:],)))\n        if t.startswith('\"'): self.take(); return self.post(Node('string',(t,)))\n        if t.startswith('@'): self.take(); return self.post(Node('format',(t[1:],)))\n        self.take()\n        if t in ('true','false','null','nan','infinite','-infinite','-nan') or re.fullmatch(r'(?:[0-9]+(?:\\.[0-9]*)?|\\.[0-9]+)(?:[eE][+-]?[0-9]+)?',t): return self.post(Node('literal',(t,)))\n        return self.post(Node('call',(t,())))\n    def post(self,x):\n        while True:\n            if self.p().startswith('\"') and isinstance(x,Node) and x.operation=='format':\n                x=Node('format_template',(x.arguments[0],self.take())); continue\n            if self.p().startswith('\"'):\n                x=Node('indexexpr',(x,Node('string',(self.take(),)))); continue\n            if self.p()=='?': self.take(); x=Node('optional',(x,)); continue\n            if self.p().startswith('.') and len(self.p())>1: x=Node('index',(x,self.take()[1:],False)); continue\n            if self.p()=='.' and self.t[self.i+1].text.startswith('\"'):\n                self.take('.'); x=Node('indexexpr',(x,Node('string',(self.take(),)))); continue\n            if self.p()=='.' and self.t[self.i+1].text=='[':\n                self.take('.'); continue\n            if self.p()=='[':\n                self.take()\n                if self.p()==']': self.take(); x=Node('iterate',(x,)); continue\n                a = Node('literal', ('null',)) if self.p()==':' else self.expr(0)\n                if self.p()==':': self.take(); b=None if self.p()==']' else self.expr(0); self.take(']'); x=Node('slice',(x,a,b))\n                else: self.take(']'); x=Node('indexexpr',(x,a))\n                continue\n            if self.p()=='(' and isinstance(x,Node) and x.operation=='call':\n                name=x.arguments[0]; self.take(); args=[]\n                if self.p()!=')':\n                    args.append(self.expr(1))\n                    # jq's grammar uses semicolons for filter arguments.  The\n                    # corpus also exercises the permissive comma spelling.\n                    while self.p()==';': self.take(); args.append(self.expr(1))\n                self.take(')'); x=Node('call',(name,tuple(args))); continue\n            break\n        return x\n    def object(self):\n        self.take('{'); pairs=[]\n        while self.p()!='}':\n            if self.p()=='(':\n                self.take('('); key=self.expr(0); self.take(')')\n            else:\n                k=self.take()\n                if k.startswith('\"'):\n                    key=Node('string',(k,))\n                elif k.startswith('$'):\n                    key=Node('var',(k[1:],))\n                else:\n                    key=Node('string',(json.dumps(k.lstrip('$').lstrip('.')),))\n            if self.p()==':': self.take(); v=self.expr(1, True)\n            else:\n                # `{name}` and `{$name}` abbreviate an access using the key.\n                if k.startswith('\"'):\n                    # The key itself may be an interpolated jq string; keep\n                    # it as a filter so decoding happens at evaluation time.\n                    raw = None\n                    v = Node('indexexpr',(Node('identity'), key))\n                else:\n                    raw = k.lstrip('$').lstrip('.')\n                if k.startswith('$'):\n                    key = Node('string',(json.dumps(raw),))\n                    v=Node('var',(raw,))\n                elif not k.startswith('\"'):\n                    v=Node('index',(Node('identity'),raw,False))\n            if key.operation == 'literal':\n                raise CompileError('object key must be a string')\n            if key.operation == 'literal':\n                raise CompileError('object key must be a string')\n            pairs.append((key,v))\n            if self.p()!= '}': self.take(',')\n        self.take('}'); return Node('object',(tuple(pairs),))\n\n    def pattern(self):\n        t=self.p()\n        if t.startswith('$'):\n            result=Node('pattern_var',(self.take()[1:],))\n            return self._pattern_alt(result)\n        if t=='[':\n            self.take()\n            if self.p()==']': raise CompileError('empty destructuring pattern')\n            items=[]\n            if self.p()!=']':\n                items.append(self.pattern())\n                while self.p()==',': self.take(); items.append(self.pattern())\n            self.take(']'); return self._pattern_alt(Node('pattern_array',(tuple(items),)))\n        if t=='{':\n            self.take()\n            if self.p()=='}': raise CompileError('empty destructuring pattern')\n            items=[]\n            if self.p()!='}':\n                while True:\n                    if self.p() == '(':\n                        self.take('('); key_node = self.expr(0); self.take(')')\n                        if key_node.operation == 'literal':\n                            raise CompileError('object key must be a string')\n                        key = '<computed>'\n                    else:\n                        key=self.take(); key_node = None\n                        if key.startswith('\"'): key = json.loads(key)\n                    if self.p()==':':\n                        self.take(); pat=self.pattern()\n                        if key.startswith('$'):\n                            pat = Node('pattern_bind',(key[1:],pat))\n                    elif key.startswith('$'): pat=Node('pattern_var',(key[1:],))\n                    else: pat=Node('pattern_var',(key,))\n                    items.append((key_node if key_node is not None else key.lstrip('$'),pat))\n                    if self.p()!='}': self.take(',')\n                    else: break\n            self.take('}'); return self._pattern_alt(Node('pattern_object',(tuple(items),)))\n        raise CompileError('expected binding pattern')\n\n    def _pattern_alt(self, result):\n        if self.p()=='?//':\n            self.take('?//'); return Node('pattern_alt',(result,self.pattern()))\n        return result\n    def if_expr(self):\n        self.take('if'); c=self.expr(0); self.take('then'); a=self.expr(0); b=Node('literal',('null',))\n        if self.p()=='else': self.take(); b=self.expr(0); self.take('end')\n        elif self.p()=='elif':\n            b=self._elif_expr()\n        else: self.take('end'); b=Node('identity')\n        return Node('if',(c,a,b))\n    def _elif_expr(self):\n        self.take('elif'); c=self.expr(0); self.take('then'); a=self.expr(0)\n        if self.p()=='elif': b=self._elif_expr()\n        elif self.p()=='else': self.take(); b=self.expr(0); self.take('end')\n        else: self.take('end'); b=Node('identity')\n        return Node('if',(c,a,b))\n    def control(self,w):\n        self.take(w)\n        if w in ('module', 'import', 'include'):\n            raise CompileError('module directives are not available')\n        if w=='try':\n            # In object values the following comma belongs to the object,\n            # while the try/catch body still admits the full query pipe.\n            # `try` binds more tightly than defined-or and comma.  Its\n            # optional catch clause is consequently visible to this control\n            # production rather than being swallowed by the protected query.\n            a=self.expr(10, True); b=None\n            if self.p()=='catch': self.take(); b=self.expr(10, True)\n            return Node('try',(a,b))\n        if w=='def':\n            name=self.take(); ps=[]\n            if self.p()=='(': self.take();\n            while self.p() not in (')',':'):\n                # Preserve the sigil: ``f(x)`` receives a filter, while\n                # ``f($x)`` receives the values produced by its argument.\n                ps.append(self.take())\n                if self.p()==';': self.take()\n            if ps: self.take(')')\n            self.take(':'); b=self.expr(0); self.take(';')\n            definition=Node('def',(name,tuple(ps),b))\n","exit_code":0,"status":"completed"}}
{"type":"item.started","item":{"id":"item_4","type":"command_execution","command":"/bin/bash -lc 'rg -n \"tostring|tojson|fromjson|format|@|base64|csv|tsv|sh|interpolation|String\" jq_interpreter tests | head -240'","aggregated_output":"","exit_code":null,"status":"in_progress"}}
{"type":"item.completed","item":{"id":"item_4","type":"command_execution","command":"/bin/bash -lc 'rg -n \"tostring|tojson|fromjson|format|@|base64|csv|tsv|sh|interpolation|String\" jq_interpreter tests | head -240'","aggregated_output":"jq_interpreter/builtins.py:1:\"\"\"Builtin filter ownership boundary.\njq_interpreter/evaluator.py:9:from .ast import Add, Array, Comma, Filter, Format, Identity, Iterate, Literal, Limit, Node, Pipe, Raise, StringTemplate\njq_interpreter/evaluator.py:49:    if isinstance(program, StringTemplate):\njq_interpreter/evaluator.py:56:        if program.template is None: yield _apply_format(program.name, value)\njq_interpreter/evaluator.py:62:                    pieces.extend(_apply_format(program.name, item) for item in evaluate(part, value))\njq_interpreter/evaluator.py:99:    elif op == \"format\": yield _apply_format(a[0], value)\njq_interpreter/evaluator.py:100:    elif op == \"format_template\":\njq_interpreter/evaluator.py:101:        # Interpolation is evaluated first; the formatter consumes the\njq_interpreter/evaluator.py:103:        yield _apply_format(a[0], _decode_string(a[1], value, env))\njq_interpreter/evaluator.py:131:            # handle shape mismatches, not errors raised by the remainder.\njq_interpreter/evaluator.py:206:                raise RuntimeError(f\"{_type_name(x)} ({_short(x)}) cannot be negated\")\njq_interpreter/evaluator.py:293:        # shadowing ``2 as $x``.  Later redefinitions affect subsequent\njq_interpreter/evaluator.py:411:            raise RuntimeError(f'Cannot index object with {_type_name(k)} ({_short(k)})')\njq_interpreter/evaluator.py:422:            raise RuntimeError(f'Cannot index string with number ({_short(k)})')\njq_interpreter/evaluator.py:461:        # not shift the index of a later path.  Type-tagged components keep\njq_interpreter/evaluator.py:515:            else: raise RuntimeError(f\"{_type_name(x)} ({_short(x)}) and {_type_name(y)} ({_short(y)}) cannot be added\")\njq_interpreter/evaluator.py:521:                raise RuntimeError(f\"{_type_name(x)} ({_short(x)}) and {_type_name(y)} ({_short(y)}) cannot be subtracted\")\njq_interpreter/evaluator.py:541:            else: raise RuntimeError(f\"{_type_name(x)} ({_short(x)}) and {_type_name(y)} ({_short(y)}) cannot be multiplied\")\njq_interpreter/evaluator.py:544:                raise RuntimeError(f\"number ({_short(x)}) and number ({_short(y)}) cannot be divided because the divisor is zero\")\njq_interpreter/evaluator.py:548:            else: raise RuntimeError(f\"{_type_name(x)} ({_short(x)}) and {_type_name(y)} ({_short(y)}) cannot be divided\")\njq_interpreter/evaluator.py:551:                raise RuntimeError(f\"number ({_short(x)}) and number ({_short(y)}) cannot be divided (remainder) because the divisor is zero\")\njq_interpreter/evaluator.py:558:                    raise RuntimeError(f\"{_type_name(x)} ({_short(x)}) and {_type_name(y)} ({_short(y)}) cannot be divided (remainder)\")\njq_interpreter/evaluator.py:606:    raise RuntimeError(f\"{_type_name(left)} ({_short(left)}) and {_type_name(right)} ({_short(right)}) cannot be used with {op}\")\njq_interpreter/evaluator.py:612:        raise RuntimeError(f\"{_type_name(left)} ({_short(left)}) and {_type_name(right)} ({_short(right)}) must be numbers\")\njq_interpreter/evaluator.py:620:        raise RuntimeError(f\"{_type_name(left)} ({_short(left)}) and {_type_name(right)} ({_short(right)}) must be numbers\")\njq_interpreter/evaluator.py:915:                    raise RuntimeError(f'Cannot index object with {_type_name(key)} ({_short(key)})')\njq_interpreter/evaluator.py:1022:        raise RuntimeError(f'Cannot index object with {_type_name(key)} ({_short(key)})')\njq_interpreter/evaluator.py:1049:            raise RuntimeError(f'Cannot index {_type_name(current)} with {_type_name(key)} ({_short(key)})')\njq_interpreter/evaluator.py:1071:                raise RuntimeError(f'Cannot index object with {_type_name(key)} ({_short(key)})')\njq_interpreter/evaluator.py:1088:            raise RuntimeError(f'Cannot index object with {_type_name(key)} ({_short(key)})')\njq_interpreter/evaluator.py:1105:            f'Cannot index {_type_name(value)} with {_type_name(key)} ({_short(key)})'\njq_interpreter/evaluator.py:1271:    if name == 'tostring': yield _stringify(value); return\njq_interpreter/evaluator.py:1272:    if name == 'tojson':\njq_interpreter/evaluator.py:1481:            raise RuntimeError(f'{name}/1 requires a string format')\njq_interpreter/evaluator.py:1493:                raise RuntimeError(f'{name}/1 requires a string format')\njq_interpreter/evaluator.py:1504:            raise RuntimeError('strptime/1 requires a string format')\njq_interpreter/evaluator.py:1513:        if not isinstance(value, list): raise RuntimeError(f'{_type_name(value)} ({_short(value)}) cannot be searched from')\njq_interpreter/evaluator.py:1534:            'floor/0', 'flatten/0', 'from_entries/0', 'fromjson/0', 'gmtime/0',\njq_interpreter/evaluator.py:1539:            'tostring/0', 'type/0', 'unique/0', 'values/0', 'walk/1',\njq_interpreter/evaluator.py:1584:    if name == 'fromjson':\njq_interpreter/evaluator.py:1619:            shown = _stringify(mapped[0]) if mapped else '[]'\njq_interpreter/evaluator.py:1621:                raise RuntimeError(f'Invalid path expression with result {shown}')\njq_interpreter/evaluator.py:1623:                raise RuntimeError(f'Invalid path expression near attempt to iterate through {shown}')\njq_interpreter/evaluator.py:1627:                raise RuntimeError(f'Invalid path expression near attempt to access element {_stringify(key_value)} of {shown}')\njq_interpreter/evaluator.py:1629:                raise RuntimeError(f'Invalid path expression near attempt to access element {json.dumps(tail.arguments[0])} of {shown}')\njq_interpreter/evaluator.py:1630:            raise RuntimeError(f'Invalid path expression with result {shown}')\njq_interpreter/evaluator.py:1788:        # cannot shift a later member.  Deeper parents are handled first.\njq_interpreter/evaluator.py:1838:                shown = json.dumps(item, ensure_ascii=False) if isinstance(item, str) else _stringify(item)\njq_interpreter/evaluator.py:1839:                raise RuntimeError(f'{_type_name(item)} ({shown}) can\\'t be imploded, unicode codepoint needs to be numeric')\njq_interpreter/evaluator.py:1888:    unary_math_names = ('acos', 'acosh', 'asin', 'asinh', 'atan', 'atanh', 'ceil',\njq_interpreter/evaluator.py:1889:                        'cos', 'cosh', 'erf', 'erfc', 'exp', 'exp2', 'expm1',\njq_interpreter/evaluator.py:2041:def _short(value: object) -> str:\njq_interpreter/evaluator.py:2045:            shown = value\njq_interpreter/evaluator.py:2047:            shown = value\njq_interpreter/evaluator.py:2052:                    shown = cut.decode('utf-8') + '...'\njq_interpreter/evaluator.py:2056:        return json.dumps(shown, ensure_ascii=False)\njq_interpreter/evaluator.py:2060:            shown = format(Decimal(str(value)), '.0f')\njq_interpreter/evaluator.py:2061:            return shown if len(shown) <= 26 else shown[:26] + '...'\njq_interpreter/evaluator.py:2085:            return format(Decimal(str(value)), '.0f')\njq_interpreter/evaluator.py:2089:def _apply_format(name: str, value: object, template: bool = False) -> str:\njq_interpreter/evaluator.py:2090:    import base64, html, json, urllib.parse\njq_interpreter/evaluator.py:2096:    if name == \"base64\": return base64.b64encode(_stringify(value).encode()).decode()\njq_interpreter/evaluator.py:2097:    if name == \"base64d\": return base64.b64decode(_stringify(value)).decode()\njq_interpreter/evaluator.py:2098:    if name == \"csv\": return \",\".join('\"' + str(x).replace('\"', '\"\"') + '\"' if isinstance(x, str) else _stringify(x) for x in value)\njq_interpreter/evaluator.py:2099:    if name == \"tsv\": return \"\\t\".join(_stringify(x).replace(\"\\\\\", \"\\\\\\\\\").replace(\"\\n\", \"\\\\n\").replace(\"\\r\", \"\\\\r\").replace(\"\\t\", \"\\\\t\") for x in value)\njq_interpreter/evaluator.py:2100:    if name == \"sh\": return \"'\" + _stringify(value).replace(\"'\", \"'\\\\''\") + \"'\"\njq_interpreter/evaluator.py:2101:    raise RuntimeError(f\"unknown format @{name}\")\ntests/test_value_004.py:36:        (\"4|tostring\", None, [\"4\"]),\ntests/test_path_002_access_mutation.py:25:def test_delpaths_removes_multiple_paths_without_shifting_targets() -> None:\njq_interpreter/errors.py:13:# jq errors when they cross a flow operator.  Keep this tuple shared by the\njq_interpreter/cli.py:51:            print(_deep_json_dumps(output), flush=True)\njq_interpreter/ast.py:1:\"\"\"Syntax tree types shared by the lexer, parser, and evaluator.\"\"\"\njq_interpreter/ast.py:6:@dataclass(frozen=True)\njq_interpreter/ast.py:11:@dataclass(frozen=True)\njq_interpreter/ast.py:16:@dataclass(frozen=True)\njq_interpreter/ast.py:21:@dataclass(frozen=True)\njq_interpreter/ast.py:28:@dataclass(frozen=True)\njq_interpreter/ast.py:36:@dataclass(frozen=True)\njq_interpreter/ast.py:43:@dataclass(frozen=True)\njq_interpreter/ast.py:50:@dataclass(frozen=True)\njq_interpreter/ast.py:57:@dataclass(frozen=True)\njq_interpreter/ast.py:62:@dataclass(frozen=True)\njq_interpreter/ast.py:63:class StringTemplate(Filter):\njq_interpreter/ast.py:66:@dataclass(frozen=True)\njq_interpreter/ast.py:69:    template: StringTemplate | None = None\njq_interpreter/ast.py:71:@dataclass(frozen=True)\njq_interpreter/ast.py:76:@dataclass(frozen=True)\njq_interpreter/runtime.py:22:@dataclass\ntests/test_conformance_assets.py:37:            \"full_test.sh\",\ntests/test_flow_002_boolean_alternative.py:40:def test_boolean_short_circuit_does_not_evaluate_unneeded_operand() -> None:\ntests/test_data_003_entries_containment.py:1:\"\"\"Behavioral coverage for object entries, membership, and containment.\"\"\"\ntests/test_data_003_entries_containment.py:29:def test_has_and_in_distinguish_object_keys_from_array_indices() -> None:\ntests/test_data_003_entries_containment.py:66:def test_quantifiers_and_membership_use_all_generated_values() -> None:\njq_interpreter/architecture.py:1:\"\"\"Stable ownership map for the standalone interpreter.\njq_interpreter/architecture.py:10:@dataclass(frozen=True)\njq_interpreter/paths.py:8:@dataclass(frozen=True)\ntests/test_service_lexical_bindings.py:26:def test_nested_binding_shadows_only_the_inner_scope() -> None:\ntests/test_parse_002.py:30:def test_interpolation_uses_filter_output() -> None:\ntests/test_parse_002.py:33:    assert json.loads(result.stdout) == \"interpolation\"\ntests/test_parse_002.py:36:@pytest.mark.parametrize(\ntests/test_parse_002.py:39:        (\"@uri\", \"μ\", \"%CE%BC\"),\ntests/test_parse_002.py:40:        (\"@base64\", \"foóbar\\n\", \"Zm/Ds2Jhcgo=\"),\ntests/test_parse_002.py:41:        ('@html \"<b>\\\\(.)</b>\"', \"<script>hax</script>\", \"<b>&lt;script&gt;hax&lt;/script&gt;</b>\"),\ntests/test_parse_002.py:44:def test_format_literals(program: str, value: object, expected: str) -> None:\ntests/test_lexer.py:25:def test_scans_formats_and_qualified_bindings() -> None:\ntests/test_lexer.py:26:    tokens = tokenize('@json $module::value .field')\ntests/test_lexer.py:28:        (TokenKind.FORMAT, \"@json\"),\ntests/test_lexer.py:34:@pytest.mark.parametrize(\"source\", ['\"bad\\\\q\"', '\"unterminated'])\ntests/test_value_001.py:32:def test_tojson_and_fromjson_preserve_json_value_structure() -> None:\ntests/test_value_001.py:33:    result = run_jq(\"[.[] | tojson | fromjson]\", '[\"text\", 1, [true, null]]\\n')\ntests/test_value_001.py:38:def test_fromjson_accepts_nan_and_serializes_it_as_null() -> None:\ntests/test_value_001.py:39:    result = run_jq(\"fromjson | [., isnan]\", '\"nan\"\\n')\ntests/test_value_001.py:51:    result = run_jq(\"[1E+1000, -1E+1000 | tojson]\")\njq_interpreter/interpreter.py:50:        # ints so diagnostics and compact structural values keep jq's shape.\njq_interpreter/parser.py:5:from .ast import Filter, Node, StringTemplate, Format\njq_interpreter/parser.py:9:@dataclass(frozen=True)\njq_interpreter/parser.py:43:        if s[i]=='@':\njq_interpreter/parser.py:44:            m=re.match(r\"@[A-Za-z_][A-Za-z_0-9]*\",s[i:])\njq_interpreter/parser.py:45:            if not m: raise CompileError(\"invalid format\")\njq_interpreter/parser.py:112:        if t.startswith('@'): self.take(); return self.post(Node('format',(t[1:],)))\njq_interpreter/parser.py:118:            if self.p().startswith('\"') and isinstance(x,Node) and x.operation=='format':\njq_interpreter/parser.py:119:                x=Node('format_template',(x.arguments[0],self.take())); continue\njq_interpreter/parser.py:288:        return StringTemplate(tuple(parts))\njq_interpreter/parser.py:289:    if stripped.startswith('@') and ' \"' in stripped:\njq_interpreter/parser.py:291:        return Format(name[1:], inner if isinstance(inner,StringTemplate) else StringTemplate((inner,)))\njq_interpreter/parser.py:301:    known = set('empty error length type utf8bytelength not tonumber toboolean tostring tojson abs fabs floor ceil round trunc sin cos tan asin acos atan sinh cosh tanh asinh acosh atanh log log10 log1p log2 logb exp exp2 exp10 expm1 pow cbrt gamma lgamma tgamma erf erfc j0 j1 y0 y1 atan2 copysign drem fdim fmax fmin fmod frexp hypot jn ldexp modf nextafter nexttoward remainder scalb scalbln yn fma infinite nan isinfinite isnan isfinite isnormal keys keys_unsorted has in inside contains to_entries from_entries with_entries sort add min max min_by max_by any all arrays objects iterables booleans numbers normals finites strings nulls values scalars unique reverse paths path indices builtins modulemeta input debug implode explode trim ltrim rtrim trimstr ltrimstr rtrimstr ascii_downcase ascii_upcase startswith endswith split join isempty have_decnum gmtime map map_values select flatten transpose combinations walk'.split())\njq_interpreter/lexer.py:26:@dataclass(frozen=True)\njq_interpreter/lexer.py:89:                    raise _error(source, position, \"unterminated interpolation\")\njq_interpreter/lexer.py:147:        if character == \"@\":\njq_interpreter/lexer.py:150:                raise _error(source, position, \"invalid format\")\n","exit_code":0,"status":"completed"}}
{"type":"item.started","item":{"id":"item_5","type":"command_execution","command":"/bin/bash -lc \"sed -n '1,120p' jq_interpreter/interpreter.py; sed -n '1,120p' jq\"","aggregated_output":"","exit_code":null,"status":"in_progress"}}
{"type":"item.completed","item":{"id":"item_5","type":"command_execution","command":"/bin/bash -lc \"sed -n '1,120p' jq_interpreter/interpreter.py; sed -n '1,120p' jq\"","aggregated_output":"\"\"\"Application-facing interpreter orchestration.\"\"\"\n\nimport json\nfrom collections.abc import Iterable, Iterator\n\nfrom .evaluator import evaluate\nfrom .parser import parse\nfrom .runtime import InputNumber, JsonValue\n\n\nclass _InputInteger(int):\n    \"\"\"An input integer whose literal spelling remains available to jq.\"\"\"\n\n\nclass Interpreter:\n    \"\"\"Compile once, then evaluate each JSON input in order.\"\"\"\n\n    def __init__(self, program: str) -> None:\n        self._compiled = parse(program)\n\n    def run(self, inputs: Iterable[JsonValue]) -> Iterator[JsonValue]:\n        \"\"\"Yield every output, preserving input and generator ordering.\"\"\"\n        for value in inputs:\n            yield from evaluate(self._compiled, value)\n\n\ndef parse_input(line: str) -> JsonValue:\n    \"\"\"Decode one JSON input value.\"\"\"\n    return json.loads(line.lstrip(\"\\ufeff\"), parse_constant=_parse_json_constant)\n\n\ndef parse_inputs(text: str) -> Iterator[JsonValue]:\n    \"\"\"Decode every whitespace-separated JSON value in an input stream.\n\n    ``jq`` accepts JSON values separated by arbitrary whitespace, so a value may\n    span multiple physical lines.  ``raw_decode`` preserves the boundary\n    between successive values without requiring a non-standard JSON parser.\n    \"\"\"\n    # jq accepts its non-standard constants in lower case as well.  The\n    # standard decoder only dispatches parse_constant for JSON's capitalized\n    # spellings, so normalize standalone bare constants before decoding.\n    import re\n    text = re.sub(r'(?<![A-Za-z_])-(?:nan|infinite|NaN|Infinity)(?![A-Za-z_])', lambda m: '-NaN' if 'nan' in m.group(0).lower() else '-Infinity', text)\n    text = re.sub(r'(?<![A-Za-z_])(?:nan|infinite|NaN|Infinity)(?![A-Za-z_])', lambda m: 'NaN' if m.group(0).lower() == 'nan' else 'Infinity', text)\n    text = re.sub(r'(?<![A-Za-z_])-NaN(?![A-Za-z_])', 'NaN', text)\n    def parse_integer(text: str) -> int | float:\n        integer = int(text)\n        # Retain spelling only where the configured double representation can\n        # no longer represent the integer exactly.  Ordinary integers remain\n        # ints so diagnostics and compact structural values keep jq's shape.\n        return InputNumber(text) if abs(integer) > 2**53 else _InputInteger(integer)\n\n    decoder = json.JSONDecoder(\n        parse_constant=_parse_json_constant,\n        parse_int=parse_integer,\n        parse_float=InputNumber,\n    )\n    position = 0\n    while True:\n        while position < len(text) and text[position].isspace():\n            position += 1\n        if position >= len(text):\n            return\n        if position == 0 and text.startswith(\"\\ufeff\"):\n            position += 1\n            continue\n        value, position = decoder.raw_decode(text, position)\n        yield value\n\n\ndef _parse_json_constant(value: str) -> float:\n    \"\"\"Decode jq's accepted non-standard numeric constants.\"\"\"\n    return {\"NaN\": float(\"nan\"), \"nan\": float(\"nan\"),\n            \"Infinity\": float(\"inf\"), \"infinite\": float(\"inf\"),\n            \"-Infinity\": float(\"-inf\"), \"-infinite\": float(\"-inf\"),\n            \"-NaN\": float(\"nan\"), \"-nan\": float(\"nan\")} [value]\n#!/usr/bin/env python3\n\"\"\"Standalone jq executable entry point.\n\nThe interpreter package owns parsing and evaluation; this tiny launcher keeps\nthe application-root contract explicit and lets the file remain directly\nexecutable without installation.\n\"\"\"\n\nfrom __future__ import annotations\n\nfrom jq_interpreter.cli import main\n\n\ndef run() -> int:\n    \"\"\"Run the command-line interface and return its process status.\"\"\"\n    return main()\n\n\nif __name__ == \"__main__\":\n    raise SystemExit(run())\n","exit_code":0,"status":"completed"}}
{"type":"item.started","item":{"id":"item_6","type":"command_execution","command":"/bin/bash -lc \"sed -n '1,140p' tests/test_parse_002.py; sed -n '1,120p' tests/test_value_001.py; sed -n '1,120p' tests/conftest.py; sed -n '1,100p' jq_interpreter/cli.py\"","aggregated_output":"","exit_code":null,"status":"in_progress"}}
{"type":"item.completed","item":{"id":"item_6","type":"command_execution","command":"/bin/bash -lc \"sed -n '1,140p' tests/test_parse_002.py; sed -n '1,120p' tests/test_value_001.py; sed -n '1,120p' tests/conftest.py; sed -n '1,100p' jq_interpreter/cli.py\"","aggregated_output":"import json\nimport subprocess\nfrom pathlib import Path\n\nimport pytest\n\nfrom jq_interpreter.errors import CompileError\nfrom jq_interpreter.parser import parse\n\n\nROOT = Path(__file__).parents[1]\n\n\ndef run(program: str, value: object) -> subprocess.CompletedProcess[str]:\n    return subprocess.run(\n        [str(ROOT / \"jq\"), \"-c\", program],\n        input=json.dumps(value) + \"\\n\",\n        text=True,\n        capture_output=True,\n        check=False,\n    )\n\n\ndef test_unicode_json_escapes_are_decoded() -> None:\n    result = run(r'\"Aa\\r\\n\\t\\b\\f\\u03bc\"', None)\n    assert result.returncode == 0\n    assert json.loads(result.stdout) == \"Aa\\r\\n\\t\\b\\fμ\"\n\n\ndef test_interpolation_uses_filter_output() -> None:\n    result = run(r'\"inter\\(\"pol\" + \"ation\")\"', None)\n    assert result.returncode == 0\n    assert json.loads(result.stdout) == \"interpolation\"\n\n\n@pytest.mark.parametrize(\n    (\"program\", \"value\", \"expected\"),\n    [\n        (\"@uri\", \"μ\", \"%CE%BC\"),\n        (\"@base64\", \"foóbar\\n\", \"Zm/Ds2Jhcgo=\"),\n        ('@html \"<b>\\\\(.)</b>\"', \"<script>hax</script>\", \"<b>&lt;script&gt;hax&lt;/script&gt;</b>\"),\n    ],\n)\ndef test_format_literals(program: str, value: object, expected: str) -> None:\n    result = run(program, value)\n    assert result.returncode == 0\n    assert json.loads(result.stdout) == expected\n\n\ndef test_invalid_escape_is_compile_failure() -> None:\n    with pytest.raises(CompileError):\n        parse(r'\"u\\vw\"')\n\n\"\"\"Focused coverage for jq's value and numeric boundary behavior.\"\"\"\n\nimport json\nimport subprocess\nfrom pathlib import Path\n\n\nROOT = Path(__file__).parents[1]\nEXECUTABLE = ROOT / \"jq\"\n\n\ndef run_jq(program: str, input_text: str = \"null\\n\") -> subprocess.CompletedProcess[str]:\n    return subprocess.run(\n        [str(EXECUTABLE), \"-c\", program],\n        input=input_text,\n        capture_output=True,\n        text=True,\n        check=False,\n    )\n\n\ndef json_lines(result: subprocess.CompletedProcess[str]) -> list[object]:\n    return [json.loads(line) for line in result.stdout.splitlines()]\n\n\ndef test_non_finite_values_are_null_at_the_json_output_boundary() -> None:\n    result = run_jq(\"[nan, infinite, -infinite, {value: nan}]\")\n    assert result.returncode == 0\n    assert json_lines(result) == [[None, None, None, {\"value\": None}]]\n\n\ndef test_tojson_and_fromjson_preserve_json_value_structure() -> None:\n    result = run_jq(\"[.[] | tojson | fromjson]\", '[\"text\", 1, [true, null]]\\n')\n    assert result.returncode == 0\n    assert json_lines(result) == [[\"text\", 1, [True, None]]]\n\n\ndef test_fromjson_accepts_nan_and_serializes_it_as_null() -> None:\n    result = run_jq(\"fromjson | [., isnan]\", '\"nan\"\\n')\n    assert result.returncode == 0\n    assert json_lines(result) == [[None, True]]\n\n\ndef test_nan_is_not_a_valid_array_key_for_has() -> None:\n    result = run_jq(\"has(nan)\", \"[0,1,2]\\n\")\n    assert result.returncode == 0\n    assert json_lines(result) == [False]\n\n\ndef test_large_exponent_literal_remains_a_numeric_value() -> None:\n    result = run_jq(\"[1E+1000, -1E+1000 | tojson]\")\n    assert result.returncode == 0\n    assert json_lines(result) == [[\n        \"1.7976931348623157e+308\",\n        \"-1.7976931348623157e+308\",\n    ]]\nimport sys\nfrom pathlib import Path\n\nROOT = Path(__file__).parents[1]\nif str(ROOT) not in sys.path:\n    sys.path.insert(0, str(ROOT))\n\"\"\"Executable boundary for ``jq -c '<program>'``.\"\"\"\n\nimport argparse\nimport json\nimport math\nimport sys\nfrom collections.abc import Iterator\n\nfrom .diagnostics import report_compile_error, report_runtime_error\nfrom .errors import CompileError, FLOW_RUNTIME_ERRORS, RuntimeError\nfrom .interpreter import Interpreter, parse_inputs\n\n# The conformance corpus deliberately exercises jq's deep-value limit with\n# values around ten thousand levels deep.  Python's default limit is lower\n# than that and would turn valid jq processing into an uncaught RecursionError\n# while encoding an intermediate value.\nsys.setrecursionlimit(100000)\n\n\ndef _inputs() -> Iterator[object]:\n    yield from parse_inputs(sys.stdin.read())\n\n\ndef _json_output(value: object) -> object:\n    \"\"\"Convert jq's non-finite numbers to its JSON output representation.\n\n    jq represents NaN and infinities as ``null`` when emitting JSON.  Doing this\n    recursively also covers values nested in arrays and objects.\n    \"\"\"\n    if isinstance(value, float) and not math.isfinite(value):\n        return None\n    if isinstance(value, list):\n        return [_json_output(item) for item in value]\n    if isinstance(value, dict):\n        return {key: _json_output(item) for key, item in value.items()}\n    return value\n\n\ndef main(argv: list[str] | None = None) -> int:\n    arguments = argparse.ArgumentParser(prog=\"jq\")\n    arguments.add_argument(\"-c\", action=\"store_true\")\n    arguments.add_argument(\"program\")\n    options = arguments.parse_args(argv)\n    try:\n        interpreter = Interpreter(options.program)\n    except CompileError as error:\n        return report_compile_error(error)\n    try:\n        for output in interpreter.run(_inputs()):\n            from .evaluator import _deep_json_dumps\n            print(_deep_json_dumps(output), flush=True)\n    except FLOW_RUNTIME_ERRORS + (json.JSONDecodeError,) as error:\n        return report_runtime_error(RuntimeError(str(error)))\n    return 0\n","exit_code":0,"status":"completed"}}
{"type":"item.started","item":{"id":"item_7","type":"command_execution","command":"/bin/bash -lc \"sed -n '1,180p' jq_interpreter/evaluator.py; sed -n '1230,1310p' jq_interpreter/evaluator.py; sed -n '1560,1605p' jq_interpreter/evaluator.py; sed -n '2040,2120p' jq_interpreter/evaluator.py\"","aggregated_output":"","exit_code":null,"status":"in_progress"}}
{"type":"item.completed","item":{"id":"item_7","type":"command_execution","command":"/bin/bash -lc \"sed -n '1,180p' jq_interpreter/evaluator.py; sed -n '1230,1310p' jq_interpreter/evaluator.py; sed -n '1560,1605p' jq_interpreter/evaluator.py; sed -n '2040,2120p' jq_interpreter/evaluator.py\"","aggregated_output":"\"\"\"Ordered generator evaluator boundary.\"\"\"\nimport json\nimport math\nimport datetime\nimport itertools\nimport sys\nfrom functools import cmp_to_key\n\nfrom .ast import Add, Array, Comma, Filter, Format, Identity, Iterate, Literal, Limit, Node, Pipe, Raise, StringTemplate\nfrom .errors import FLOW_RUNTIME_ERRORS, RuntimeError\nfrom .runtime import InputNumber, JsonValue, ValueStream, identity_stream\n\n\nclass _OverflowFloat(float):\n    \"\"\"A parsed exponent overflow that jq still emits as a JSON number.\"\"\"\n\n    pass\n\n\ndef evaluate(program: Filter, value: JsonValue) -> ValueStream:\n    \"\"\"Evaluate one input as an ordered stream of output values.\"\"\"\n    if isinstance(program, Node):\n        yield from _node(program, value, {})\n        return\n    if isinstance(program, Identity):\n        yield from identity_stream(value)\n        return\n    if isinstance(program, Iterate):\n        yield from _iter_values(value)\n        return\n    if isinstance(program, Literal):\n        yield program.value\n        return\n    if isinstance(program, Pipe):\n        for intermediate in evaluate(program.left, value): yield from evaluate(program.right, intermediate)\n        return\n    if isinstance(program, Add):\n        left = list(evaluate(program.left, value))\n        right = list(evaluate(program.right, value))\n        for first in left:\n            for second in right:\n                if isinstance(first, (int, float)) and isinstance(second, (int, float)):\n                    yield first + second\n                elif isinstance(first, str) and isinstance(second, str): yield first + second\n                elif first is None: yield second\n                elif second is None: yield first\n                else: raise RuntimeError(\"cannot add values\")\n        return\n    if isinstance(program, StringTemplate):\n        pieces: list[str] = []\n        for part in program.parts:\n            pieces.append(part if isinstance(part, str) else \"\".join(_stringify(x) for x in evaluate(part, value)))\n        yield \"\".join(pieces)\n        return\n    if isinstance(program, Format):\n        if program.template is None: yield _apply_format(program.name, value)\n        else:\n            pieces: list[str] = []\n            for part in program.template.parts:\n                if isinstance(part, str): pieces.append(part)\n                else:\n                    pieces.extend(_apply_format(program.name, item) for item in evaluate(part, value))\n            yield \"\".join(pieces)\n        return\n    if isinstance(program, Comma):\n        yield from evaluate(program.left, value)\n        yield from evaluate(program.right, value)\n        return\n    if isinstance(program, Raise):\n        raise RuntimeError(program.message)\n    if isinstance(program, Array):\n        yield list(evaluate(program.expression, value))\n        return\n    if isinstance(program, Limit):\n        outputs = iter(evaluate(program.expression, value))\n        for _ in range(program.count):\n            try:\n                yield next(outputs)\n            except StopIteration:\n                break\n        return\n    raise RuntimeError(\"unknown compiled filter\")\n\ndef _node(node: Node, value: object, env: dict[str, object]) -> ValueStream:\n    op, a = node.operation, node.arguments\n    if op == \"identity\": yield value\n    elif op == \"literal\":\n        text=a[0]; special={\"true\":True,\"false\":False,\"null\":None,\"nan\":float(\"nan\"),\"infinite\":float(\"inf\"),\"-infinite\":float(\"-inf\"),\"-nan\":float(\"nan\")}\n        if text in special:\n            yield special[text]\n        else:\n            parsed = json.loads(text)\n            if isinstance(parsed, int) and abs(parsed) > 2**53:\n                parsed = float(parsed)\n            if isinstance(parsed, float) and math.isinf(parsed):\n                parsed = _OverflowFloat(parsed)\n            yield parsed\n    elif op == \"string\": yield _decode_string(a[0], value, env)\n    elif op == \"format\": yield _apply_format(a[0], value)\n    elif op == \"format_template\":\n        # Interpolation is evaluated first; the formatter consumes the\n        # resulting string (not the original input value).\n        yield _apply_format(a[0], _decode_string(a[1], value, env))\n    elif op == \"var\":\n        if a[0] == '__loc__':\n            yield {'file': '<top-level>', 'line': 1}\n            return\n        if a[0] in env and not isinstance(env[a[0]], tuple):\n            bound = env[a[0]]\n            if isinstance(bound, Node): yield from _node(bound, value, env)\n            else: yield bound\n            return\n        if a[0] in env.get('__params__', {}):\n            captured, argument = env['__params__'][a[0]]\n            yield from _node(argument, value, captured)\n            return\n        if a[0] not in env: raise RuntimeError(f\"variable ${a[0]} is not defined\")\n        bound = env[a[0]]\n        if isinstance(bound, tuple) and bound and bound[0] == '__closure__':\n            yield from _node(bound[1], value, {**env, **bound[2]})\n        elif isinstance(bound, Node):\n            yield from _node(bound, value, env)\n        else:\n            yield bound\n    elif op == \"bind\":\n        for item in _node(a[0], value, env):\n            # A destructuring alternative is a speculative binding: jq must\n            # retry the next pattern when either matching or the continuation\n            # fails.  Keeping the continuation inside this loop is important;\n            # evaluating it after selecting a pattern would make `?//` only\n            # handle shape mismatches, not errors raised by the remainder.\n            alternatives = _pattern_alternatives(a[1])\n            for position, pattern in enumerate(alternatives):\n                bound = dict(env)\n                _initialize_pattern(a[1], bound)\n                if not _bind_pattern(pattern, item, bound):\n                    continue\n                try:\n                    yield from _node(a[2], value, bound)\n                except FLOW_RUNTIME_ERRORS:\n                    if position == len(alternatives) - 1:\n                        raise\n                    continue\n                break\n    elif op == \"field\": yield _index(value, a[0])\n    elif op == \"recurse\":\n        # The parser uses this node for the recursive-descent operator.  Keep\n        # the traversal depth-first and source ordered, matching recurse(.[]?).\n        def walk(item):\n            yield item\n            if isinstance(item, list):\n                for child in item:\n                    yield from walk(child)\n            elif isinstance(item, dict):\n                for child in item.values():\n                    yield from walk(child)\n        yield from walk(value)\n    elif op == \"index\":\n        for base in _node(a[0],value,env): yield _index(base,a[1])\n    elif op == \"iterate\":\n        for base in _node(a[0],value,env):\n            yield from _iter_values(base)\n    elif op in (\"indexexpr\",\"slice\"):\n        for base in _node(a[0],value,env):\n            if op==\"slice\":\n                # Slice bounds are filters over the surrounding input, not\n                # over the value being sliced (for example map([1,2][0:.])).\n                start=_one(a[1],value,env); end=None if a[2] is None else _one(a[2],value,env)\n                import math as _math\n                if base is None:\n                    yield None\n                elif isinstance(base, (list, str)):\n                    # jq clamps slice bounds to the collection and rounds\n                    # fractional starts down / ends up.  Resolve the bounds\n                    # only after checking the base so slicing null retains\n                    # jq's null-propagating access behavior.\n                    first = 0 if start is None or (isinstance(start, float) and _math.isnan(start)) else _math.floor(start)\n                    last = None if end is None or (isinstance(end, float) and _math.isnan(end)) else _math.ceil(end)\n                    if first < 0: first = max(0, len(base) + int(first))\n                    if last is not None and last < 0: last = max(0, len(base) + int(last))\n        else:\n            stream = iter(value if isinstance(value, list) else [])\n            condition = None\n        desired = name == 'any'\n        result = not desired\n        for item in stream:\n            tests = [item] if condition is None else list(_node(condition, item, env))\n            # A predicate is itself a generator.  `any` succeeds when any\n            # predicate output is truthy; `all` fails when any output is\n            # falsey.  Empty predicate output is neutral for `all` and false\n            # for `any`, matching the definitions in jq's standard library.\n            item_truth = any(_truth(test) for test in tests)\n            if item_truth == desired:\n                result = desired\n                break\n        yield result\n        return\n    if name in ('min', 'max', 'min_by', 'max_by'):\n        # These operations are reductions over the input array.  Key filters\n        # are evaluated once per candidate and retain every generated key;\n        # jq compares those keys lexicographically.\n        items = list(value) if isinstance(value, list) else []\n        if not items:\n            yield None\n            return\n        if name in ('min_by', 'max_by'):\n            keyed = [(list(_node(args[0], item, env)), item) for item in items]\n            ordered = sorted(keyed, key=cmp_to_key(\n                lambda first, second: _compare_key_sequences(first[0], second[0])))\n            yield ordered[0][1] if name == 'min_by' else ordered[-1][1]\n        else:\n            ordered = sorted(items, key=cmp_to_key(_jq_compare))\n            yield ordered[0] if name == 'min' else ordered[-1]\n        return\n    if name == 'isempty':\n        try:\n            next(_node(args[0], value, env))\n            yield False\n        except StopIteration:\n            yield True\n        return\n    if name == 'tostring': yield _stringify(value); return\n    if name == 'tojson':\n        if isinstance(value, _OverflowFloat):\n            yield '1.7976931348623157e+308' if value > 0 else '-1.7976931348623157e+308'\n            return\n        if isinstance(value, float) and math.isfinite(value):\n            if value.is_integer() and abs(value) < 1e308:\n                yield str(int(value))\n            else:\n                yield json.dumps(value, separators=(',', ':'), ensure_ascii=False)\n        else:\n            yield _deep_json_dumps(value)\n        return\n    if name=='abs':\n        if isinstance(value, InputNumber) and value >= 0:\n            yield value\n        else:\n            yield _OverflowFloat(abs(value)) if isinstance(value, _OverflowFloat) else abs(value)\n        return\n    if name=='fabs': yield math.fabs(value); return\n    if name=='floor': yield math.floor(value); return\n    if name=='ceil': yield math.ceil(value); return\n    if name=='map':\n        result=[]\n        for x in value:\n            result.extend(_node(args[0], x, env))\n        yield result; return\n    if name == 'map_values':\n        if isinstance(value, list):\n            result=[]\n            for item in value: result.extend(_node(args[0], item, env))\n            yield result; return\n        if isinstance(value, dict):\n            result={}\n            for key, item in value.items():\n                outputs=list(_node(args[0], item, env))\n                if outputs: result[key]=outputs[0]\n            yield result; return\n        raise RuntimeError('map_values requires an array or object')\n    if name == 'with_entries':\n                result[str(key)] = item\n        yield result\n        return\n    if name == 'tonumber':\n        if isinstance(value, (int, float)): yield value\n        elif isinstance(value, str):\n            try:\n                # json.loads rejects jq's accepted leading-plus and\n                # fractional spellings such as `.89`.\n                import re\n                if not re.fullmatch(r'[+-]?(?:[0-9]+(?:\\.[0-9]*)?|\\.[0-9]+)(?:[eE][+-]?[0-9]+)?', value):\n                    raise ValueError('not a jq number')\n                yield float(value) if any(c in value for c in '.eE') or value.startswith(('+', '-')) else int(value)\n            except Exception: raise RuntimeError(f'string ({json.dumps(value)}) cannot be parsed as a number')\n        else: raise RuntimeError('cannot parse number')\n        return\n    if name == 'toboolean':\n        if isinstance(value, bool): yield value\n        elif isinstance(value, str) and value in ('true', 'false'): yield value == 'true'\n        else: raise RuntimeError(f'{_type_name(value)} ({_stringify(value) if not isinstance(value, str) else json.dumps(value)}) cannot be parsed as a boolean')\n        return\n    if name == 'utf8bytelength':\n        if not isinstance(value, str): raise RuntimeError(f'{_type_name(value)} ({_stringify(value)}) only strings have UTF-8 byte length')\n        yield len(value.encode()); return\n    if name == 'fromjson':\n        if not isinstance(value, str): raise RuntimeError('only strings can be parsed')\n        if value.startswith(\"{'\"):\n            raise RuntimeError(\"Invalid string literal; expected \\\", but got ' at line 1, column 5 (while parsing '{'a': 123}')\")\n        try:\n            if value in ('NaN', '-NaN'):\n                yield float('nan'); return\n            if value.startswith(('NaN', '-NaN')) and len(value) > 3:\n                raise RuntimeError(f\"Invalid numeric literal at EOF at line 1, column {len(value)} (while parsing '{value}')\")\n            yield _deep_json_loads(value)\n        except RuntimeError: raise\n        except Exception: raise RuntimeError('invalid JSON')\n        return\n    if name == 'path':\n        # A mapped value is no longer a location.  Preserve jq's useful\n        # diagnostic about the first operation that makes the path invalid.\n        expression = args[0]\n        mapped_node = None\n        tail = None\n        if expression.operation == 'binary' and expression.arguments[0] == '|':\n            if expression.arguments[2].operation == 'call' and expression.arguments[2].arguments[0] == 'map':\n                mapped_node = expression.arguments[2]\n\ndef _short(value: object) -> str:\n    if isinstance(value, str):\n        encoded = value.encode('utf-8')\n        if len(encoded) <= 24:\n            shown = value\n        elif len(value) == 10:\n            shown = value\n        else:\n            cut = encoded[:24]\n            while True:\n                try:\n                    shown = cut.decode('utf-8') + '...'\n                    break\n                except UnicodeDecodeError:\n                    cut = cut[:-1]\n        return json.dumps(shown, ensure_ascii=False)\n    if isinstance(value, float) and value.is_integer():\n        if abs(value) >= 1e16:\n            from decimal import Decimal\n            shown = format(Decimal(str(value)), '.0f')\n            return shown if len(shown) <= 26 else shown[:26] + '...'\n        return str(int(value))\n    return _stringify(value)\n\ndef _type_name(value: object) -> str:\n    if value is None: return 'null'\n    if isinstance(value, bool): return 'boolean'\n    if isinstance(value, (int, float)): return 'number'\n    if isinstance(value, str): return 'string'\n    if isinstance(value, list): return 'array'\n    if isinstance(value, dict): return 'object'\n    return type(value).__name__\n\n\ndef _raise_unavailable(name: str) -> float:\n    raise RuntimeError(f'{name} is not available')\n\ndef _stringify(value: object) -> str:\n    import json\n    if isinstance(value, InputNumber):\n        value = float(value)\n    if isinstance(value, float) and math.isfinite(value) and value.is_integer():\n        if abs(value) >= 1e16:\n            from decimal import Decimal\n            return format(Decimal(str(value)), '.0f')\n        return str(int(value))\n    return value if isinstance(value, str) else json.dumps(value, separators=(\",\", \":\"), ensure_ascii=False, allow_nan=False)\n\ndef _apply_format(name: str, value: object, template: bool = False) -> str:\n    import base64, html, json, urllib.parse\n    if name == \"text\": return _stringify(value)\n    if name == \"json\": return json.dumps(value, separators=(\",\", \":\"), ensure_ascii=False)\n    if name == \"html\": return html.escape(_stringify(value), quote=True).replace(\"&#x27;\", \"&apos;\")\n    if name == \"uri\": return urllib.parse.quote(_stringify(value), safe=\"-_.~\")\n    if name == \"urid\": return urllib.parse.unquote(_stringify(value))\n    if name == \"base64\": return base64.b64encode(_stringify(value).encode()).decode()\n    if name == \"base64d\": return base64.b64decode(_stringify(value)).decode()\n    if name == \"csv\": return \",\".join('\"' + str(x).replace('\"', '\"\"') + '\"' if isinstance(x, str) else _stringify(x) for x in value)\n    if name == \"tsv\": return \"\\t\".join(_stringify(x).replace(\"\\\\\", \"\\\\\\\\\").replace(\"\\n\", \"\\\\n\").replace(\"\\r\", \"\\\\r\").replace(\"\\t\", \"\\\\t\") for x in value)\n    if name == \"sh\": return \"'\" + _stringify(value).replace(\"'\", \"'\\\\''\") + \"'\"\n    raise RuntimeError(f\"unknown format @{name}\")\n","exit_code":0,"status":"completed"}}
{"type":"item.completed","item":{"id":"item_8","type":"agent_message","text":"The code already has a partial TEXT-002 implementation, but format handling is concentrated in the evaluator and has likely semantic gaps (notably CSV/TSV/sh array behavior, strict input validation, URI escaping, and JSON number spelling). I’m running the declared checks now to establish the failing surface before patching."}}
{"type":"item.started","item":{"id":"item_9","type":"command_execution","command":"/bin/bash -lc 'python3 -m pytest -q'","aggregated_output":"","exit_code":null,"status":"in_progress"}}
{"type":"item.started","item":{"id":"item_10","type":"command_execution","command":"/bin/bash -lc \"python3 - <<'PY'\nimport json, os, subprocess, sys\nfor selector in [r'@text|@json|@html|@uri|@urid|@csv|@tsv|@sh|@base64|@base64d|tojson|fromjson|tostring', r'@html|@uri|@base64|@csv|@tsv|@sh']:\n    result=subprocess.run([sys.executable,'sources/run_conformance.py','--select',selector,'--json'],capture_output=True,text=True,env={**os.environ,'JQ':f'{os.getcwd()}/jq'})\n    print('SELECT',selector,'rc',result.returncode)\n    print(result.stdout)\n    print(result.stderr,file=sys.stderr)\nPY\"","aggregated_output":"","exit_code":null,"status":"in_progress"}}
{"type":"item.completed","item":{"id":"item_10","type":"command_execution","command":"/bin/bash -lc \"python3 - <<'PY'\nimport json, os, subprocess, sys\nfor selector in [r'@text|@json|@html|@uri|@urid|@csv|@tsv|@sh|@base64|@base64d|tojson|fromjson|tostring', r'@html|@uri|@base64|@csv|@tsv|@sh']:\n    result=subprocess.run([sys.executable,'sources/run_conformance.py','--select',selector,'--json'],capture_output=True,text=True,env={**os.environ,'JQ':f'{os.getcwd()}/jq'})\n    print('SELECT',selector,'rc',result.returncode)\n    print(result.stdout)\n    print(result.stderr,file=sys.stderr)\nPY\"","aggregated_output":"\nSELECT @text|@json|@html|@uri|@urid|@csv|@tsv|@sh|@base64|@base64d|tojson|fromjson|tostring rc 0\n{\n  \"candidate\": [\n    \"/mnt/c/Users/barlo/projects/drydock/uat/jq/runs/20260822.044627/build/jq/jq\"\n  ],\n  \"corpus\": \"jq.test\",\n  \"summary\": {\n    \"pass\": 25,\n    \"fail\": 0,\n    \"error\": 0,\n    \"skip\": 0\n  },\n  \"cases\": []\n}\n\n\nSELECT @html|@uri|@base64|@csv|@tsv|@sh rc 0\n{\n  \"candidate\": [\n    \"/mnt/c/Users/barlo/projects/drydock/uat/jq/runs/20260822.044627/build/jq/jq\"\n  ],\n  \"corpus\": \"jq.test\",\n  \"summary\": {\n    \"pass\": 7,\n    \"fail\": 0,\n    \"error\": 0,\n    \"skip\": 0\n  },\n  \"cases\": []\n}\n\n","exit_code":0,"status":"completed"}}
{"type":"item.completed","item":{"id":"item_9","type":"command_execution","command":"/bin/bash -lc 'python3 -m pytest -q'","aggregated_output":"........................................................................ [ 46%]\n........................................................................ [ 92%]\n............                                                             [100%]\n156 passed in 15.67s\n","exit_code":0,"status":"completed"}}
{"type":"item.started","item":{"id":"item_11","type":"command_execution","command":"/bin/bash -lc \"rg -n '\"'^def _deep_json|_deep_json_dumps|def _node'\"' jq_interpreter/evaluator.py && sed -n '2120,2185p' jq_interpreter/evaluator.py && sed -n '1,80p' jq_interpreter/ast.py\"","aggregated_output":"","exit_code":null,"status":"in_progress"}}
{"type":"item.completed","item":{"id":"item_11","type":"command_execution","command":"/bin/bash -lc \"rg -n '\"'^def _deep_json|_deep_json_dumps|def _node'\"' jq_interpreter/evaluator.py && sed -n '2120,2185p' jq_interpreter/evaluator.py && sed -n '1,80p' jq_interpreter/ast.py\"","aggregated_output":"84:def _node(node: Node, value: object, env: dict[str, object]) -> ValueStream:\n783:def _deep_json_dumps(value: object) -> str:\n839:def _deep_json_loads(text: str) -> object:\n1282:            yield _deep_json_dumps(value)\n\"\"\"Syntax tree types shared by the lexer, parser, and evaluator.\"\"\"\n\nfrom dataclasses import dataclass\n\n\n@dataclass(frozen=True)\nclass Filter:\n    \"\"\"Base type for compiled jq filters.\"\"\"\n\n\n@dataclass(frozen=True)\nclass Identity(Filter):\n    \"\"\"The ``.`` filter, yielding its input unchanged.\"\"\"\n\n\n@dataclass(frozen=True)\nclass Iterate(Filter):\n    \"\"\"The ``.[]`` filter, yielding array or object members in order.\"\"\"\n\n\n@dataclass(frozen=True)\nclass Literal(Filter):\n    \"\"\"A JSON literal filter.\"\"\"\n\n    value: object\n\n\n@dataclass(frozen=True)\nclass Comma(Filter):\n    \"\"\"Concatenate the output streams of two filters.\"\"\"\n\n    left: Filter\n    right: Filter\n\n\n@dataclass(frozen=True)\nclass Raise(Filter):\n    \"\"\"Raise a jq runtime error when evaluated.\"\"\"\n\n    message: str = \"error\"\n\n\n@dataclass(frozen=True)\nclass Array(Filter):\n    \"\"\"Collect a filter's generated values into an array.\"\"\"\n\n    expression: Filter\n\n\n@dataclass(frozen=True)\nclass Limit(Filter):\n    \"\"\"Keep at most ``count`` values from a filter stream.\"\"\"\n\n    count: int\n    expression: Filter\n\n@dataclass(frozen=True)\nclass Pipe(Filter):\n    left: Filter\n    right: Filter\n\n@dataclass(frozen=True)\nclass StringTemplate(Filter):\n    parts: tuple[str | Filter, ...]\n\n@dataclass(frozen=True)\nclass Format(Filter):\n    name: str\n    template: StringTemplate | None = None\n\n@dataclass(frozen=True)\nclass Add(Filter):\n    left: Filter\n    right: Filter\n\n@dataclass(frozen=True)\nclass Node(Filter):\n    \"\"\"General expression node used by the complete source parser.\"\"\"\n    operation: str\n    arguments: tuple[object, ...] = ()\n","exit_code":0,"status":"completed"}}
{"type":"item.started","item":{"id":"item_12","type":"command_execution","command":"/bin/bash -lc \"sed -n '760,860p' jq_interpreter/evaluator.py; sed -n '35,75p' jq_interpreter/cli.py; sed -n '1,120p' jq_interpreter/errors.py\"","aggregated_output":"","exit_code":null,"status":"in_progress"}}
{"type":"item.completed","item":{"id":"item_12","type":"command_execution","command":"/bin/bash -lc \"sed -n '760,860p' jq_interpreter/evaluator.py; sed -n '35,75p' jq_interpreter/cli.py; sed -n '1,120p' jq_interpreter/errors.py\"","aggregated_output":"        item, depth = pending.pop()\n        if depth > limit:\n            raise RuntimeError('Containment check too deep')\n        if isinstance(item, list):\n            pending.extend((child, depth + 1) for child in item)\n        elif isinstance(item, dict):\n            pending.extend((child, depth + 1) for child in item.values())\n\n    def contained(left: object, right: object) -> bool:\n        if isinstance(left, dict) and isinstance(right, dict):\n            return all(k in left and contained(left[k], v) for k, v in right.items())\n        if isinstance(left, list) and isinstance(right, list):\n            return all(any(contained(item, candidate) for item in left) for candidate in right)\n        if isinstance(left, str) and isinstance(right, str):\n            return right in left\n        return _deep_equal(left, right)\n\n    try:\n        return contained(haystack, wanted)\n    except RecursionError as error:\n        raise RuntimeError('Containment check too deep') from error\n\n\ndef _deep_json_dumps(value: object) -> str:\n    \"\"\"Encode deeply nested values without json.encoder's C recursion limit.\"\"\"\n    depth = 0\n    probe = value\n    while isinstance(probe, list) and len(probe) == 1:\n        depth += 1\n        probe = probe[0]\n    if depth >= 10000:\n        return json.dumps('<skipped: too deep>')\n    pieces: list[str] = []\n    stack: list[object] = [value]\n    while stack:\n        item = stack.pop()\n        if isinstance(item, list):\n            pieces.append('[')\n            if item:\n                stack.append(('close', ']'))\n                for index in range(len(item) - 1, -1, -1):\n                    if index < len(item) - 1:\n                        stack.append(('raw', ','))\n                    stack.append(item[index])\n            else:\n                pieces.append(']')\n        elif isinstance(item, dict):\n            pieces.append('{')\n            entries = list(item.items())\n            if entries:\n                stack.append(('close', '}'))\n                for index in range(len(entries) - 1, -1, -1):\n                    key, child = entries[index]\n                    if index < len(entries) - 1:\n                        stack.append(('raw', ','))\n                    stack.append(child)\n                    stack.append(('raw', ':'))\n                    stack.append(('raw', json.dumps(str(key), ensure_ascii=False)))\n            else:\n                pieces.append('}')\n        elif isinstance(item, tuple) and item[0] == 'raw':\n            pieces.append(item[1])\n        elif isinstance(item, tuple) and item[0] == 'close':\n            pieces.append(item[1])\n        else:\n            if isinstance(item, float) and not math.isfinite(item):\n                if isinstance(item, _OverflowFloat):\n                    pieces.append('1e999999999' if item > 0 else '-1e999999999')\n                else:\n                    pieces.append('null')\n            elif isinstance(item, InputNumber):\n                pieces.append(item.source)\n            elif isinstance(item, float) and item.is_integer():\n                pieces.append(str(int(item)))\n            else:\n                pieces.append(json.dumps(item, separators=(',', ':'), ensure_ascii=False))\n    return ''.join(pieces)\n\n\ndef _deep_json_loads(text: str) -> object:\n    try:\n        parsed = json.loads(text, parse_constant=lambda x: float('nan'))\n        if parsed == '<skipped: too deep>':\n            raise RuntimeError('Exceeds depth limit for parsing')\n        return parsed\n    except RecursionError:\n        if text and set(text) <= {'[', ']'} and text.startswith('['):\n            depth = text.count('[')\n            value: object = []\n            for _ in range(depth - 1):\n                value = [value]\n            return value\n        raise\n\n\ndef _mutation_path_key(path):\n    \"\"\"Sort mutation paths deepest/rightmost first without mixed-type errors.\"\"\"\n    components = []\n    for component in path:\n        if isinstance(component, (int, float)) and not isinstance(component, bool):\n            components.append((0, -float(component)))\n        return {key: _json_output(item) for key, item in value.items()}\n    return value\n\n\ndef main(argv: list[str] | None = None) -> int:\n    arguments = argparse.ArgumentParser(prog=\"jq\")\n    arguments.add_argument(\"-c\", action=\"store_true\")\n    arguments.add_argument(\"program\")\n    options = arguments.parse_args(argv)\n    try:\n        interpreter = Interpreter(options.program)\n    except CompileError as error:\n        return report_compile_error(error)\n    try:\n        for output in interpreter.run(_inputs()):\n            from .evaluator import _deep_json_dumps\n            print(_deep_json_dumps(output), flush=True)\n    except FLOW_RUNTIME_ERRORS + (json.JSONDecodeError,) as error:\n        return report_runtime_error(RuntimeError(str(error)))\n    return 0\n\"\"\"Errors crossing the interpreter's process boundary.\"\"\"\n\n\nclass CompileError(Exception):\n    \"\"\"The jq program could not be parsed or statically validated.\"\"\"\n\n\nclass RuntimeError(Exception):\n    \"\"\"Evaluation failed after the program was compiled.\"\"\"\n\n\n# Runtime failures raised by evaluator helpers must have the same semantics as\n# jq errors when they cross a flow operator.  Keep this tuple shared by the\n# evaluator and the CLI so try/optional do not accidentally miss a Python\n# arithmetic or recursion failure.\nFLOW_RUNTIME_ERRORS = (\n    RuntimeError,\n    ValueError,\n    TypeError,\n    IndexError,\n    ArithmeticError,\n    RecursionError,\n)\n","exit_code":0,"status":"completed"}}
{"type":"item.completed","item":{"id":"item_13","type":"agent_message","text":"Both declared acceptance checks and the existing 156-test suite are green, so this block is structurally present. I’m tightening the implementation for unrepresented edge semantics from the manual and adding focused tests, especially where the current code would silently produce incorrect output rather than fail."}}
{"type":"item.started","item":{"id":"item_14","type":"command_execution","command":"/bin/bash -lc \"sed -n '2075,2120l' jq_interpreter/evaluator.py\"","aggregated_output":"","exit_code":null,"status":"in_progress"}}
{"type":"item.completed","item":{"id":"item_14","type":"command_execution","command":"/bin/bash -lc \"sed -n '2075,2120l' jq_interpreter/evaluator.py\"","aggregated_output":"def _raise_unavailable(name: str) -> float:$\n    raise RuntimeError(f'{name} is not available')$\n$\ndef _stringify(value: object) -> str:$\n    import json$\n    if isinstance(value, InputNumber):$\n        value = float(value)$\n    if isinstance(value, float) and math.isfinite(value) and value.is\\\n_integer():$\n        if abs(value) >= 1e16:$\n            from decimal import Decimal$\n            return format(Decimal(str(value)), '.0f')$\n        return str(int(value))$\n    return value if isinstance(value, str) else json.dumps(value, sep\\\narators=(\",\", \":\"), ensure_ascii=False, allow_nan=False)$\n$\ndef _apply_format(name: str, value: object, template: bool = False) -\\\n> str:$\n    import base64, html, json, urllib.parse$\n    if name == \"text\": return _stringify(value)$\n    if name == \"json\": return json.dumps(value, separators=(\",\", \":\")\\\n, ensure_ascii=False)$\n    if name == \"html\": return html.escape(_stringify(value), quote=Tr\\\nue).replace(\"&#x27;\", \"&apos;\")$\n    if name == \"uri\": return urllib.parse.quote(_stringify(value), sa\\\nfe=\"-_.~\")$\n    if name == \"urid\": return urllib.parse.unquote(_stringify(value))$\n    if name == \"base64\": return base64.b64encode(_stringify(value).en\\\ncode()).decode()$\n    if name == \"base64d\": return base64.b64decode(_stringify(value)).\\\ndecode()$\n    if name == \"csv\": return \",\".join('\"' + str(x).replace('\"', '\"\"')\\\n + '\"' if isinstance(x, str) else _stringify(x) for x in value)$\n    if name == \"tsv\": return \"\\\\t\".join(_stringify(x).replace(\"\\\\\\\\\",\\\n \"\\\\\\\\\\\\\\\\\").replace(\"\\\\n\", \"\\\\\\\\n\").replace(\"\\\\r\", \"\\\\\\\\r\").replace(\\\n\"\\\\t\", \"\\\\\\\\t\") for x in value)$\n    if name == \"sh\": return \"'\" + _stringify(value).replace(\"'\", \"'\\\\\\\n\\\\''\") + \"'\"$\n    raise RuntimeError(f\"unknown format @{name}\")$\n","exit_code":0,"status":"completed"}}
{"type":"item.started","item":{"id":"item_15","type":"file_change","changes":[{"path":"/mnt/c/Users/barlo/projects/drydock/uat/jq/runs/20260822.044627/build/jq/jq_interpreter/evaluator.py","kind":"update"}],"status":"in_progress"}}
{"type":"item.completed","item":{"id":"item_15","type":"file_change","changes":[{"path":"/mnt/c/Users/barlo/projects/drydock/uat/jq/runs/20260822.044627/build/jq/jq_interpreter/evaluator.py","kind":"update"}],"status":"completed"}}
{"type":"item.started","item":{"id":"item_16","type":"command_execution","command":"/bin/bash -lc 'git diff -- jq_interpreter/evaluator.py && git status --short'","aggregated_output":"","exit_code":null,"status":"in_progress"}}
{"type":"item.started","item":{"id":"item_17","type":"command_execution","command":"/bin/bash -lc \"set -o pipefail\nfor spec in \\\\\n  '[@csv] :: [null,false,true,1,\\\"a,b\\\",\\\"a\\\\\\\"b\\\"]' \\\\\n  '[@tsv] :: [null,\\\"a\\\\\\\\b\\\\nc\\\\td\\\"]' \\\\\n  '@sh :: [\\\"a\\\",\\\"O'\\\"'\\\"'Hara\\\",1,null]' \\\\\n  '@json :: {a: nan, b: 1E+1000}' \\\\\n  '@text :: 123456789012345678901234567890'; do\n  p=\"'${spec%% :: *}; v=${spec#* :: }; printf '\"'%s => ' \\\"\"'$p\"; printf '\"'%s\\\\n' \\\"\"'$v\" | ./jq -c \"$p\"; done\nprintf '\"'base64d invalid rc: '; printf '\\\"%%%s\\\"\\\\n' 'not' | ./jq -c '@base64d' >/dev/null; echo \"'$?'","aggregated_output":"","exit_code":null,"status":"in_progress"}}
{"type":"item.completed","item":{"id":"item_17","type":"command_execution","command":"/bin/bash -lc \"set -o pipefail\nfor spec in \\\\\n  '[@csv] :: [null,false,true,1,\\\"a,b\\\",\\\"a\\\\\\\"b\\\"]' \\\\\n  '[@tsv] :: [null,\\\"a\\\\\\\\b\\\\nc\\\\td\\\"]' \\\\\n  '@sh :: [\\\"a\\\",\\\"O'\\\"'\\\"'Hara\\\",1,null]' \\\\\n  '@json :: {a: nan, b: 1E+1000}' \\\\\n  '@text :: 123456789012345678901234567890'; do\n  p=\"'${spec%% :: *}; v=${spec#* :: }; printf '\"'%s => ' \\\"\"'$p\"; printf '\"'%s\\\\n' \\\"\"'$v\" | ./jq -c \"$p\"; done\nprintf '\"'base64d invalid rc: '; printf '\\\"%%%s\\\"\\\\n' 'not' | ./jq -c '@base64d' >/dev/null; echo \"'$?'","aggregated_output":"[\",false,true,1,\\\"a,b\\\",\\\"a\\\"\\\"b\\\"\"]\n[@tsv] => [\"\\ta\\\\\\\\b\\\\nc\\\\td\"]\n@sh => \"'a' 'O'\\\\''Hara' '1' ''\"\n@json => jq: runtime error: Expecting property name enclosed in double quotes: line 1 column 2 (char 1)\n@text => \"123456789012345678901234567890\"\nbase64d invalid rc: jq: runtime error: invalid base64 data\n5\n","exit_code":0,"status":"completed"}}
{"type":"item.completed","item":{"id":"item_16","type":"command_execution","command":"/bin/bash -lc 'git diff -- jq_interpreter/evaluator.py && git status --short'","aggregated_output":" M jq_interpreter/cli.py\n M jq_interpreter/errors.py\n M jq_interpreter/evaluator.py\n M jq_interpreter/interpreter.py\n M jq_interpreter/parser.py\n M jq_interpreter/runtime.py\n M ../../evidence/commands/07-after-plan-target-status.stdout.log\n D ../../evidence/commands/10-initial-build-1.llm.log\n M ../../evidence/commands/10-initial-build-1.stderr.log\n M ../../evidence/commands/10-initial-build-1.stdout.log\n D ../../evidence/commands/11-after-initial-build-build-status.stderr.log\n D ../../evidence/commands/11-after-initial-build-build-status.stdout.log\n D ../../evidence/commands/12-after-initial-build-target-status.stderr.log\n D ../../evidence/commands/12-after-initial-build-target-status.stdout.log\n D ../../evidence/commands/13-after-initial-build-workspace-status.stderr.log\n D ../../evidence/commands/13-after-initial-build-workspace-status.stdout.log\n M ../../workspace/logs/history.jsonl\n D ../../workspace/targets/jq/ERRORS.md\n M ../../workspace/targets/jq/MANIFEST.md\n M ../../workspace/targets/jq/PROJECT_STATUS.jsonl\n M ../../workspace/targets/jq/QuarterDeck/commanders_chair.html\n D ../../workspace/targets/jq/STOP_NOW.md\n M ../../workspace/targets/jq/evidence/block-8.md\n M ../../workspace/targets/jq/evidence/prepassed-acceptance.json\n?? tests/test_core_002_composition.py\n?? tests/test_core_003_errors.py\n?? tests/test_core_004_truthiness_comparison.py\n?? tests/test_data_002_sorting.py\n?? tests/test_data_003_entries_containment.py\n?? tests/test_flow_001_operators.py\n?? tests/test_flow_002_boolean_alternative.py\n?? tests/test_flow_003_conditionals_exceptions.py\n?? tests/test_flow_004_labels_breaks.py\n?? tests/test_flow_005_reductions_iteration.py\n?? tests/test_flow_006_recursive_generators.py\n?? tests/test_func_002_parameters.py\n?? tests/test_path_001_discovery_projection.py\n?? tests/test_path_002_access_mutation.py\n?? tests/test_service_lexical_bindings.py\n?? tests/test_stream_evaluator.py\n?? tests/test_text_001_string_builtins.py\n?? tests/test_value_001.py\n?? tests/test_value_002_access.py\n?? tests/test_value_003_slices_iteration.py\n?? tests/test_value_004.py\n?? ../../evidence/commands/superseded/20260822.234907/\n?? ../../workspace/logs/20260822.234907.752Z_verify_plan_codex.log\n?? ../../workspace/logs/20260822.234909.429Z_jq_build.log\n?? ../../workspace/logs/20260822.234913.457Z_jq_status.log\n?? ../../workspace/logs/20260822.234914.626Z_status.log\n?? ../../workspace/logs/20260822.234915.081Z_jq_status.log\n?? ../../workspace/logs/20260822.234915.446Z_jq_build_codex.log\n?? ../../workspace/logs/20260822.235339.932Z_jq_build_codex.llm.log\n?? ../../workspace/logs/20260822.235339.932Z_jq_build_codex.output.txt\n?? ../../workspace/logs/20260822.235339.932Z_jq_build_codex.prompt.md\n?? ../../workspace/logs/20260822.235339.932Z_jq_build_codex.raw.jsonl\n?? ../../workspace/logs/20260822.235339.932Z_jq_build_codex.stderr.log\n?? ../../workspace/logs/20260823.000143.358Z_jq_build_codex.llm.log\n?? ../../workspace/logs/20260823.000143.358Z_jq_build_codex.output.txt\n?? ../../workspace/logs/20260823.000143.358Z_jq_build_codex.prompt.md\n?? ../../workspace/logs/20260823.000143.358Z_jq_build_codex.raw.jsonl\n?? ../../workspace/logs/20260823.000143.358Z_jq_build_codex.stderr.log\n?? ../../workspace/logs/20260823.001232.569Z_jq_build_codex.llm.log\n?? ../../workspace/logs/20260823.001232.569Z_jq_build_codex.output.txt\n?? ../../workspace/logs/20260823.001232.569Z_jq_build_codex.prompt.md\n?? ../../workspace/logs/20260823.001232.569Z_jq_build_codex.raw.jsonl\n?? ../../workspace/logs/20260823.001232.569Z_jq_build_codex.stderr.log\n?? ../../workspace/logs/20260823.002204.979Z_jq_build_codex.llm.log\n?? ../../workspace/logs/20260823.002204.979Z_jq_build_codex.output.txt\n?? ../../workspace/logs/20260823.002204.979Z_jq_build_codex.prompt.md\n?? ../../workspace/logs/20260823.002204.979Z_jq_build_codex.raw.jsonl\n?? ../../workspace/logs/20260823.003038.923Z_jq_build_codex.llm.log\n?? ../../workspace/logs/20260823.003038.923Z_jq_build_codex.output.txt\n?? ../../workspace/logs/20260823.003038.923Z_jq_build_codex.prompt.md\n?? ../../workspace/logs/20260823.003038.923Z_jq_build_codex.raw.jsonl\n?? ../../workspace/logs/20260823.003038.923Z_jq_build_codex.stderr.log\n?? ../../workspace/logs/20260823.004037.072Z_jq_build_codex.llm.log\n?? ../../workspace/logs/20260823.004037.072Z_jq_build_codex.output.txt\n?? ../../workspace/logs/20260823.004037.072Z_jq_build_codex.prompt.md\n?? ../../workspace/logs/20260823.004037.072Z_jq_build_codex.raw.jsonl\n?? ../../workspace/logs/20260823.004037.072Z_jq_build_codex.stderr.log\n?? ../../workspace/logs/20260823.005049.805Z_jq_build_codex.llm.log\n?? ../../workspace/logs/20260823.005049.805Z_jq_build_codex.output.txt\n?? ../../workspace/logs/20260823.005049.805Z_jq_build_codex.prompt.md\n?? ../../workspace/logs/20260823.005049.805Z_jq_build_codex.raw.jsonl\n?? ../../workspace/logs/20260823.005903.917Z_jq_build_codex.llm.log\n?? ../../workspace/logs/20260823.005903.917Z_jq_build_codex.output.txt\n?? ../../workspace/logs/20260823.005903.917Z_jq_build_codex.prompt.md\n?? ../../workspace/logs/20260823.005903.917Z_jq_build_codex.raw.jsonl\n?? ../../workspace/logs/20260823.005903.917Z_jq_build_codex.stderr.log\n?? ../../workspace/logs/20260823.010841.589Z_jq_build_codex.llm.log\n?? ../../workspace/logs/20260823.010841.589Z_jq_build_codex.output.txt\n?? ../../workspace/logs/20260823.010841.589Z_jq_build_codex.prompt.md\n?? ../../workspace/logs/20260823.010841.589Z_jq_build_codex.raw.jsonl\n?? ../../workspace/logs/20260823.010841.589Z_jq_build_codex.stderr.log\n?? ../../workspace/logs/20260823.011808.307Z_jq_build_codex.llm.log\n?? ../../workspace/logs/20260823.011808.307Z_jq_build_codex.output.txt\n?? ../../workspace/logs/20260823.011808.307Z_jq_build_codex.prompt.md\n?? ../../workspace/logs/20260823.011808.307Z_jq_build_codex.raw.jsonl\n?? ../../workspace/logs/20260823.011808.307Z_jq_build_codex.stderr.log\n?? ../../workspace/logs/20260823.013010.037Z_jq_build_codex.llm.log\n?? ../../workspace/logs/20260823.013010.037Z_jq_build_codex.output.txt\n?? ../../workspace/logs/20260823.013010.037Z_jq_build_codex.prompt.md\n?? ../../workspace/logs/20260823.013010.037Z_jq_build_codex.raw.jsonl\n?? ../../workspace/logs/20260823.013010.037Z_jq_build_codex.stderr.log\n?? ../../workspace/logs/20260823.014128.073Z_jq_build_codex.llm.log\n?? ../../workspace/logs/20260823.014128.073Z_jq_build_codex.output.txt\n?? ../../workspace/logs/20260823.014128.073Z_jq_build_codex.prompt.md\n?? ../../workspace/logs/20260823.014128.073Z_jq_build_codex.raw.jsonl\n?? ../../workspace/logs/20260823.014128.073Z_jq_build_codex.stderr.log\n?? ../../workspace/logs/20260823.015653.931Z_jq_build_codex.llm.log\n?? ../../workspace/logs/20260823.015653.931Z_jq_build_codex.output.txt\n?? ../../workspace/logs/20260823.015653.931Z_jq_build_codex.prompt.md\n?? ../../workspace/logs/20260823.015653.931Z_jq_build_codex.raw.jsonl\n?? ../../workspace/logs/20260823.015653.931Z_jq_build_codex.stderr.log\n?? ../../workspace/logs/20260823.020504.857Z_jq_build_codex.llm.log\n?? ../../workspace/logs/20260823.020504.857Z_jq_build_codex.output.txt\n?? ../../workspace/logs/20260823.020504.857Z_jq_build_codex.prompt.md\n?? ../../workspace/logs/20260823.020504.857Z_jq_build_codex.raw.jsonl\n?? ../../workspace/logs/20260823.020504.857Z_jq_build_codex.stderr.log\n?? ../../workspace/logs/20260823.021651.942Z_jq_build_codex.llm.log\n?? ../../workspace/logs/20260823.021651.942Z_jq_build_codex.output.txt\n?? ../../workspace/logs/20260823.021651.942Z_jq_build_codex.prompt.md\n?? ../../workspace/logs/20260823.021651.942Z_jq_build_codex.raw.jsonl\n?? ../../workspace/logs/20260823.022052.850Z_jq_build_codex.llm.log\n?? ../../workspace/logs/20260823.022052.850Z_jq_build_codex.output.txt\n?? ../../workspace/logs/20260823.022052.850Z_jq_build_codex.prompt.md\n?? ../../workspace/logs/20260823.022052.850Z_jq_build_codex.raw.jsonl\n?? ../../workspace/logs/20260823.022510.696Z_jq_build_codex.llm.log\n?? ../../workspace/logs/20260823.022510.696Z_jq_build_codex.output.txt\n?? ../../workspace/logs/20260823.022510.696Z_jq_build_codex.prompt.md\n?? ../../workspace/logs/20260823.022510.696Z_jq_build_codex.raw.jsonl\n?? ../../workspace/logs/20260823.022843.056Z_jq_build_codex.llm.log\n?? ../../workspace/logs/20260823.022843.056Z_jq_build_codex.output.txt\n?? ../../workspace/logs/20260823.022843.056Z_jq_build_codex.prompt.md\n?? ../../workspace/logs/20260823.022843.056Z_jq_build_codex.raw.jsonl\n?? ../../workspace/logs/20260823.023237.129Z_jq_build_codex.llm.log\n?? ../../workspace/logs/20260823.023237.129Z_jq_build_codex.output.txt\n?? ../../workspace/logs/20260823.023237.129Z_jq_build_codex.prompt.md\n?? ../../workspace/logs/20260823.023237.129Z_jq_build_codex.raw.jsonl\n?? ../../workspace/logs/20260823.023629.826Z_jq_build_codex.llm.log\n?? ../../workspace/logs/20260823.023629.826Z_jq_build_codex.output.txt\n?? ../../workspace/logs/20260823.023629.826Z_jq_build_codex.prompt.md\n?? ../../workspace/logs/20260823.023629.826Z_jq_build_codex.raw.jsonl\n?? ../../workspace/logs/20260823.024036.322Z_jq_build_codex.llm.log\n?? ../../workspace/logs/20260823.024036.322Z_jq_build_codex.output.txt\n?? ../../workspace/logs/20260823.024036.322Z_jq_build_codex.prompt.md\n?? ../../workspace/logs/20260823.024036.322Z_jq_build_codex.raw.jsonl\n?? ../../workspace/logs/20260823.024538.026Z_jq_build_codex.llm.log\n?? ../../workspace/logs/20260823.024538.026Z_jq_build_codex.output.txt\n?? ../../workspace/logs/20260823.024538.026Z_jq_build_codex.prompt.md\n?? ../../workspace/logs/20260823.024538.026Z_jq_build_codex.raw.jsonl\n?? ../../workspace/logs/20260823.025144.476Z_jq_build_codex.llm.log\n?? ../../workspace/logs/20260823.025144.476Z_jq_build_codex.output.txt\n?? ../../workspace/logs/20260823.025144.476Z_jq_build_codex.prompt.md\n?? ../../workspace/logs/20260823.025144.476Z_jq_build_codex.raw.jsonl\n?? ../../workspace/logs/20260823.025726.811Z_jq_build_codex.llm.log\n?? ../../workspace/logs/20260823.025726.811Z_jq_build_codex.output.txt\n?? ../../workspace/logs/20260823.025726.811Z_jq_build_codex.prompt.md\n?? ../../workspace/logs/20260823.025726.811Z_jq_build_codex.raw.jsonl\n?? ../../workspace/logs/20260823.030233.466Z_jq_build_codex.llm.log\n?? ../../workspace/logs/20260823.030233.466Z_jq_build_codex.output.txt\n?? ../../workspace/logs/20260823.030233.466Z_jq_build_codex.prompt.md\n?? ../../workspace/logs/20260823.030233.466Z_jq_build_codex.raw.jsonl\n?? ../../workspace/logs/20260823.030840.777Z_jq_build_codex.llm.log\n?? ../../workspace/logs/20260823.030840.777Z_jq_build_codex.output.txt\n?? ../../workspace/logs/20260823.030840.777Z_jq_build_codex.prompt.md\n?? ../../workspace/logs/20260823.030840.777Z_jq_build_codex.raw.jsonl\n?? ../../workspace/logs/20260823.030840.777Z_jq_build_codex.stderr.log\n?? ../../workspace/logs/20260823.031407.736Z_jq_build_codex.llm.log\n?? ../../workspace/logs/20260823.031407.736Z_jq_build_codex.output.txt\n?? ../../workspace/logs/20260823.031407.736Z_jq_build_codex.prompt.md\n?? ../../workspace/logs/20260823.031407.736Z_jq_build_codex.raw.jsonl\n?? ../../workspace/logs/20260823.032028.932Z_jq_build_codex.llm.log\n?? ../../workspace/logs/20260823.032028.932Z_jq_build_codex.output.txt\n?? ../../workspace/logs/20260823.032028.932Z_jq_build_codex.prompt.md\n?? ../../workspace/logs/20260823.032028.932Z_jq_build_codex.raw.jsonl\n?? ../../workspace/logs/20260823.032616.141Z_jq_build_codex.llm.log\n?? ../../workspace/logs/20260823.032616.141Z_jq_build_codex.output.txt\n?? ../../workspace/logs/20260823.032616.141Z_jq_build_codex.prompt.md\n?? ../../workspace/logs/20260823.032616.141Z_jq_build_codex.raw.jsonl\n?? ../../workspace/logs/20260823.033302.960Z_jq_build_codex.llm.log\n?? ../../workspace/logs/20260823.033302.960Z_jq_build_codex.output.txt\n?? ../../workspace/logs/20260823.033302.960Z_jq_build_codex.prompt.md\n?? ../../workspace/logs/20260823.033302.960Z_jq_build_codex.raw.jsonl\n?? ../../workspace/logs/20260823.033302.960Z_jq_build_codex.stderr.log\n?? ../../workspace/logs/20260823.033926.906Z_jq_build_codex.llm.log\n?? ../../workspace/logs/20260823.033926.906Z_jq_build_codex.output.txt\n?? ../../workspace/logs/20260823.033926.906Z_jq_build_codex.prompt.md\n?? ../../workspace/logs/20260823.033926.906Z_jq_build_codex.raw.jsonl\n?? ../../workspace/logs/20260823.034534.124Z_jq_build_codex.llm.log\n?? ../../workspace/logs/20260823.034534.124Z_jq_build_codex.output.txt\n?? ../../workspace/logs/20260823.034534.124Z_jq_build_codex.prompt.md\n?? ../../workspace/logs/20260823.034534.124Z_jq_build_codex.raw.jsonl\n?? ../../workspace/logs/20260823.035101.009Z_jq_build_codex.llm.log\n?? ../../workspace/logs/20260823.035101.009Z_jq_build_codex.output.txt\n?? ../../workspace/logs/20260823.035101.009Z_jq_build_codex.prompt.md\n?? ../../workspace/logs/20260823.035101.009Z_jq_build_codex.raw.jsonl\n?? ../../workspace/logs/20260823.035649.869Z_jq_build_codex.llm.log\n?? ../../workspace/logs/20260823.035649.869Z_jq_build_codex.output.txt\n?? ../../workspace/logs/20260823.035649.869Z_jq_build_codex.prompt.md\n?? ../../workspace/logs/20260823.035649.869Z_jq_build_codex.raw.jsonl\n?? ../../workspace/logs/20260823.035649.869Z_jq_build_codex.stderr.log\n?? ../../workspace/logs/20260823.040344.251Z_jq_build_codex.llm.log\n?? ../../workspace/logs/20260823.040344.251Z_jq_build_codex.output.txt\n?? ../../workspace/logs/20260823.040344.251Z_jq_build_codex.prompt.md\n?? ../../workspace/logs/20260823.040344.251Z_jq_build_codex.raw.jsonl\n?? ../../workspace/logs/20260823.041112.257Z_jq_build_codex.llm.log\n?? ../../workspace/logs/20260823.041112.257Z_jq_build_codex.output.txt\n?? ../../workspace/logs/20260823.041112.257Z_jq_build_codex.prompt.md\n?? ../../workspace/logs/20260823.041112.257Z_jq_build_codex.raw.jsonl\n?? ../../workspace/logs/20260823.041750.880Z_jq_build_codex.llm.log\n?? ../../workspace/logs/20260823.041750.880Z_jq_build_codex.output.txt\n?? ../../workspace/logs/20260823.041750.880Z_jq_build_codex.prompt.md\n?? ../../workspace/logs/20260823.041750.880Z_jq_build_codex.raw.jsonl\n?? ../../workspace/logs/20260823.042455.513Z_jq_build_codex.llm.log\n?? ../../workspace/logs/20260823.042455.513Z_jq_build_codex.output.txt\n?? ../../workspace/logs/20260823.042455.513Z_jq_build_codex.prompt.md\n?? ../../workspace/logs/20260823.042455.513Z_jq_build_codex.raw.jsonl\n?? ../../workspace/logs/20260823.043147.349Z_jq_build_codex.llm.log\n?? ../../workspace/logs/20260823.043147.349Z_jq_build_codex.output.txt\n?? ../../workspace/logs/20260823.043147.349Z_jq_build_codex.prompt.md\n?? ../../workspace/logs/20260823.043147.349Z_jq_build_codex.raw.jsonl\n?? ../../workspace/logs/20260823.043810.706Z_jq_build_codex.llm.log\n?? ../../workspace/logs/20260823.043810.706Z_jq_build_codex.output.txt\n?? ../../workspace/logs/20260823.043810.706Z_jq_build_codex.prompt.md\n?? ../../workspace/logs/20260823.043810.706Z_jq_build_codex.raw.jsonl\n?? ../../workspace/logs/20260823.044517.300Z_jq_build_codex.llm.log\n?? ../../workspace/logs/20260823.044517.300Z_jq_build_codex.output.txt\n?? ../../workspace/logs/20260823.044517.300Z_jq_build_codex.prompt.md\n?? ../../workspace/logs/20260823.044517.300Z_jq_build_codex.raw.jsonl\n?? ../../workspace/logs/20260823.045149.005Z_jq_build_codex.llm.log\n?? ../../workspace/logs/20260823.045149.005Z_jq_build_codex.output.txt\n?? ../../workspace/logs/20260823.045149.005Z_jq_build_codex.prompt.md\n?? ../../workspace/logs/20260823.045149.005Z_jq_build_codex.raw.jsonl\n?? ../../workspace/logs/20260823.045149.005Z_jq_build_codex.stderr.log\n?? ../../workspace/logs/20260823.045829.748Z_jq_build_codex.prompt.md\n?? ../../workspace/logs/20260823.045829.748Z_jq_build_codex.raw.jsonl\n?? ../../workspace/logs/20260823.045829.748Z_jq_build_codex.stderr.log\n?? ../../workspace/targets/jq/evidence/block-10.md\n?? ../../workspace/targets/jq/evidence/block-11.md\n?? ../../workspace/targets/jq/evidence/block-12.md\n?? ../../workspace/targets/jq/evidence/block-13.md\n?? ../../workspace/targets/jq/evidence/block-14.md\n?? ../../workspace/targets/jq/evidence/block-15.md\n?? ../../workspace/targets/jq/evidence/block-16.md\n?? ../../workspace/targets/jq/evidence/block-17.md\n?? ../../workspace/targets/jq/evidence/block-18.md\n?? ../../workspace/targets/jq/evidence/block-19.md\n?? ../../workspace/targets/jq/evidence/block-20.md\n?? ../../workspace/targets/jq/evidence/block-21.md\n?? ../../workspace/targets/jq/evidence/block-22.md\n?? ../../workspace/targets/jq/evidence/block-23.md\n?? ../../workspace/targets/jq/evidence/block-24.md\n?? ../../workspace/targets/jq/evidence/block-25.md\n?? ../../workspace/targets/jq/evidence/block-26.md\n?? ../../workspace/targets/jq/evidence/block-27.md\n?? ../../workspace/targets/jq/evidence/block-28.md\n?? ../../workspace/targets/jq/evidence/block-29.md\n?? ../../workspace/targets/jq/evidence/block-30.md\n?? ../../workspace/targets/jq/evidence/block-31.md\n?? ../../workspace/targets/jq/evidence/block-32.md\n?? ../../workspace/targets/jq/evidence/block-33.md\n?? ../../workspace/targets/jq/evidence/block-34.md\n?? ../../workspace/targets/jq/evidence/block-35.md\n?? ../../workspace/targets/jq/evidence/block-9.md\n","exit_code":0,"status":"completed"}}
{"type":"item.started","item":{"id":"item_18","type":"file_change","changes":[{"path":"/mnt/c/Users/barlo/projects/drydock/uat/jq/runs/20260822.044627/build/jq/tests/test_text_002_formats.py","kind":"add"}],"status":"in_progress"}}
{"type":"item.completed","item":{"id":"item_18","type":"file_change","changes":[{"path":"/mnt/c/Users/barlo/projects/drydock/uat/jq/runs/20260822.044627/build/jq/tests/test_text_002_formats.py","kind":"add"}],"status":"completed"}}
{"type":"item.started","item":{"id":"item_19","type":"command_execution","command":"/bin/bash -lc 'python3 -m pytest -q'","aggregated_output":"","exit_code":null,"status":"in_progress"}}
{"type":"item.started","item":{"id":"item_20","type":"command_execution","command":"/bin/bash -lc 'python3 -m pytest -q tests/test_text_002_formats.py'","aggregated_output":"","exit_code":null,"status":"in_progress"}}
{"type":"item.completed","item":{"id":"item_20","type":"command_execution","command":"/bin/bash -lc 'python3 -m pytest -q tests/test_text_002_formats.py'","aggregated_output":"......                                                                   [100%]\n6 passed in 2.55s\n","exit_code":0,"status":"completed"}}
{"type":"item.completed","item":{"id":"item_19","type":"command_execution","command":"/bin/bash -lc 'python3 -m pytest -q'","aggregated_output":"........................................................................ [ 44%]\n........................................................................ [ 88%]\n..................                                                       [100%]\n162 passed in 29.13s\n","exit_code":0,"status":"completed"}}
{"type":"item.completed","item":{"id":"item_21","type":"agent_message","text":"The focused tests now cover all declared format families, interpolation, null/control-character boundaries, shell arrays, Unicode Base64, and runtime failure signaling; all 162 project tests pass. I’m rerunning the two exact acceptance invocations after the implementation change."}}
{"type":"item.started","item":{"id":"item_22","type":"command_execution","command":"/bin/bash -lc \"python3 - <<'PY'\nimport json, os, subprocess, sys\nSELECT = r\\\"@text|@json|@html|@uri|@urid|@csv|@tsv|@sh|@base64|@base64d|tojson|fromjson|tostring\\\"\nresult = subprocess.run([sys.executable, \\\"sources/run_conformance.py\\\", \\\"--select\\\", SELECT, \\\"--json\\\"], capture_output=True, text=True, env={**os.environ, \\\"JQ\\\": f\\\"{os.getcwd()}/jq\\\"})\nprint(result.stdout)\nprint(result.stderr, file=sys.stderr)\nreport = json.loads(result.stdout); summary = report[\\\"summary\\\"]\nassert sum(summary.values()) > 0\nassert summary[\\\"fail\\\"] == 0 and summary[\\\"error\\\"] == 0\nassert result.returncode == 0\nPY\"","aggregated_output":"","exit_code":null,"status":"in_progress"}}
{"type":"item.started","item":{"id":"item_23","type":"command_execution","command":"/bin/bash -lc \"python3 - <<'PY'\nimport json, os, subprocess, sys\nSELECT = r\\\"@html|@uri|@base64|@csv|@tsv|@sh\\\"\nresult = subprocess.run([sys.executable, \\\"sources/run_conformance.py\\\", \\\"--select\\\", SELECT, \\\"--json\\\"], capture_output=True, text=True, env={**os.environ, \\\"JQ\\\": f\\\"{os.getcwd()}/jq\\\"})\nprint(result.stdout)\nprint(result.stderr, file=sys.stderr)\nreport = json.loads(result.stdout); summary = report[\\\"summary\\\"]\nassert sum(summary.values()) > 0\nassert summary[\\\"fail\\\"] == 0 and summary[\\\"error\\\"] == 0\nassert result.returncode == 0\nPY\"","aggregated_output":"","exit_code":null,"status":"in_progress"}}
{"type":"item.started","item":{"id":"item_24","type":"command_execution","command":"/bin/bash -lc 'git diff --stat -- jq_interpreter/evaluator.py tests/test_text_002_formats.py && git diff --check -- jq_interpreter/evaluator.py tests/test_text_002_formats.py'","aggregated_output":"","exit_code":null,"status":"in_progress"}}
{"type":"item.completed","item":{"id":"item_24","type":"command_execution","command":"/bin/bash -lc 'git diff --stat -- jq_interpreter/evaluator.py tests/test_text_002_formats.py && git diff --check -- jq_interpreter/evaluator.py tests/test_text_002_formats.py'","aggregated_output":" .../build/jq/jq_interpreter/evaluator.py           | 1621 +++++++++++++++++---\n 1 file changed, 1439 insertions(+), 182 deletions(-)\n","exit_code":0,"status":"completed"}}
{"type":"item.completed","item":{"id":"item_23","type":"command_execution","command":"/bin/bash -lc \"python3 - <<'PY'\nimport json, os, subprocess, sys\nSELECT = r\\\"@html|@uri|@base64|@csv|@tsv|@sh\\\"\nresult = subprocess.run([sys.executable, \\\"sources/run_conformance.py\\\", \\\"--select\\\", SELECT, \\\"--json\\\"], capture_output=True, text=True, env={**os.environ, \\\"JQ\\\": f\\\"{os.getcwd()}/jq\\\"})\nprint(result.stdout)\nprint(result.stderr, file=sys.stderr)\nreport = json.loads(result.stdout); summary = report[\\\"summary\\\"]\nassert sum(summary.values()) > 0\nassert summary[\\\"fail\\\"] == 0 and summary[\\\"error\\\"] == 0\nassert result.returncode == 0\nPY\"","aggregated_output":"\n{\n  \"candidate\": [\n    \"/mnt/c/Users/barlo/projects/drydock/uat/jq/runs/20260822.044627/build/jq/jq\"\n  ],\n  \"corpus\": \"jq.test\",\n  \"summary\": {\n    \"pass\": 7,\n    \"fail\": 0,\n    \"error\": 0,\n    \"skip\": 0\n  },\n  \"cases\": []\n}\n\n","exit_code":0,"status":"completed"}}
{"type":"item.completed","item":{"id":"item_22","type":"command_execution","command":"/bin/bash -lc \"python3 - <<'PY'\nimport json, os, subprocess, sys\nSELECT = r\\\"@text|@json|@html|@uri|@urid|@csv|@tsv|@sh|@base64|@base64d|tojson|fromjson|tostring\\\"\nresult = subprocess.run([sys.executable, \\\"sources/run_conformance.py\\\", \\\"--select\\\", SELECT, \\\"--json\\\"], capture_output=True, text=True, env={**os.environ, \\\"JQ\\\": f\\\"{os.getcwd()}/jq\\\"})\nprint(result.stdout)\nprint(result.stderr, file=sys.stderr)\nreport = json.loads(result.stdout); summary = report[\\\"summary\\\"]\nassert sum(summary.values()) > 0\nassert summary[\\\"fail\\\"] == 0 and summary[\\\"error\\\"] == 0\nassert result.returncode == 0\nPY\"","aggregated_output":"\nTraceback (most recent call last):\n  File \"<stdin>\", line 8, in <module>\nAssertionError\n{\n  \"candidate\": [\n    \"/mnt/c/Users/barlo/projects/drydock/uat/jq/runs/20260822.044627/build/jq/jq\"\n  ],\n  \"corpus\": \"jq.test\",\n  \"summary\": {\n    \"pass\": 24,\n    \"fail\": 1,\n    \"error\": 0,\n    \"skip\": 0\n  },\n  \"cases\": [\n    {\n      \"line\": 2196,\n      \"program\": \".[0] | tostring | . == if have_decnum then \\\"13911860366432393\\\" else \\\"13911860366432392\\\" end\",\n      \"status\": \"fail\",\n      \"detail\": \"output mismatch\",\n      \"expect_failure\": false,\n      \"expected\": [\n        \"true\"\n      ],\n      \"actual\": [\n        \"false\"\n      ]\n    }\n  ]\n}\n\n","exit_code":1,"status":"failed"}}
{"type":"item.started","item":{"id":"item_25","type":"file_change","changes":[{"path":"/mnt/c/Users/barlo/projects/drydock/uat/jq/runs/20260822.044627/build/jq/jq_interpreter/evaluator.py","kind":"update"}],"status":"in_progress"}}
{"type":"item.completed","item":{"id":"item_25","type":"file_change","changes":[{"path":"/mnt/c/Users/barlo/projects/drydock/uat/jq/runs/20260822.044627/build/jq/jq_interpreter/evaluator.py","kind":"update"}],"status":"completed"}}
{"type":"item.started","item":{"id":"item_26","type":"command_execution","command":"/bin/bash -lc 'python3 -m pytest -q'","aggregated_output":"","exit_code":null,"status":"in_progress"}}
{"type":"item.started","item":{"id":"item_27","type":"command_execution","command":"/bin/bash -lc \"python3 - <<'PY'\nimport json, os, subprocess, sys\nfor SELECT in (r\\\"@text|@json|@html|@uri|@urid|@csv|@tsv|@sh|@base64|@base64d|tojson|fromjson|tostring\\\", r\\\"@html|@uri|@base64|@csv|@tsv|@sh\\\"):\n result=subprocess.run([sys.executable,'sources/run_conformance.py','--select',SELECT,'--json'],capture_output=True,text=True,env={**os.environ,'JQ':f'{os.getcwd()}/jq'})\n print(result.stdout); print(result.stderr,file=sys.stderr)\n report=json.loads(result.stdout); summary=report['summary']; assert sum(summary.values())>0; assert summary['fail']==0 and summary['error']==0; assert result.returncode==0\nPY\"","aggregated_output":"","exit_code":null,"status":"in_progress"}}
{"type":"item.completed","item":{"id":"item_27","type":"command_execution","command":"/bin/bash -lc \"python3 - <<'PY'\nimport json, os, subprocess, sys\nfor SELECT in (r\\\"@text|@json|@html|@uri|@urid|@csv|@tsv|@sh|@base64|@base64d|tojson|fromjson|tostring\\\", r\\\"@html|@uri|@base64|@csv|@tsv|@sh\\\"):\n result=subprocess.run([sys.executable,'sources/run_conformance.py','--select',SELECT,'--json'],capture_output=True,text=True,env={**os.environ,'JQ':f'{os.getcwd()}/jq'})\n print(result.stdout); print(result.stderr,file=sys.stderr)\n report=json.loads(result.stdout); summary=report['summary']; assert sum(summary.values())>0; assert summary['fail']==0 and summary['error']==0; assert result.returncode==0\nPY\"","aggregated_output":"\n{\n  \"candidate\": [\n    \"/mnt/c/Users/barlo/projects/drydock/uat/jq/runs/20260822.044627/build/jq/jq\"\n  ],\n  \"corpus\": \"jq.test\",\n  \"summary\": {\n    \"pass\": 25,\n    \"fail\": 0,\n    \"error\": 0,\n    \"skip\": 0\n  },\n  \"cases\": []\n}\n\n\n{\n  \"candidate\": [\n    \"/mnt/c/Users/barlo/projects/drydock/uat/jq/runs/20260822.044627/build/jq/jq\"\n  ],\n  \"corpus\": \"jq.test\",\n  \"summary\": {\n    \"pass\": 7,\n    \"fail\": 0,\n    \"error\": 0,\n    \"skip\": 0\n  },\n  \"cases\": []\n}\n\n","exit_code":0,"status":"completed"}}
{"type":"item.completed","item":{"id":"item_26","type":"command_execution","command":"/bin/bash -lc 'python3 -m pytest -q'","aggregated_output":"........................................................................ [ 44%]\n........................................................................ [ 88%]\n..................                                                       [100%]\n162 passed in 17.14s\n","exit_code":0,"status":"completed"}}
{"type":"item.completed","item":{"id":"item_28","type":"agent_message","text":"RESULT: SUCCESS\n\nFILES CHANGED:\n- jq_interpreter/evaluator.py\n- tests/test_text_002_formats.py\n\nSUMMARY:\nImplemented JSON conversion and text, HTML, URI, CSV, TSV, shell, and Base64 filters with escaping and validation semantics.\n\nVerification:\n- Scoped conformance: 25 passed, 0 failed\n- Format conformance: 7 passed, 0 failed\n- Pytest: 162 passed\n\nBLOCKERS:\n- None"}}
{"type":"turn.completed","usage":{"input_tokens":1550490,"cached_input_tokens":1439744,"cache_write_input_tokens":0,"output_tokens":8019,"reasoning_output_tokens":1742}}
