Drydock 0.2.0 Copyright (c) 2026 Web Cloud Studio. All rights reserved.
Build: jq
scope: entire project
frontier: architecture
LLM BUILD: Block 1 · Foundational [block-1]
stories: Define the standalone interpreter architecture and module boundaries. [architecture]
call: 1 of up to 7 · initial build · codex/gpt-5.6-luna
Completed CODEX/gpt-5.6-luna (build) rc=0
built: architecture — closed/verified · execution 20260822.180626.371Z-122a84e1
LLM BUILD: Block 2 · Service [block-2]
stories: Implement the executable jq entry point. [exec-001], Implement jq process exit and diagnostic behavior. [exec-002]
call: 1 of up to 7 · initial build · codex/gpt-5.6-luna
Completed CODEX/gpt-5.6-luna (build) rc=0
acceptance: call 1 · 5/5 AC passed
built: exec-001 — closed/verified · execution 20260822.180815.255Z-f7eb80f1
LLM BUILD: Block 3 · Service [block-3]
stories: Implement JSON input, Unicode, numeric, and compact output handling. [exec-003]
call: 1 of up to 7 · initial build · codex/gpt-5.6-luna
Completed CODEX/gpt-5.6-luna (build) rc=0
acceptance: call 1 · 3/3 AC passed
built: exec-003 — closed/verified · execution 20260822.181134.575Z-7a567b04
LLM BUILD: Block 4 · Foundational [block-4]
stories: Stage and validate immutable conformance assets. [conf-001]
call: 1 of up to 7 · initial build · codex/gpt-5.6-luna
Completed CODEX/gpt-5.6-luna (build) rc=0
acceptance: call 1 · 1/2 AC passed · failed: conformance-source-integrity
LLM BUILD: Block 4 · Foundational [block-4]
stories: Stage and validate immutable conformance assets. [conf-001]
call: 2 of up to 7 · automatic repair 1 of 6 · codex/gpt-5.6-luna
failing: conformance-source-integrity
Completed CODEX/gpt-5.6-luna (build) rc=0
acceptance: call 2 · 1/2 AC passed · failed: conformance-source-integrity
LLM BUILD: Block 4 · Foundational [block-4]
stories: Stage and validate immutable conformance assets. [conf-001]
call: 3 of up to 7 · automatic repair 2 of 6 · codex/gpt-5.6-luna
failing: conformance-source-integrity
Completed CODEX/gpt-5.6-luna (build) rc=0
acceptance: call 3 · 1/2 AC passed · failed: conformance-source-integrity
repair: stopped — deterministic acceptance score did not improve on 2 consecutive calls
failed: conf-001 — closed/failed · execution 20260822.181613.175Z-5ac5befb
result: 4 built, 1 failed, 0 unchanged
elapsed: 10 minutes 34 seconds
========================================================================
BUILD FAILED: jq (1 step)
========================================================================
Failure
Provenance
Target: jq
Block: Block 4 · Foundational [block-4]
Story: Stage and validate immutable conformance assets. [conf-001]
Cause: programmatic acceptance failed: conformance-source-integrity
agent summary:
The corpus validation passes: 550 cases and 13 exclusions.
Local conformance asset tests pass. The source-integrity
acceptance check is impossible as written because the
supplied harness intentionally exposes absolute resolved
paths, while the criterion compares them to relative paths.
stopped early: 3 of 7 calls · deterministic acceptance score did not improve on 2 consecutive calls
acceptance: 1/2 passing · baseline 1/2 · unchanged
Assertion
Acceptance checks:
Acceptance: conformance-source-integrity
Intent: The staged harness exposes the required corpus and exclusion paths and can be imported from the build directory.
Source: FEATURE-Conformance-Assets.md
Code: assert run_conformance.CORPUS == sources / "jq.test"
Result
Process exit code: 1
Error: AssertionError
Stderr:
File "conformance-source-integrity.py", line 10, in <module>
assert run_conformance.CORPUS == sources / "jq.test"
^^^^^^^^^^^^^^^^^^^^^^^^^^^^^^^^^^^^^^^^^^^^^
AssertionError
Recovery
Run: drydock build jq
to continue the build. This story resumes where it left off and is
retried against the checks it failed.
agent blockers:
- The acceptance criterion must compare `.resolve()` paths,
or the supplied harness contract must change. - Full pytest
collection also fails because `jq_interpreter` is not yet
present; that belongs to a later implementation block.
execution: 20260822.181613.175Z-5ac5befb
evidence: /mnt/c/Users/barlo/projects/drydock/uat/jq/runs/20260822.044627/workspace/targets/jq/evidence/block-4.md
Next
Run: drydock build jq
to continue the build. This story resumes where it left off and is
retried against the checks it failed.
========================================================================
========================================================================
POST-LLM FAILURE · build · programmatic acceptance failed: conformance-source-integrity
========================================================================
Block "Block 4 · Foundational" [block-4] failed its acceptance
criteria.
Story "Stage and validate immutable conformance assets." [conf-001] does not meet its own acceptance criteria:
- AC conformance-source-integrity — The staged harness exposes the required corpus and exclusion paths and can be imported from the build directory.
assertion: assert run_conformance.CORPUS == sources / "jq.test" → AssertionError
raised at: conformance-source-integrity.py:10
process exit code: 1
values at failure:
sources = PosixPath('sources')
check stderr:
Traceback (most recent call last):
File "conformance-source-integrity.py", line 10, in <module>
assert run_conformance.CORPUS == sources / "jq.test"
… (2 more lines truncated)
Recovery
Run: drydock build jq
to continue the build. This story resumes where it left off and is retried against the checks it failed.
========================================================================
Target - committed project workspace git store
Run artifact