Drydock 0.2.0 Copyright (c) 2026 Web Cloud Studio. All rights reserved.
Build: jq
scope: entire project
frontier: architecture-foundation
LLM BUILD: Block 1 · Foundational [block-1]
stories: Define the standalone jq interpreter architecture and module boundaries. [architecture-foundation]
call: 1 of up to 7 · initial build · codex/gpt-5.6-luna
Completed CODEX/gpt-5.6-luna (build) rc=0
acceptance: call 1 · 2/2 AC passed
built: architecture-foundation — closed/verified · execution 20260822.194717.195Z-0948cafd
LLM BUILD: Block 2 · Foundational [block-2]
stories: Implement the executable jq entry point. [EXEC-001]
call: 1 of up to 7 · initial build · codex/gpt-5.6-luna
Completed CODEX/gpt-5.6-luna (build) rc=0
acceptance: call 1 · 2/2 AC passed
built: EXEC-001 — closed/verified · execution 20260822.194909.871Z-c0f03947
LLM BUILD: Block 3 · Service [block-3]
stories: Implement jq process exit and diagnostic behavior. [EXEC-002]
call: 1 of up to 7 · initial build · codex/gpt-5.6-luna
Completed CODEX/gpt-5.6-luna (build) rc=0
acceptance: call 1 · 3/3 AC passed
built: EXEC-002 — closed/verified · execution 20260822.195011.791Z-7425cbae
LLM BUILD: Block 4 · Service [block-4]
stories: Implement JSON input and compact output handling. [EXEC-003]
call: 1 of up to 7 · initial build · codex/gpt-5.6-luna
Completed CODEX/gpt-5.6-luna (build) rc=0
acceptance: call 1 · 3/3 AC passed
built: EXEC-003 — closed/verified · execution 20260822.195122.332Z-1d5baaf1
LLM BUILD: Block 5 · Foundational [block-5]
stories: Stage and validate immutable conformance assets. [CONF-001]
call: 1 of up to 7 · initial build · codex/gpt-5.6-luna
Completed CODEX/gpt-5.6-luna (build) rc=0
acceptance: call 1 · 1/1 AC passed
built: CONF-001 — closed/verified · execution 20260822.195319.493Z-08895953
LLM BUILD: Block 6 · Service [block-6]
stories: Implement jq lexical scanning. [PARSE-001]
call: 1 of up to 7 · initial build · codex/gpt-5.6-luna
Completed CODEX/gpt-5.6-luna (build) rc=0
acceptance: call 1 · 3/3 AC passed
built: PARSE-001 — closed/verified · execution 20260822.195437.799Z-9e8b87c7
LLM BUILD: Block 7 · Service [block-7]
stories: Implement literals, strings, escapes, and interpolation. [PARSE-002]
call: 1 of up to 7 · initial build · codex/gpt-5.6-luna
Completed CODEX/gpt-5.6-luna (build) rc=0
acceptance: call 1 · 1/1 AC passed
built: PARSE-002 — closed/verified · execution 20260822.195833.572Z-be3705d7
LLM BUILD: Block 8 · Service [block-8]
stories: Implement jq filter expression grammar. [PARSE-003], Implement declarations and control syntax parsing. [PARSE-004]
call: 1 of up to 7 · initial build · codex/gpt-5.6-luna
Completed CODEX/gpt-5.6-luna (build) rc=0
acceptance: call 1 · 0/2 AC passed · failed: parse-003-conformance (93/464 cases), parse-004-conformance (24/224 cases)
LLM BUILD: Block 8 · Service [block-8]
stories: Implement jq filter expression grammar. [PARSE-003], Implement declarations and control syntax parsing. [PARSE-004]
call: 2 of up to 7 · automatic repair 1 of 6 · codex/gpt-5.6-luna
failing: parse-003-conformance (93/464 cases), parse-004-conformance (24/224 cases)
Completed CODEX/gpt-5.6-luna (build) rc=0
acceptance: call 2 · 0/2 AC passed · failed: parse-003-conformance (135/464 cases), parse-004-conformance (66/224 cases)
LLM BUILD: Block 8 · Service [block-8]
stories: Implement jq filter expression grammar. [PARSE-003], Implement declarations and control syntax parsing. [PARSE-004]
call: 3 of up to 7 · automatic repair 2 of 6 · codex/gpt-5.6-luna
failing: parse-003-conformance (135/464 cases), parse-004-conformance (66/224 cases)
Completed CODEX/gpt-5.6-luna (build) rc=0
acceptance: call 3 · 0/2 AC passed · failed: parse-003-conformance (150/464 cases), parse-004-conformance (71/224 cases)
LLM BUILD: Block 8 · Service [block-8]
stories: Implement jq filter expression grammar. [PARSE-003], Implement declarations and control syntax parsing. [PARSE-004]
call: 4 of up to 7 · automatic repair 3 of 6 · codex/gpt-5.6-luna
failing: parse-003-conformance (150/464 cases), parse-004-conformance (71/224 cases)
Completed CODEX/gpt-5.6-luna (build) rc=0
acceptance: call 4 · 0/2 AC passed · failed: parse-003-conformance (150/464 cases), parse-004-conformance (71/224 cases)
LLM BUILD: Block 8 · Service [block-8]
stories: Implement jq filter expression grammar. [PARSE-003], Implement declarations and control syntax parsing. [PARSE-004]
call: 5 of up to 7 · automatic repair 4 of 6 · codex/gpt-5.6-luna
failing: parse-003-conformance (150/464 cases), parse-004-conformance (71/224 cases)
Completed CODEX/gpt-5.6-luna (build) rc=0
acceptance: call 5 · 0/2 AC passed · failed: parse-003-conformance (153/464 cases), parse-004-conformance (75/224 cases)
LLM BUILD: Block 8 · Service [block-8]
stories: Implement jq filter expression grammar. [PARSE-003], Implement declarations and control syntax parsing. [PARSE-004]
call: 6 of up to 7 · automatic repair 5 of 6 · codex/gpt-5.6-luna
failing: parse-003-conformance (153/464 cases), parse-004-conformance (75/224 cases)
Completed CODEX/gpt-5.6-luna (build) rc=0
acceptance: call 6 · 0/2 AC passed · failed: parse-003-conformance (187/464 cases), parse-004-conformance (87/224 cases)
LLM BUILD: Block 8 · Service [block-8]
stories: Implement jq filter expression grammar. [PARSE-003], Implement declarations and control syntax parsing. [PARSE-004]
call: 7 of up to 7 · automatic repair 6 of 6 · codex/gpt-5.6-luna
failing: parse-003-conformance (187/464 cases), parse-004-conformance (87/224 cases)
Completed CODEX/gpt-5.6-luna (build) rc=0
acceptance: call 7 · 0/2 AC passed · failed: parse-003-conformance (210/464 cases), parse-004-conformance (92/224 cases)
failed: PARSE-003 — closed/failed · execution 20260822.210533.139Z-e0792409
result: 7 built, 2 failed, 0 unchanged
elapsed: 1 hour 29 minutes 49 seconds
========================================================================
BUILD FAILED: jq (1 step)
========================================================================
Failure
Provenance
Target: jq
Block: Block 8 · Service [block-8]
Story: Implement jq filter expression grammar. [PARSE-003]
Cause: programmatic acceptance failed: parse-003-conformance, parse-004-conformance
agent summary:
Fixed scalar indexing errors, optional access, range, common
builtins, interpolation, nested `elif`, and `try` parsing.
Project tests pass: 32 passed. Scoped conformance remains
failing: PARSE-003 191/408 passed; PARSE-004 92/211 passed.
acceptance: 0/1 passing · baseline 0/1 · unchanged
Assertion
Acceptance checks:
Acceptance: parse-003-conformance
Intent: The executable passes every selected corpus case exercising expression punctuation, accessors, collections, and operators.
Source: FEATURE-PARSE-003.md
Code: assert summary["fail"] == 0 and summary["error"] == 0
Result
Process exit code: 1
Error: AssertionError
Stderr:
File "parse-003-conformance.py", line 18, in <module>
assert summary["fail"] == 0 and summary["error"] == 0
^^^^^^^^^^^^^^^^^^^^^^^^^^^^^^^^^^^^^^^^^^^^^^
AssertionError
Recovery
Run: drydock build jq
to continue the build. This story resumes where it left off and is
retried against the checks it failed.
agent blockers:
- Broad evaluator functionality remains incomplete,
especially advanced builtins, assignments, function scoping,
and control semantics.
execution: 20260822.210533.139Z-e0792409
evidence: /mnt/c/Users/barlo/projects/drydock/uat/jq/runs/20260822.044627/workspace/targets/jq/evidence/block-8.md
Next
Run: drydock build jq
to continue the build. This story resumes where it left off and is
retried against the checks it failed.
========================================================================
========================================================================
POST-LLM FAILURE · build · programmatic acceptance failed: parse-003-conformance, parse-004-conformance
========================================================================
Block "Block 8 · Service" [block-8] failed its acceptance criteria.
Story "Implement jq filter expression grammar." [PARSE-003] does not meet its own acceptance criteria:
- AC parse-003-conformance — The executable passes every selected corpus case exercising expression punctuation, accessors, collections, and operators.
assertion: assert summary["fail"] == 0 and summary["error"] == 0 → AssertionError
cases: pass=210 fail=245 error=0 skip=9 total=464 from=summary
raised at: parse-003-conformance.py:18
process exit code: 1
values at failure:
summary = {'pass': 210, 'fail': 245, 'error': 0, 'skip': 9}
observed output:
"line": 2633,
… (46 more lines truncated)
Recovery
Run: drydock build jq
to continue the build. This story resumes where it left off and is retried against the checks it failed.
========================================================================
Target - committed project workspace git store
Run artifact