Run artifact

evidence/commands/superseded/20260823.113801/10-initial-build-1.stdout.log

Drydock 0.2.0  Copyright (c) 2026 Web Cloud Studio. All rights reserved.
Build: jq
scope: entire project
frontier: resume block-8

LLM BUILD: Block 8 · Service [block-8]
  stories: Implement jq filter expression grammar. [PARSE-003], Implement declarations and control syntax parsing. [PARSE-004]
  call: 1 of up to 16 · resumed repair · codex/gpt-5.6-luna
  failing: parse-003-conformance (331/464 cases), parse-004-conformance (153/224 cases)
  Completed CODEX/gpt-5.6-luna (build)  rc=0
acceptance: call 1 · 0/2 AC passed · failed: parse-003-conformance (344/464 cases), parse-004-conformance (163/224 cases)

LLM BUILD: Block 8 · Service [block-8]
  stories: Implement jq filter expression grammar. [PARSE-003], Implement declarations and control syntax parsing. [PARSE-004]
  call: 2 of up to 16 · automatic repair 1 of 15 · codex/gpt-5.6-luna
  failing: parse-003-conformance (344/464 cases), parse-004-conformance (163/224 cases)
  Completed CODEX/gpt-5.6-luna (build)  rc=0
acceptance: call 2 · 0/2 AC passed · failed: parse-003-conformance (360/464 cases), parse-004-conformance (167/224 cases)

LLM BUILD: Block 8 · Service [block-8]
  stories: Implement jq filter expression grammar. [PARSE-003], Implement declarations and control syntax parsing. [PARSE-004]
  call: 3 of up to 16 · automatic repair 2 of 15 · codex/gpt-5.6-luna
  failing: parse-003-conformance (360/464 cases), parse-004-conformance (167/224 cases)
  Completed CODEX/gpt-5.6-luna (build)  rc=0
acceptance: call 3 · 0/2 AC passed · failed: parse-003-conformance (373/464 cases), parse-004-conformance (173/224 cases)

LLM BUILD: Block 8 · Service [block-8]
  stories: Implement jq filter expression grammar. [PARSE-003], Implement declarations and control syntax parsing. [PARSE-004]
  call: 4 of up to 16 · automatic repair 3 of 15 · codex/gpt-5.6-luna
  failing: parse-003-conformance (373/464 cases), parse-004-conformance (173/224 cases)
  Completed CODEX/gpt-5.6-luna (build)  rc=0
acceptance: call 4 · 0/2 AC passed · failed: parse-003-conformance (381/464 cases), parse-004-conformance (177/224 cases)

LLM BUILD: Block 8 · Service [block-8]
  stories: Implement jq filter expression grammar. [PARSE-003], Implement declarations and control syntax parsing. [PARSE-004]
  call: 5 of up to 16 · automatic repair 4 of 15 · codex/gpt-5.6-luna
  failing: parse-003-conformance (381/464 cases), parse-004-conformance (177/224 cases)
  Completed CODEX/gpt-5.6-luna (build)  rc=0
acceptance: call 5 · 0/2 AC passed · failed: parse-003-conformance (386/464 cases), parse-004-conformance (181/224 cases)

LLM BUILD: Block 8 · Service [block-8]
  stories: Implement jq filter expression grammar. [PARSE-003], Implement declarations and control syntax parsing. [PARSE-004]
  call: 6 of up to 16 · automatic repair 5 of 15 · codex/gpt-5.6-luna
  failing: parse-003-conformance (386/464 cases), parse-004-conformance (181/224 cases)
  Completed CODEX/gpt-5.6-luna (build)  rc=0
acceptance: call 6 · 0/2 AC passed · failed: parse-003-conformance (391/464 cases), parse-004-conformance (182/224 cases)

LLM BUILD: Block 8 · Service [block-8]
  stories: Implement jq filter expression grammar. [PARSE-003], Implement declarations and control syntax parsing. [PARSE-004]
  call: 7 of up to 16 · automatic repair 6 of 15 · codex/gpt-5.6-luna
  failing: parse-003-conformance (391/464 cases), parse-004-conformance (182/224 cases)
  Completed CODEX/gpt-5.6-luna (build)  rc=0
acceptance: call 7 · 0/2 AC passed · failed: parse-003-conformance (400/464 cases), parse-004-conformance (191/224 cases)

LLM BUILD: Block 8 · Service [block-8]
  stories: Implement jq filter expression grammar. [PARSE-003], Implement declarations and control syntax parsing. [PARSE-004]
  call: 8 of up to 16 · automatic repair 7 of 15 · codex/gpt-5.6-luna
  failing: parse-003-conformance (400/464 cases), parse-004-conformance (191/224 cases)
  Completed CODEX/gpt-5.6-luna (build)  rc=0
acceptance: call 8 · 0/2 AC passed · failed: parse-003-conformance (403/464 cases), parse-004-conformance (191/224 cases)

LLM BUILD: Block 8 · Service [block-8]
  stories: Implement jq filter expression grammar. [PARSE-003], Implement declarations and control syntax parsing. [PARSE-004]
  call: 9 of up to 16 · automatic repair 8 of 15 · codex/gpt-5.6-luna
  failing: parse-003-conformance (403/464 cases), parse-004-conformance (191/224 cases)
  Completed CODEX/gpt-5.6-luna (build)  rc=0
acceptance: call 9 · 0/2 AC passed · failed: parse-003-conformance (417/464 cases), parse-004-conformance (200/224 cases)

LLM BUILD: Block 8 · Service [block-8]
  stories: Implement jq filter expression grammar. [PARSE-003], Implement declarations and control syntax parsing. [PARSE-004]
  call: 10 of up to 16 · automatic repair 9 of 15 · codex/gpt-5.6-luna
  failing: parse-003-conformance (417/464 cases), parse-004-conformance (200/224 cases)
  Completed CODEX/gpt-5.6-luna (build)  rc=0
acceptance: call 10 · 0/2 AC passed · failed: parse-003-conformance (419/464 cases), parse-004-conformance (200/224 cases)

LLM BUILD: Block 8 · Service [block-8]
  stories: Implement jq filter expression grammar. [PARSE-003], Implement declarations and control syntax parsing. [PARSE-004]
  call: 11 of up to 16 · automatic repair 10 of 15 · codex/gpt-5.6-luna
  failing: parse-003-conformance (419/464 cases), parse-004-conformance (200/224 cases)
  Completed CODEX/gpt-5.6-luna (build)  rc=0
acceptance: call 11 · 0/2 AC passed · failed: parse-003-conformance (425/464 cases), parse-004-conformance (202/224 cases)

LLM BUILD: Block 8 · Service [block-8]
  stories: Implement jq filter expression grammar. [PARSE-003], Implement declarations and control syntax parsing. [PARSE-004]
  call: 12 of up to 16 · automatic repair 11 of 15 · codex/gpt-5.6-luna
  failing: parse-003-conformance (425/464 cases), parse-004-conformance (202/224 cases)
  Completed CODEX/gpt-5.6-luna (build)  rc=0
acceptance: call 12 · 1/2 AC passed · failed: parse-003-conformance (435/464 cases)

LLM BUILD: Block 8 · Service [block-8]
  stories: Implement jq filter expression grammar. [PARSE-003], Implement declarations and control syntax parsing. [PARSE-004]
  call: 13 of up to 16 · automatic repair 12 of 15 · codex/gpt-5.6-luna
  failing: parse-003-conformance (435/464 cases)
  Completed CODEX/gpt-5.6-luna (build)  rc=0
acceptance: call 13 · 1/2 AC passed · failed: parse-003-conformance (446/464 cases)

LLM BUILD: Block 8 · Service [block-8]
  stories: Implement jq filter expression grammar. [PARSE-003], Implement declarations and control syntax parsing. [PARSE-004]
  call: 14 of up to 16 · automatic repair 13 of 15 · codex/gpt-5.6-luna
  failing: parse-003-conformance (446/464 cases)
  Completed CODEX/gpt-5.6-luna (build)  rc=0
acceptance: call 14 · 2/2 AC passed
built: PARSE-003 — closed/verified · execution 20260823.020504.857Z-c6c1a57e

LLM BUILD: Block 9 · Service [block-9]
  stories: Implement the stream-valued filter evaluator. [CORE-001]
  call: 1 of up to 16 · initial build · codex/gpt-5.6-luna
  Completed CODEX/gpt-5.6-luna (build)  rc=0
acceptance: call 1 · 1/1 AC passed
built: CORE-001 — closed/verified · execution 20260823.021651.942Z-9c6d4747

LLM BUILD: Block 10 · Service [block-10]
  stories: Implement composition and Cartesian generator evaluation. [CORE-002]
  call: 1 of up to 16 · initial build · codex/gpt-5.6-luna
  Completed CODEX/gpt-5.6-luna (build)  rc=0
acceptance: call 1 · 1/1 AC passed
built: CORE-002 — closed/verified · execution 20260823.022052.850Z-bef4ad90

LLM BUILD: Block 11 · Service [block-11]
  stories: Implement empty, runtime errors, optional evaluation, and try. [CORE-003]
  call: 1 of up to 16 · initial build · codex/gpt-5.6-luna
  Completed CODEX/gpt-5.6-luna (build)  rc=0
acceptance: call 1 · 1/1 AC passed
built: CORE-003 — closed/verified · execution 20260823.022510.696Z-432b7141

LLM BUILD: Block 12 · Service [block-12]
  stories: Implement jq truthiness, equality, and ordering. [CORE-004]
  call: 1 of up to 16 · initial build · codex/gpt-5.6-luna
  Completed CODEX/gpt-5.6-luna (build)  rc=0
acceptance: call 1 · 1/1 AC passed
built: CORE-004 — closed/verified · execution 20260823.022843.056Z-464edb0b

LLM BUILD: Block 13 · Service [block-13]
  stories: Implement the jq value and numeric model. [VALUE-001]
  call: 1 of up to 16 · initial build · codex/gpt-5.6-luna
  Completed CODEX/gpt-5.6-luna (build)  rc=0
acceptance: call 1 · 1/1 AC passed
built: VALUE-001 — closed/verified · execution 20260823.023237.129Z-a6819c83

LLM BUILD: Block 14 · Service [block-14]
  stories: Implement field and index access. [VALUE-002]
  call: 1 of up to 16 · initial build · codex/gpt-5.6-luna
  Completed CODEX/gpt-5.6-luna (build)  rc=0
acceptance: call 1 · 1/1 AC passed
built: VALUE-002 — closed/verified · execution 20260823.023629.826Z-b996dd45

LLM BUILD: Block 15 · Service [block-15]
  stories: Implement slices and collection iteration. [VALUE-003]
  call: 1 of up to 16 · initial build · codex/gpt-5.6-luna
  Completed CODEX/gpt-5.6-luna (build)  rc=0
acceptance: call 1 · 1/1 AC passed
built: VALUE-003 — closed/verified · execution 20260823.024036.322Z-8ffc2035

LLM BUILD: Block 16 · Service [block-16]
  stories: Implement type, length, numeric predicates, conversions, and math. [VALUE-004]
  call: 1 of up to 16 · initial build · codex/gpt-5.6-luna
  Completed CODEX/gpt-5.6-luna (build)  rc=0
acceptance: call 1 · 1/1 AC passed
built: VALUE-004 — closed/verified · execution 20260823.024538.026Z-0ab32bd1

LLM BUILD: Block 17 · Service [block-17]
  stories: Implement arithmetic and structural operators. [FLOW-001]
  call: 1 of up to 16 · initial build · codex/gpt-5.6-luna
  Completed CODEX/gpt-5.6-luna (build)  rc=0
acceptance: call 1 · 1/1 AC passed
built: FLOW-001 — closed/verified · execution 20260823.025144.476Z-1fca168c

LLM BUILD: Block 18 · Service [block-18]
  stories: Implement boolean and alternative operators. [FLOW-002]
  call: 1 of up to 16 · initial build · codex/gpt-5.6-luna
  Completed CODEX/gpt-5.6-luna (build)  rc=0
acceptance: call 1 · 1/1 AC passed
built: FLOW-002 — closed/verified · execution 20260823.025726.811Z-1a745c35

LLM BUILD: Block 19 · Service [block-19]
  stories: Implement conditionals and exception flow. [FLOW-003]
  call: 1 of up to 16 · initial build · codex/gpt-5.6-luna
  Completed CODEX/gpt-5.6-luna (build)  rc=0
acceptance: call 1 · 1/1 AC passed
built: FLOW-003 — closed/verified · execution 20260823.030233.466Z-9b5cdcb2

LLM BUILD: Block 20 · Service [block-20]
  stories: Implement lexical labels and breaks. [FLOW-004]
  call: 1 of up to 16 · initial build · codex/gpt-5.6-luna
  Completed CODEX/gpt-5.6-luna (build)  rc=0
acceptance: call 1 · 1/1 AC passed
built: FLOW-004 — closed/verified · execution 20260823.030840.777Z-b10f3c99

LLM BUILD: Block 21 · Service [block-21]
  stories: Implement reductions and iteration controls. [FLOW-005]
  call: 1 of up to 16 · initial build · codex/gpt-5.6-luna
  Completed CODEX/gpt-5.6-luna (build)  rc=0
acceptance: call 1 · 1/1 AC passed
built: FLOW-005 — closed/verified · execution 20260823.031407.736Z-316a0d1a

LLM BUILD: Block 22 · Service [block-22]
  stories: Implement recursive generator primitives. [FLOW-006]
  call: 1 of up to 16 · initial build · codex/gpt-5.6-luna
  Completed CODEX/gpt-5.6-luna (build)  rc=0
acceptance: call 1 · 1/1 AC passed
built: FLOW-006 — closed/verified · execution 20260823.032028.932Z-a3770ea3

LLM BUILD: Block 23 · Service [block-23]
  stories: Implement lexical variable bindings. [FUNC-001]
  call: 1 of up to 16 · initial build · codex/gpt-5.6-luna
  Completed CODEX/gpt-5.6-luna (build)  rc=0
acceptance: call 1 · 1/1 AC passed
built: FUNC-001 — closed/verified · execution 20260823.032616.141Z-64a1b0fb

LLM BUILD: Block 24 · Service [block-24]
  stories: Implement filter and value function parameters. [FUNC-002]
  call: 1 of up to 16 · initial build · codex/gpt-5.6-luna
  Completed CODEX/gpt-5.6-luna (build)  rc=0
acceptance: call 1 · 1/1 AC passed
built: FUNC-002 — closed/verified · execution 20260823.033302.960Z-9f231ffc

LLM BUILD: Block 25 · Service [block-25]
  stories: Implement function definitions, scope, and recursion. [FUNC-003]
  call: 1 of up to 16 · initial build · codex/gpt-5.6-luna
  Completed CODEX/gpt-5.6-luna (build)  rc=0
acceptance: call 1 · 1/1 AC passed
built: FUNC-003 — closed/verified · execution 20260823.033926.906Z-4e4c50bc

LLM BUILD: Block 26 · Service [block-26]
  stories: Implement destructuring patterns and alternatives. [FUNC-004]
  call: 1 of up to 16 · initial build · codex/gpt-5.6-luna
  Completed CODEX/gpt-5.6-luna (build)  rc=0
acceptance: call 1 · 1/1 AC passed
built: FUNC-004 — closed/verified · execution 20260823.034534.124Z-9931947b

LLM BUILD: Block 27 · Service [block-27]
  stories: Implement path discovery and projection. [PATH-001]
  call: 1 of up to 16 · initial build · codex/gpt-5.6-luna
  Completed CODEX/gpt-5.6-luna (build)  rc=0
acceptance: call 1 · 1/1 AC passed
built: PATH-001 — closed/verified · execution 20260823.035101.009Z-f278c23c

LLM BUILD: Block 28 · Service [block-28]
  stories: Implement path access and mutation primitives. [PATH-002]
  call: 1 of up to 16 · initial build · codex/gpt-5.6-luna
  Completed CODEX/gpt-5.6-luna (build)  rc=0
acceptance: call 1 · 1/1 AC passed
built: PATH-002 — closed/verified · execution 20260823.035649.869Z-75289107

LLM BUILD: Block 29 · Service [block-29]
  stories: Implement deletion and assignment operators. [PATH-003]
  call: 1 of up to 16 · initial build · codex/gpt-5.6-luna
  Completed CODEX/gpt-5.6-luna (build)  rc=0
acceptance: call 1 · 1/1 AC passed
built: PATH-003 — closed/verified · execution 20260823.040344.251Z-86ae74fe

LLM BUILD: Block 30 · Service [block-30]
  stories: Implement complex assignment edge cases. [PATH-004]
  call: 1 of up to 16 · initial build · codex/gpt-5.6-luna
  Completed CODEX/gpt-5.6-luna (build)  rc=0
acceptance: call 1 · 1/1 AC passed
built: PATH-004 — closed/verified · execution 20260823.041112.257Z-5b803ab1

LLM BUILD: Block 31 · Service [block-31]
  stories: Implement collection transformation builtins. [DATA-001]
  call: 1 of up to 16 · initial build · codex/gpt-5.6-luna
  Completed CODEX/gpt-5.6-luna (build)  rc=0
acceptance: call 1 · 1/1 AC passed

LLM BUILD: Block 31 · Service [block-31]
  stories: Implement collection transformation builtins. [DATA-001]
  call: 2 of up to 16 · automatic repair 1 of 15 · codex/gpt-5.6-luna
  Completed CODEX/gpt-5.6-luna (build)  rc=0
acceptance: call 2 · 1/1 AC passed
built: DATA-001 — closed/verified · execution 20260823.042455.513Z-305e685e

LLM BUILD: Block 32 · Service [block-32]
  stories: Implement sorting and grouping builtins. [DATA-002]
  call: 1 of up to 16 · initial build · codex/gpt-5.6-luna
  Completed CODEX/gpt-5.6-luna (build)  rc=0
acceptance: call 1 · 1/1 AC passed
built: DATA-002 — closed/verified · execution 20260823.043147.349Z-0a77f7d7

LLM BUILD: Block 33 · Service [block-33]
  stories: Implement object-entry and containment builtins. [DATA-003]
  call: 1 of up to 16 · initial build · codex/gpt-5.6-luna
  Completed CODEX/gpt-5.6-luna (build)  rc=0
acceptance: call 1 · 1/1 AC passed
built: DATA-003 — closed/verified · execution 20260823.043810.706Z-eb6692b5

LLM BUILD: Block 34 · Service [block-34]
  stories: Implement index and membership utilities. [DATA-004]
  call: 1 of up to 16 · initial build · codex/gpt-5.6-luna
  Completed CODEX/gpt-5.6-luna (build)  rc=0
acceptance: call 1 · 1/1 AC passed
built: DATA-004 — closed/verified · execution 20260823.044517.300Z-207a6942

LLM BUILD: Block 35 · Service [block-35]
  stories: Implement string manipulation builtins. [TEXT-001]
  call: 1 of up to 16 · initial build · codex/gpt-5.6-luna
  Completed CODEX/gpt-5.6-luna (build)  rc=0
acceptance: call 1 · 1/1 AC passed
built: TEXT-001 — closed/verified · execution 20260823.045149.005Z-117c6dab

LLM BUILD: Block 36 · Service [block-36]
  stories: Implement JSON and output format filters. [TEXT-002]
  call: 1 of up to 16 · initial build · codex/gpt-5.6-luna
  Completed CODEX/gpt-5.6-luna (build)  rc=0
acceptance: call 1 · 2/2 AC passed
built: TEXT-002 — closed/verified · execution 20260823.045829.748Z-fc12eacc

LLM BUILD: Block 37 · Service [block-37]
  stories: Implement regular-expression filters. [TEXT-003]
  call: 1 of up to 16 · initial build · codex/gpt-5.6-luna
  Completed CODEX/gpt-5.6-luna (build)  rc=0
acceptance: call 1 · 0/2 AC passed · failed: text-003-regex-conformance (0/0 cases), text-003-captures (0/0 cases)

LLM BUILD: Block 37 · Service [block-37]
  stories: Implement regular-expression filters. [TEXT-003]
  call: 2 of up to 16 · automatic repair 1 of 15 · codex/gpt-5.6-luna
  failing: text-003-regex-conformance (0/0 cases), text-003-captures (0/0 cases)
  Completed CODEX/gpt-5.6-luna (build)  rc=0
acceptance: call 2 · 0/2 AC passed · failed: text-003-regex-conformance (0/0 cases), text-003-captures (0/0 cases)

LLM BUILD: Block 37 · Service [block-37]
  stories: Implement regular-expression filters. [TEXT-003]
  call: 3 of up to 16 · automatic repair 2 of 15 · codex/gpt-5.6-luna
  failing: text-003-regex-conformance (0/0 cases), text-003-captures (0/0 cases)
  Completed CODEX/gpt-5.6-luna (build)  rc=0
acceptance: call 3 · 0/2 AC passed · failed: text-003-regex-conformance (0/0 cases), text-003-captures (0/0 cases)
repair: stopped — deterministic acceptance score did not improve on 2 consecutive calls
failed: TEXT-003 — closed/failed · execution 20260823.051322.004Z-76747529

result: 30 built, 1 failed, 0 unchanged
elapsed: 5 hours 25 minutes 22 seconds

========================================================================
BUILD FAILED: jq  (1 step)
========================================================================

  Failure
    Provenance
      Target: jq
      Block: Block 37 · Service [block-37]
      Story: Implement regular-expression filters. [TEXT-003]
    Cause: programmatic acceptance failed: text-003-regex-conformance, text-003-captures
    agent summary:
      Regex implementation is covered by 5 passing focused tests;
      full suite passes: 167 tests. Both authoritative selectors
      match zero corpus cases because `sources/jq.test` contains
      no regex programs.
    stopped early: 3 of 16 calls · deterministic acceptance score did not improve on 2 consecutive calls
    acceptance: 0/2 passing · baseline 0/2 · unchanged
    Assertion
      Acceptance checks:
      Acceptance: text-003-regex-conformance
      Intent: The authoritative corpus cases covering regular-expression filters execute and pass.
      Source: FEATURE-TEXT-003.md
      Code: assert sum(summary.values()) > 0
    Result
      Process exit code: 1
      Error: AssertionError
      Stderr:
          File "text-003-regex-conformance.py", line 17, in <module>
            assert sum(summary.values()) > 0
                   ^^^^^^^^^^^^^^^^^^^^^^^^^
        AssertionError
      Acceptance: text-003-captures
      Intent: The selected corpus includes matching, named capture, and replacement behavior.
      Source: FEATURE-TEXT-003.md
      Code: assert sum(summary.values()) > 0
    Result
      Process exit code: 1
      Error: AssertionError
      Stderr:
          File "text-003-captures.py", line 17, in <module>
            assert sum(summary.values()) > 0
                   ^^^^^^^^^^^^^^^^^^^^^^^^^
        AssertionError
    Recovery
      Run: drydock build jq
        to continue the build. This story resumes where it left off and is
        retried against the checks it failed.
    agent blockers:
      - Staged corpus omission makes both acceptance assertions
      fail on `sum(summary.values()) > 0`.
    execution: 20260823.051322.004Z-76747529
    evidence: /mnt/c/Users/barlo/projects/drydock/uat/jq/runs/20260822.044627/workspace/targets/jq/evidence/block-37.md

  Next
    Run: drydock build jq
      to continue the build. This story resumes where it left off and is
      retried against the checks it failed.
========================================================================

========================================================================
POST-LLM FAILURE  ·  build  ·  programmatic acceptance failed: text-003-regex-conformance, text-003-captures
========================================================================

  Block "Block 37 · Service" [block-37] failed its acceptance
  criteria.
    Story "Implement regular-expression filters." [TEXT-003] does not meet its own acceptance criteria:
      - AC text-003-regex-conformance — The authoritative corpus cases covering regular-expression filters execute and pass.
          assertion: assert sum(summary.values()) > 0 → AssertionError
          cases: pass=0 fail=0 error=0 skip=0 total=0 from=summary
          raised at: text-003-regex-conformance.py:17
          process exit code: 1
          values at failure:
            summary = {'pass': 0, 'fail': 0, 'error': 0, 'skip': 0}
          observed output:
              "candidate": [
                "/mnt/c/Users/barlo/projects/drydock/uat/jq/runs/20260822.044627/build/jq/jq"
              ],
              "corpus": "jq.test",
  … (42 more lines truncated)

  Recovery
    Run: drydock build jq
      to continue the build. This story resumes where it left off and is retried against the checks it failed.

========================================================================
Target - committed project workspace git store