Run artifact

evidence/prompt_outputs/20260822.202556.681Z_jq_build_codex.output.txt

RESULT: FAILED

FILES CHANGED:
- jq_interpreter/parser.py
- jq_interpreter/evaluator.py

SUMMARY:
Implemented assignment/update paths, `try/catch` error propagation, comma-valued `foreach` initialization, foreach state emission, and compile-time rejection for empty patterns/module directives. Project tests pass: 32 passed. Scoped PARSE-004 improved to 66 passed, 138 failed, 7 errored, 13 skipped. PARSE-003 still timed out.

BLOCKERS:
- Conformance acceptance checks remain failing due to broad evaluator/parser gaps and timeouts.

FAILURE_SUMMARY: Scoped conformance suites still fail and PARSE-003 times out.
FAILURE_DETAIL: The implementation requires further general evaluator work for functions, paths, builtins, destructuring, and generator semantics before rerunning acceptance.