Run artifact

evidence/prompt_outputs/20260822.220746.747Z_jq_build_codex.output.txt

RESULT: FAILED

FILES CHANGED:
- jq_interpreter/parser.py
- jq_interpreter/evaluator.py

SUMMARY:
- Corrected jq pipe/comma precedence and array/object delimiter parsing.
- Preserved generator multiplicity for unary expressions and conditionals.
- Added basic `map_values`, `reverse`, `flatten`, and `contains` support.
- Local tests pass: 32 passed.
- PARSE-003 still fails: 121 passed, 88 failed.
- PARSE-004 did not complete within the harness timeout.

BLOCKERS:
- Significant evaluator functionality remains incomplete, including definitions, paths, assignments, builtins, and deep-structure handling.

FAILURE_SUMMARY: Scoped conformance criteria still report failures and timeouts.

FAILURE_DETAIL: Parser improvements resolved several grouping and generator bugs, but the existing evaluator lacks enough jq semantics to satisfy both authoritative conformance slices.