Run artifact

evidence/prompt_outputs/20260822.225404.795Z_jq_build_codex.output.txt

RESULT: FAILED

FILES CHANGED:
- jq_interpreter/evaluator.py
- jq_interpreter/parser.py
- jq_interpreter/cli.py

SUMMARY:
- Fixed iterative deep equality and deep object-merge runtime handling.
- Fixed malformed syntax classification and `round`.
- Corrected iterative JSON output ordering and deep-value serialization.
- Acceptance checks still fail with broader pre-existing parser/evaluator gaps.

BLOCKERS:
- parse-003-conformance: 147 passed, 62 failed.
- parse-004-conformance: 133 passed, 77 failed, 1 errored.

FAILURE_SUMMARY: Declared conformance slices remain substantially incomplete.

FAILURE_DETAIL: The targeted deep-equality and deep-merge failures are fixed, but both acceptance criteria still report numerous unrelated expression, builtin, binding, and control-flow failures requiring further implementation.