Run artifact

evidence/prompt_outputs/20260823.014128.073Z_jq_build_codex.output.txt

RESULT: FAILED

FILES CHANGED:
- jq_interpreter/evaluator.py
- jq_interpreter/interpreter.py
- jq_interpreter/parser.py

SUMMARY:
PARSE-004 passes: 211 passed, 0 failed, 13 skipped. Project tests pass: 32 passed.

PARSE-003 remains failing: 435 passed, 20 failed, 9 skipped.

BLOCKERS:
- Remaining expression/evaluator mismatches include numeric overflow formatting, path assignment, builtins, datetime functions, and advanced path expressions.

FAILURE_SUMMARY: PARSE-003 conformance still has 20 failures.
FAILURE_DETAIL: The parser/evaluator repair improved the scoped result, but the expression acceptance gate is not yet green. Further evaluator work is required.