Run artifact

evidence/provider_raw/20260822.225404.795Z_jq_build_codex.raw.jsonl

{"type":"thread.started","thread_id":"01a02bae-679e-7082-8886-77ad8003dfa3"}
{"type":"turn.started"}
{"type":"item.completed","item":{"id":"item_0","type":"agent_message","text":"I’ll rerun both declared acceptance checks, inspect the current parser/evaluator and the complete failing cases, then fix the shared general behavior and rerun both selectors."}}
{"type":"item.started","item":{"id":"item_1","type":"command_execution","command":"/bin/bash -lc \"ls -la && find jq_interpreter -maxdepth 2 -type f -print && python3 - <<'PY'\nimport json,os,subprocess,sys\nfor sel in [r'\\\\.\\\\|\\\\[|\\\\{|\\\\+|\\\\-|\\\\*|/|%', r'%%FAIL|if |try |reduce |foreach |def | as |label |module|include']:\n r=subprocess.run([sys.executable,'sources/run_conformance.py','--select',sel,'--json'],capture_output=True,text=True,env={**os.environ,'JQ':os.path.abspath('jq')})\n print('SELECT',sel,'RC',r.returncode)\n print(r.stdout)\n print(r.stderr)\nPY\"","aggregated_output":"","exit_code":null,"status":"in_progress"}}
{"type":"item.started","item":{"id":"item_2","type":"command_execution","command":"/bin/bash -lc \"rg -n \\\"deep|equal|==|compare|RuntimeError|Recursion|contains|merge\\\" jq_interpreter | head -200 && sed -n '1,260p' jq_interpreter/runtime.py && sed -n '1,220p' jq_interpreter/evaluator.py\"","aggregated_output":"","exit_code":null,"status":"in_progress"}}
{"type":"item.completed","item":{"id":"item_2","type":"command_execution","command":"/bin/bash -lc \"rg -n \\\"deep|equal|==|compare|RuntimeError|Recursion|contains|merge\\\" jq_interpreter | head -200 && sed -n '1,260p' jq_interpreter/runtime.py && sed -n '1,220p' jq_interpreter/evaluator.py\"","aggregated_output":"jq_interpreter/parser.py:11:OPS=(\"//=\",\"?//\",\"!=\",\"==\",\"|=\",\"+=\",\"-=\",\"*=\",\"/=\",\"%=\",\"<=\",\">=\",\"..\",\"//\")\njq_interpreter/parser.py:16:PREC={\"|\":1,\",\":2,\"=\":3,\"|=\":3,\"+=\":3,\"-=\":3,\"*=\":3,\"/=\":3,\"%=\":3,\"//=\":3,\"//\":4,\"or\":5,\"and\":6,\"==\":7,\"!=\":7,\"<\":7,\">\":7,\"<=\":7,\">=\":7,\"+\":8,\"-\":8,\"*\":9,\"/\":9,\"%\":9}\njq_interpreter/parser.py:22:        if s[i]=='\"':\njq_interpreter/parser.py:27:                elif c=='\\\\': esc=True\njq_interpreter/parser.py:28:                elif c=='\"': break\njq_interpreter/parser.py:37:        if s[i]=='$':\njq_interpreter/parser.py:41:        if s[i]=='.' and i+1<len(s) and re.match(r\"[A-Za-z_]\",s[i+1]):\njq_interpreter/parser.py:43:        if s[i]=='@':\njq_interpreter/parser.py:59:        if self.p()==\"<eof>\": raise CompileError(\"empty program\")\njq_interpreter/parser.py:61:        while self.p()==';': self.take()\njq_interpreter/parser.py:67:        if self.p()=='as' and n <= 2:\njq_interpreter/parser.py:71:            if stop_comma and self.p() == ',': break\njq_interpreter/parser.py:73:        if self.p()=='as' and n <= 2:\njq_interpreter/parser.py:79:        if t=='-': self.take(); return Node('unary',('-',self.expr(10)))\njq_interpreter/parser.py:80:        if t=='if': return self.post(self.if_expr())\njq_interpreter/parser.py:82:        if t=='(': self.take(); x=self.expr(0); self.take(')'); return self.post(x)\njq_interpreter/parser.py:83:        if t=='[':\njq_interpreter/parser.py:85:            if self.p()==']': x=Node('array',(None,))\njq_interpreter/parser.py:90:                while self.p()==',': self.take(); parts.append(self.expr(1, True))\njq_interpreter/parser.py:95:        if t=='{': return self.object()\njq_interpreter/parser.py:96:        if t=='.': self.take(); return self.post(Node('identity'))\njq_interpreter/parser.py:106:            if self.p().startswith('\"') and isinstance(x,Node) and x.operation=='format':\njq_interpreter/parser.py:110:            if self.p()=='?': self.take(); x=Node('optional',(x,)); continue\njq_interpreter/parser.py:112:            if self.p()=='.' and self.t[self.i+1].text.startswith('\"'):\njq_interpreter/parser.py:114:            if self.p()=='.' and self.t[self.i+1].text=='[':\njq_interpreter/parser.py:116:            if self.p()=='[':\njq_interpreter/parser.py:118:                if self.p()==']': self.take(); x=Node('iterate',(x,)); continue\njq_interpreter/parser.py:119:                a = Node('literal', ('null',)) if self.p()==':' else self.expr(0)\njq_interpreter/parser.py:120:                if self.p()==':': self.take(); b=None if self.p()==']' else self.expr(0); self.take(']'); x=Node('slice',(x,a,b))\njq_interpreter/parser.py:123:            if self.p()=='(' and isinstance(x,Node) and x.operation=='call':\njq_interpreter/parser.py:129:                    while self.p()==';': self.take(); args.append(self.expr(0))\njq_interpreter/parser.py:136:            if self.p()=='(':\njq_interpreter/parser.py:146:            if self.p()==':': self.take(); v=self.expr(1, True)\njq_interpreter/parser.py:153:            if key.operation == 'literal':\njq_interpreter/parser.py:155:            if key.operation == 'literal':\njq_interpreter/parser.py:166:        if t=='[':\njq_interpreter/parser.py:168:            if self.p()==']': raise CompileError('empty destructuring pattern')\njq_interpreter/parser.py:172:                while self.p()==',': self.take(); items.append(self.pattern())\njq_interpreter/parser.py:174:        if t=='{':\njq_interpreter/parser.py:176:            if self.p()=='}': raise CompileError('empty destructuring pattern')\njq_interpreter/parser.py:180:                    if self.p() == '(':\njq_interpreter/parser.py:186:                    if self.p()==':':\njq_interpreter/parser.py:199:        if self.p()=='?//':\njq_interpreter/parser.py:204:        if self.p()=='else': self.take(); b=self.expr(0); self.take('end')\njq_interpreter/parser.py:205:        elif self.p()=='elif':\njq_interpreter/parser.py:211:        if self.p()=='elif': b=self._elif_expr()\njq_interpreter/parser.py:212:        elif self.p()=='else': self.take(); b=self.expr(0); self.take('end')\njq_interpreter/parser.py:219:        if w=='try':\njq_interpreter/parser.py:226:            if self.p()=='catch': self.take(); b=self.expr(1, True)\njq_interpreter/parser.py:228:        if w=='def':\njq_interpreter/parser.py:230:            if self.p()=='(': self.take();\njq_interpreter/parser.py:233:                if self.p()==';': self.take()\njq_interpreter/parser.py:241:            if self.p()==';': self.take(); ext=self.expr(2)\njq_interpreter/parser.py:243:        if w=='label': name=self.take().lstrip('$'); self.take('|'); return Node('label',(name,self.expr(0)))\njq_interpreter/parser.py:244:        if w=='break': return Node('break',(self.take().lstrip('$'),))\njq_interpreter/parser.py:249:    if source.strip() == 'not-a-filter': raise CompileError('unknown filter')\njq_interpreter/parser.py:265:                if stripped[cursor]=='(': depth+=1\njq_interpreter/parser.py:266:                elif stripped[cursor]==')': depth-=1\njq_interpreter/parser.py:278:    if isinstance(result, Node) and result.operation == 'call' and not result.arguments[1] and result.arguments[0] not in known:\njq_interpreter/architecture.py:3:This module contains only architectural metadata and process-level constants.\njq_interpreter/errors.py:8:class RuntimeError(Exception):\njq_interpreter/cli.py:10:from .errors import CompileError, RuntimeError\njq_interpreter/cli.py:13:# The conformance corpus deliberately exercises jq's deep-value limit with\njq_interpreter/cli.py:14:# values around ten thousand levels deep.  Python's default limit is lower\njq_interpreter/cli.py:15:# than that and would turn valid jq processing into an uncaught RecursionError\njq_interpreter/cli.py:54:    except (RuntimeError, ValueError, TypeError, json.JSONDecodeError) as error:\njq_interpreter/cli.py:55:        return report_runtime_error(RuntimeError(str(error)))\njq_interpreter/diagnostics.py:6:from .errors import CompileError, RuntimeError\njq_interpreter/diagnostics.py:15:def report_runtime_error(error: RuntimeError, stream: TextIO = sys.stderr) -> int:\njq_interpreter/__init__.py:3:from .errors import CompileError, RuntimeError\njq_interpreter/__init__.py:7:__all__ = [\"CompileError\", \"Interpreter\", \"MODULE_BOUNDARIES\", \"RuntimeError\"]\njq_interpreter/lexer.py:34:_OPERATORS = (\"//=\", \"?//\", \"!=\", \"==\", \"|=\", \"+=\", \"-=\", \"*=\", \"/=\", \"%=\", \"<=\", \">=\", \"..\", \"//\")\njq_interpreter/lexer.py:53:        if character == \"\\\\\":\njq_interpreter/lexer.py:56:            if source[position + 1] == \"(\":\njq_interpreter/lexer.py:70:                        elif current == \"\\\\\":\njq_interpreter/lexer.py:72:                        elif current == '\"':\njq_interpreter/lexer.py:74:                    elif current == '\"':\njq_interpreter/lexer.py:76:                    elif current == \"(\":\njq_interpreter/lexer.py:78:                    elif current == \")\":\njq_interpreter/lexer.py:80:                        if depth == 0:\njq_interpreter/lexer.py:91:            if source[position + 1] == \"u\":\njq_interpreter/lexer.py:101:        if character == '\"':\njq_interpreter/lexer.py:121:        if character == \"#\":\njq_interpreter/lexer.py:125:        if character == '\"':\njq_interpreter/lexer.py:134:        if character == \".\" and position + 1 < len(source) and source[position + 1].isalpha():\njq_interpreter/lexer.py:140:        if character == \"$\":\njq_interpreter/lexer.py:147:        if character == \"@\":\njq_interpreter/lexer.py:167:            kind = TokenKind.IDENTITY if character == \".\" else TokenKind.DELIMITER\njq_interpreter/interpreter.py:42:        if position == 0 and text.startswith(\"\\ufeff\"):\njq_interpreter/evaluator.py:6:from .errors import RuntimeError\njq_interpreter/evaluator.py:24:            raise RuntimeError(\"cannot iterate over value\")\njq_interpreter/evaluator.py:42:                else: raise RuntimeError(\"cannot add values\")\njq_interpreter/evaluator.py:65:        raise RuntimeError(program.message)\njq_interpreter/evaluator.py:77:    raise RuntimeError(\"unknown compiled filter\")\njq_interpreter/evaluator.py:81:    if op == \"identity\": yield value\njq_interpreter/evaluator.py:82:    elif op == \"literal\":\njq_interpreter/evaluator.py:84:    elif op == \"string\": yield _decode_string(a[0], value, env)\njq_interpreter/evaluator.py:85:    elif op == \"format\": yield _apply_format(a[0], value)\njq_interpreter/evaluator.py:86:    elif op == \"format_template\": yield _decode_string(a[1], value, env).replace(_decode_string(a[1], value, env), _apply_format(a[0], value))\njq_interpreter/evaluator.py:87:    elif op == \"var\":\njq_interpreter/evaluator.py:88:        if a[0] not in env: raise RuntimeError(f\"variable ${a[0]} is not defined\")\njq_interpreter/evaluator.py:90:        if isinstance(bound, tuple) and bound and bound[0] == '__closure__':\njq_interpreter/evaluator.py:96:    elif op == \"bind\":\njq_interpreter/evaluator.py:104:    elif op == \"field\": yield _index(value, a[0])\njq_interpreter/evaluator.py:105:    elif op == \"index\":\njq_interpreter/evaluator.py:107:    elif op == \"iterate\":\njq_interpreter/evaluator.py:111:            else: raise RuntimeError(\"cannot iterate over value\")\njq_interpreter/evaluator.py:114:            if op==\"slice\":\njq_interpreter/evaluator.py:117:    elif op == \"array\": yield [] if a[0] is None else list(_node(a[0],value,env))\njq_interpreter/evaluator.py:118:    elif op == \"object\":\njq_interpreter/evaluator.py:130:    elif op == \"binary\": yield from _binary(a[0],a[1],a[2],value,env)\njq_interpreter/evaluator.py:131:    elif op == \"unary\":\njq_interpreter/evaluator.py:136:    elif op == \"optional\":\njq_interpreter/evaluator.py:138:        except (RuntimeError, ValueError, TypeError, IndexError): return\njq_interpreter/evaluator.py:139:    elif op == \"if\":\njq_interpreter/evaluator.py:146:    elif op == \"try\":\njq_interpreter/evaluator.py:148:        except RuntimeError as error:\njq_interpreter/evaluator.py:152:    elif op == \"label\":\njq_interpreter/evaluator.py:156:    elif op == \"break\":\njq_interpreter/evaluator.py:160:        if op == 'foreach':\njq_interpreter/evaluator.py:181:            if op == \"foreach\":\njq_interpreter/evaluator.py:186:        if op==\"reduce\": yield from currents\njq_interpreter/evaluator.py:187:    elif op == \"call\": yield from _call(a[0],a[1],value,env)\njq_interpreter/evaluator.py:188:    elif op == \"def\":\njq_interpreter/evaluator.py:191:    elif op == \"defprog\":\njq_interpreter/evaluator.py:194:        while program.operation == 'defprog':\njq_interpreter/evaluator.py:199:    elif op == \"unsupported\": raise RuntimeError(\"unsupported syntax\")\njq_interpreter/evaluator.py:206:    if op=='pattern_alt':\njq_interpreter/evaluator.py:211:    if op=='pattern_var': env[args[0]]=value; return True\njq_interpreter/evaluator.py:212:    elif op == 'pattern_bind':\njq_interpreter/evaluator.py:215:    elif op=='pattern_array':\njq_interpreter/evaluator.py:220:    elif op=='pattern_object':\njq_interpreter/evaluator.py:236:            raise RuntimeError(\"cannot index array with string\")\njq_interpreter/evaluator.py:241:            raise RuntimeError(\"cannot index string with number\")\njq_interpreter/evaluator.py:244:    raise RuntimeError(\"cannot index value\")\njq_interpreter/evaluator.py:246:    if op==',': yield from _node(left,value,env); yield from _node(right,value,env); return\njq_interpreter/evaluator.py:247:    if op=='|':\njq_interpreter/evaluator.py:252:        if op == '|=':\njq_interpreter/evaluator.py:263:        replacements = [None] if op == '|=' else list(_node(right, value, env))\njq_interpreter/evaluator.py:268:                new = replacement if op in ('=',) else (_one(right, old, env) if op == '|=' else replacement)\njq_interpreter/evaluator.py:277:        if op=='+': yield y if x is None else x if y is None else x+y\njq_interpreter/evaluator.py:278:        elif op=='-': yield x-y\njq_interpreter/evaluator.py:279:        elif op=='*':\njq_interpreter/evaluator.py:283:                    raise RuntimeError('Repeat string result too long')\njq_interpreter/evaluator.py:288:                    raise RuntimeError('Repeat string result too long')\njq_interpreter/evaluator.py:291:                yield _merge_objects(x, y)\njq_interpreter/evaluator.py:293:        elif op=='/':\njq_interpreter/evaluator.py:294:            if y==0: raise RuntimeError(f\"number ({_short(x)}) and number ({_short(y)}) cannot be divided because the divisor is zero\")\njq_interpreter/evaluator.py:297:        elif op=='%':\njq_interpreter/evaluator.py:298:            if y==0: raise RuntimeError(f\"number ({_short(x)}) and number ({_short(y)}) cannot be divided (remainder) because the divisor is zero\")\njq_interpreter/evaluator.py:300:        elif op in ('==','!=','<','>','<=','>='): yield {'==':x==y,'!=':x!=y,'<':x<y,'>':x>y,'<=':x<=y,'>=':x>=y}[op]\njq_interpreter/evaluator.py:301:        elif op in ('and','or'): yield (_truth(x) and _truth(y)) if op=='and' else (_truth(x) or _truth(y))\njq_interpreter/evaluator.py:302:        elif op=='//': yield x if _truth(x) else y\njq_interpreter/evaluator.py:306:    if op == '+': return left + right\njq_interpreter/evaluator.py:307:    if op == '-': return left - right\njq_interpreter/evaluator.py:308:    if op == '*': return left * right\njq_interpreter/evaluator.py:309:    if op == '/': return left / right\njq_interpreter/evaluator.py:310:    if op == '%': return math.fmod(left, right)\njq_interpreter/evaluator.py:313:def _merge_objects(left: dict, right: dict, depth: int = 0) -> dict:\njq_interpreter/evaluator.py:316:    if depth > 1000: raise RuntimeError('Object merge too deep')\njq_interpreter/evaluator.py:317:    merged = dict(left)\njq_interpreter/evaluator.py:319:        if key in merged and isinstance(merged[key], dict) and isinstance(item, dict):\njq_interpreter/evaluator.py:320:            merged[key] = _merge_objects(merged[key], item, depth + 1)\njq_interpreter/evaluator.py:322:            merged[key] = item\njq_interpreter/evaluator.py:323:    return merged\njq_interpreter/evaluator.py:326:def _deep_json_dumps(value: object) -> str:\njq_interpreter/evaluator.py:327:    \"\"\"Encode deeply nested values without json.encoder's C recursion limit.\"\"\"\njq_interpreter/evaluator.py:330:    while isinstance(probe, list) and len(probe) == 1:\njq_interpreter/evaluator.py:334:        return json.dumps('<skipped: too deep>')\njq_interpreter/evaluator.py:363:        elif isinstance(item, tuple) and item[0] == 'raw':\njq_interpreter/evaluator.py:365:        elif isinstance(item, tuple) and item[0] == 'close':\njq_interpreter/evaluator.py:372:def _deep_json_loads(text: str) -> object:\njq_interpreter/evaluator.py:375:        if parsed == '<skipped: too deep>':\njq_interpreter/evaluator.py:376:            raise RuntimeError('Exceeds depth limit for parsing')\njq_interpreter/evaluator.py:378:    except RecursionError:\njq_interpreter/evaluator.py:389:    if op == 'identity': return [()]\njq_interpreter/evaluator.py:390:    if op == 'field': return [(args[0],)]\njq_interpreter/evaluator.py:391:    if op == 'index': return [p + (args[1],) for p in _paths(args[0], value, env)]\njq_interpreter/evaluator.py:392:    if op == 'indexexpr':\njq_interpreter/evaluator.py:398:                    if int(key) < 0 and abs(int(key)) > len(current): raise RuntimeError('Out of bounds negative array index')\njq_interpreter/evaluator.py:400:                    raise RuntimeError('Out of bounds negative array index')\njq_interpreter/evaluator.py:403:    if op == 'iterate':\njq_interpreter/evaluator.py:410:    if op == 'call' and not args[1] and args[0] in env.get('__funcs__', {}):\njq_interpreter/evaluator.py:444:        if len(path) == 1:\njq_interpreter/evaluator.py:450:        if len(path) == 1: result.pop(key, None)\njq_interpreter/evaluator.py:457:        if isinstance(bound, tuple) and bound and bound[0] == '__closure__':\njq_interpreter/evaluator.py:475:    if name == 'empty': return\njq_interpreter/evaluator.py:476:    if name == 'error': raise RuntimeError(_one(args[0],value,env) if args else value)\njq_interpreter/evaluator.py:477:    if name=='length': yield len(value); return\njq_interpreter/evaluator.py:478:    if name == 'add':\njq_interpreter/evaluator.py:490:                else: raise RuntimeError('cannot add values')\njq_interpreter/evaluator.py:493:    if name=='type': yield 'null' if value is None else 'boolean' if isinstance(value,bool) else 'number' if isinstance(value,(int,float)) else 'string' if isinstance(value,str) else 'array' if isinstance(value,list) else 'object'; return\njq_interpreter/evaluator.py:494:    if name=='not': yield not _truth(value); return\njq_interpreter/evaluator.py:495:    if name == 'have_decnum': yield False; return\njq_interpreter/evaluator.py:500:        yield (any if name == 'any' else all)(_truth(item) for item in values)\njq_interpreter/evaluator.py:502:    if name == 'isempty':\njq_interpreter/evaluator.py:509:    if name in ('tostring','tojson'): yield _deep_json_dumps(value) if name=='tojson' else _stringify(value); return\njq_interpreter/evaluator.py:510:    if name=='abs': yield abs(value); return\njq_interpreter/evaluator.py:511:    if name=='fabs': yield math.fabs(value); return\njq_interpreter/evaluator.py:512:    if name=='floor': yield math.floor(value); return\n\"\"\"Runtime value and stream contracts.\"\"\"\n\nfrom collections.abc import Iterator\nfrom dataclasses import dataclass, field\nfrom typing import TypeAlias\n\nJsonValue: TypeAlias = None | bool | int | float | str | list[\"JsonValue\"] | dict[str, \"JsonValue\"]\nValueStream: TypeAlias = Iterator[JsonValue]\n\n\n@dataclass\nclass EvaluationContext:\n    \"\"\"Per-input state for lexical bindings and runtime options.\"\"\"\n\n    bindings: dict[str, JsonValue] = field(default_factory=dict)\n\n\ndef identity_stream(value: JsonValue) -> ValueStream:\n    \"\"\"Yield one value, retaining the stream contract used by the evaluator.\"\"\"\n    yield value\n\"\"\"Ordered generator evaluator boundary.\"\"\"\nimport json\nimport math\n\nfrom .ast import Add, Array, Comma, Filter, Format, Identity, Iterate, Literal, Limit, Node, Pipe, Raise, StringTemplate\nfrom .errors import RuntimeError\nfrom .runtime import JsonValue, ValueStream, identity_stream\n\n\ndef evaluate(program: Filter, value: JsonValue) -> ValueStream:\n    \"\"\"Evaluate one input as an ordered stream of output values.\"\"\"\n    if isinstance(program, Node):\n        yield from _node(program, value, {})\n        return\n    if isinstance(program, Identity):\n        yield from identity_stream(value)\n        return\n    if isinstance(program, Iterate):\n        if isinstance(value, list):\n            yield from value\n        elif isinstance(value, dict):\n            yield from value.values()\n        else:\n            raise RuntimeError(\"cannot iterate over value\")\n        return\n    if isinstance(program, Literal):\n        yield program.value\n        return\n    if isinstance(program, Pipe):\n        for intermediate in evaluate(program.left, value): yield from evaluate(program.right, intermediate)\n        return\n    if isinstance(program, Add):\n        left = list(evaluate(program.left, value))\n        right = list(evaluate(program.right, value))\n        for first in left:\n            for second in right:\n                if isinstance(first, (int, float)) and isinstance(second, (int, float)):\n                    yield first + second\n                elif isinstance(first, str) and isinstance(second, str): yield first + second\n                elif first is None: yield second\n                elif second is None: yield first\n                else: raise RuntimeError(\"cannot add values\")\n        return\n    if isinstance(program, StringTemplate):\n        pieces: list[str] = []\n        for part in program.parts:\n            pieces.append(part if isinstance(part, str) else \"\".join(_stringify(x) for x in evaluate(part, value)))\n        yield \"\".join(pieces)\n        return\n    if isinstance(program, Format):\n        if program.template is None: yield _apply_format(program.name, value)\n        else:\n            pieces: list[str] = []\n            for part in program.template.parts:\n                if isinstance(part, str): pieces.append(part)\n                else:\n                    pieces.extend(_apply_format(program.name, item) for item in evaluate(part, value))\n            yield \"\".join(pieces)\n        return\n    if isinstance(program, Comma):\n        yield from evaluate(program.left, value)\n        yield from evaluate(program.right, value)\n        return\n    if isinstance(program, Raise):\n        raise RuntimeError(program.message)\n    if isinstance(program, Array):\n        yield list(evaluate(program.expression, value))\n        return\n    if isinstance(program, Limit):\n        outputs = iter(evaluate(program.expression, value))\n        for _ in range(program.count):\n            try:\n                yield next(outputs)\n            except StopIteration:\n                break\n        return\n    raise RuntimeError(\"unknown compiled filter\")\n\ndef _node(node: Node, value: object, env: dict[str, object]) -> ValueStream:\n    op, a = node.operation, node.arguments\n    if op == \"identity\": yield value\n    elif op == \"literal\":\n        text=a[0]; special={\"true\":True,\"false\":False,\"null\":None,\"nan\":float(\"nan\"),\"infinite\":float(\"inf\"),\"-infinite\":float(\"-inf\"),\"-nan\":float(\"nan\")}; yield special[text] if text in special else json.loads(text)\n    elif op == \"string\": yield _decode_string(a[0], value, env)\n    elif op == \"format\": yield _apply_format(a[0], value)\n    elif op == \"format_template\": yield _decode_string(a[1], value, env).replace(_decode_string(a[1], value, env), _apply_format(a[0], value))\n    elif op == \"var\":\n        if a[0] not in env: raise RuntimeError(f\"variable ${a[0]} is not defined\")\n        bound = env[a[0]]\n        if isinstance(bound, tuple) and bound and bound[0] == '__closure__':\n            yield from _node(bound[1], value, {**env, **bound[2]})\n        elif isinstance(bound, Node):\n            yield from _node(bound, value, env)\n        else:\n            yield bound\n    elif op == \"bind\":\n        for item in _node(a[0], value, env):\n            bound=dict(env)\n            if not _bind_pattern(a[1], item, bound):\n                continue\n            # `exp as $x | rest` binds the value produced by exp while the\n            # remainder continues with the original input.\n            yield from _node(a[2], value, bound)\n    elif op == \"field\": yield _index(value, a[0])\n    elif op == \"index\":\n        for base in _node(a[0],value,env): yield _index(base,a[1])\n    elif op == \"iterate\":\n        for base in _node(a[0],value,env):\n            if isinstance(base,dict): yield from base.values()\n            elif isinstance(base,list): yield from base\n            else: raise RuntimeError(\"cannot iterate over value\")\n    elif op in (\"indexexpr\",\"slice\"):\n        for base in _node(a[0],value,env):\n            if op==\"slice\":\n                start=_one(a[1],base,env); end=None if a[2] is None else _one(a[2],base,env); yield base[int(start) if start is not None else 0:int(end) if end is not None else None]\n            else: yield _index(base,_one(a[1],base,env))\n    elif op == \"array\": yield [] if a[0] is None else list(_node(a[0],value,env))\n    elif op == \"object\":\n        results=[{}]\n        for key, expr in a[0]:\n            keys=list(_node(key,value,env))\n            values=list(_node(expr,value,env))\n            expanded=[]\n            for prior in results:\n                for k in keys:\n                    for v in values:\n                        item=dict(prior); item[str(k)]=v; expanded.append(item)\n            results=expanded\n        yield from results\n    elif op == \"binary\": yield from _binary(a[0],a[1],a[2],value,env)\n    elif op == \"unary\":\n        # Unary operators are filters and must preserve generator\n        # multiplicity (``-.[]`` negates every array element).\n        for x in _node(a[1], value, env):\n            yield -x\n    elif op == \"optional\":\n        try: yield from _node(a[0],value,env)\n        except (RuntimeError, ValueError, TypeError, IndexError): return\n    elif op == \"if\":\n        # The condition is a filter, not a scalar expression.  jq evaluates\n        # each condition result independently and therefore may select both\n        # branches for one input.\n        for condition in _node(a[0], value, env):\n            branch = a[1] if _truth(condition) else a[2]\n            yield from _node(branch, value, env)\n    elif op == \"try\":\n        try: yield from _node(a[0],value,env)\n        except RuntimeError as error:\n            if a[1] is not None:\n                caught = error.args[0] if error.args else str(error)\n                yield from _node(a[1],caught,env)\n    elif op == \"label\":\n        try: yield from _node(a[1], value, {**env, '__label__': a[0]})\n        except _Break as exc:\n            if exc.name != a[0]: raise\n    elif op == \"break\":\n        raise _Break(a[0])\n    elif op in (\"reduce\", \"foreach\"):\n        states=list(_node(a[0], value, env)); initial=list(_node(a[2], value, env))\n        if op == 'foreach':\n            for start in initial:\n                current = start\n                for item in states:\n                    bound=dict(env)\n                    if not _bind_pattern(a[1], item, bound): continue\n                    outputs=list(_node(a[3], current, bound))\n                    for result in outputs:\n                        current = result\n                        if a[4] is None: yield result\n                        else: yield from _node(a[4], result, bound)\n            return\n        currents=initial\n        for item in states:\n            next_currents=[]\n            for current in currents:\n                bound=dict(env)\n                if not _bind_pattern(a[1], item, bound):\n                    continue\n                next_currents.extend(_node(a[3], current, bound))\n            currents=next_currents\n            if op == \"foreach\":\n                if a[4] is None:\n                    yield from currents\n                else:\n                    for result in currents: yield from _node(a[4], result, env)\n        if op==\"reduce\": yield from currents\n    elif op == \"call\": yield from _call(a[0],a[1],value,env)\n    elif op == \"def\":\n        env.setdefault('__funcs__',{})[(a[0], len(a[1]))]=(a[1],a[2])\n        yield value\n    elif op == \"defprog\":\n        funcs=dict(env.get('__funcs__',{}))\n        program: Node = node\n        while program.operation == 'defprog':\n            definition = program.arguments[0]\n            funcs[(definition.arguments[0], len(definition.arguments[1]))] = (definition.arguments[1], definition.arguments[2])\n            program = program.arguments[1]\n        yield from _node(program, value, {**env, '__funcs__': funcs})\n    elif op == \"unsupported\": raise RuntimeError(\"unsupported syntax\")\n\nclass _Break(Exception):\n    def __init__(self, name): self.name=name\n\ndef _bind_pattern(pattern, value, env):\n    op, args=pattern.operation, pattern.arguments\n    if op=='pattern_alt':\n        first, second=args\n        trial=dict(env)\n        if _bind_pattern(first,value,trial): env.update(trial); return True\n        return _bind_pattern(second,value,env)\n    if op=='pattern_var': env[args[0]]=value; return True\n    elif op == 'pattern_bind':\n        env[args[0]] = value\n        return _bind_pattern(args[1], value, env)\n    elif op=='pattern_array':\n        if not isinstance(value,list): return False\n        for i,p in enumerate(args[0]):\n            if not _bind_pattern(p, value[i] if i<len(value) else None, env): return False\n        return True\n    elif op=='pattern_object':\n","exit_code":0,"status":"completed"}}
{"type":"item.completed","item":{"id":"item_3","type":"agent_message","text":"The selectors expose many pre-existing evaluator gaps, but the repair feedback points to a concrete shared failure: deep structural equality is recursing past Python’s limit and exits uncaught. I’m isolating that case first because it affects both acceptance slices and can be fixed without weakening any corpus behavior."}}
{"type":"item.started","item":{"id":"item_4","type":"command_execution","command":"/bin/bash -lc \"sed -n '250,430p' jq_interpreter/evaluator.py; sed -n '1,120p' jq_interpreter/cli.py; python3 - <<'PY'\nimport subprocess,os\np='try ((reduce range(10001) as \"'$_ ([]; [.])) as $x | (reduce range(10001) as $_ ([]; [.])) as $y | $x == $y) catch .'\"'\nr=subprocess.run(['./jq','-c',p],input='null\\\\n',text=True,capture_output=True,env={**os.environ})\nprint(r.returncode); print(r.stdout); print(r.stderr[-3000:])\nPY\"","aggregated_output":"","exit_code":null,"status":"in_progress"}}
{"type":"item.completed","item":{"id":"item_4","type":"command_execution","command":"/bin/bash -lc \"sed -n '250,430p' jq_interpreter/evaluator.py; sed -n '1,120p' jq_interpreter/cli.py; python3 - <<'PY'\nimport subprocess,os\np='try ((reduce range(10001) as \"'$_ ([]; [.])) as $x | (reduce range(10001) as $_ ([]; [.])) as $y | $x == $y) catch .'\"'\nr=subprocess.run(['./jq','-c',p],input='null\\\\n',text=True,capture_output=True,env={**os.environ})\nprint(r.returncode); print(r.stdout); print(r.stderr[-3000:])\nPY\"","aggregated_output":"1\n\nTraceback (most recent call last):\n  File \"/mnt/c/Users/barlo/projects/drydock/uat/jq/runs/20260822.044627/build/jq/./jq\", line 20, in <module>\n    raise SystemExit(run())\n                     ^^^^^\n  File \"/mnt/c/Users/barlo/projects/drydock/uat/jq/runs/20260822.044627/build/jq/./jq\", line 16, in run\n    return main()\n           ^^^^^^\n  File \"/mnt/c/Users/barlo/projects/drydock/uat/jq/runs/20260822.044627/build/jq/jq_interpreter/cli.py\", line 49, in main\n    for output in interpreter.run(_inputs()):\n                  ^^^^^^^^^^^^^^^^^^^^^^^^^^\n  File \"/mnt/c/Users/barlo/projects/drydock/uat/jq/runs/20260822.044627/build/jq/jq_interpreter/interpreter.py\", line 20, in run\n    yield from evaluate(self._compiled, value)\n  File \"/mnt/c/Users/barlo/projects/drydock/uat/jq/runs/20260822.044627/build/jq/jq_interpreter/evaluator.py\", line 13, in evaluate\n    yield from _node(program, value, {})\n  File \"/mnt/c/Users/barlo/projects/drydock/uat/jq/runs/20260822.044627/build/jq/jq_interpreter/evaluator.py\", line 147, in _node\n    try: yield from _node(a[0],value,env)\n         ^^^^^^^^^^^^^^^^^^^^^^^^^^^^^^^^\n  File \"/mnt/c/Users/barlo/projects/drydock/uat/jq/runs/20260822.044627/build/jq/jq_interpreter/evaluator.py\", line 103, in _node\n    yield from _node(a[2], value, bound)\n  File \"/mnt/c/Users/barlo/projects/drydock/uat/jq/runs/20260822.044627/build/jq/jq_interpreter/evaluator.py\", line 103, in _node\n    yield from _node(a[2], value, bound)\n  File \"/mnt/c/Users/barlo/projects/drydock/uat/jq/runs/20260822.044627/build/jq/jq_interpreter/evaluator.py\", line 130, in _node\n    elif op == \"binary\": yield from _binary(a[0],a[1],a[2],value,env)\n                         ^^^^^^^^^^^^^^^^^^^^^^^^^^^^^^^^^^^^^^^^^^^^\n  File \"/mnt/c/Users/barlo/projects/drydock/uat/jq/runs/20260822.044627/build/jq/jq_interpreter/evaluator.py\", line 300, in _binary\n    elif op in ('==','!=','<','>','<=','>='): yield {'==':x==y,'!=':x!=y,'<':x<y,'>':x>y,'<=':x<=y,'>=':x>=y}[op]\n                                                          ^^^^\nRecursionError: maximum recursion depth exceeded in comparison\n\n","exit_code":0,"status":"completed"}}
{"type":"item.started","item":{"id":"item_5","type":"file_change","changes":[{"path":"/mnt/c/Users/barlo/projects/drydock/uat/jq/runs/20260822.044627/build/jq/jq_interpreter/evaluator.py","kind":"update"}],"status":"in_progress"}}
{"type":"item.completed","item":{"id":"item_5","type":"file_change","changes":[{"path":"/mnt/c/Users/barlo/projects/drydock/uat/jq/runs/20260822.044627/build/jq/jq_interpreter/evaluator.py","kind":"update"}],"status":"completed"}}
{"type":"item.completed","item":{"id":"item_1","type":"command_execution","command":"/bin/bash -lc \"ls -la && find jq_interpreter -maxdepth 2 -type f -print && python3 - <<'PY'\nimport json,os,subprocess,sys\nfor sel in [r'\\\\.\\\\|\\\\[|\\\\{|\\\\+|\\\\-|\\\\*|/|%', r'%%FAIL|if |try |reduce |foreach |def | as |label |module|include']:\n r=subprocess.run([sys.executable,'sources/run_conformance.py','--select',sel,'--json'],capture_output=True,text=True,env={**os.environ,'JQ':os.path.abspath('jq')})\n print('SELECT',sel,'RC',r.returncode)\n print(r.stdout)\n print(r.stderr)\nPY\"","aggregated_output":"SELECT \\.\\|\\[|\\{|\\+|\\-|\\*|/|% RC 1\n{\n  \"candidate\": [\n    \"/mnt/c/Users/barlo/projects/drydock/uat/jq/runs/20260822.044627/build/jq/jq\"\n  ],\n  \"corpus\": \"jq.test\",\n  \"summary\": {\n    \"pass\": 142,\n    \"fail\": 67,\n    \"error\": 0,\n    \"skip\": 1\n  },\n  \"cases\": [\n    {\n      \"line\": 122,\n      \"program\": \"{\\\"a\\\",b,\\\"a$\\\\(1+1)\\\"}\",\n      \"status\": \"fail\",\n      \"detail\": \"output mismatch\",\n      \"expect_failure\": false,\n      \"expected\": [\n        \"{\\\"a\\\":1, \\\"b\\\":2, \\\"a$2\\\":4}\"\n      ],\n      \"actual\": [\n        \"{\\\"a\\\":null,\\\"b\\\":2,\\\"a$2\\\":null}\"\n      ]\n    },\n    {\n      \"line\": 283,\n      \"program\": \"[.[-4,-3,-2,-1,0,1,2,3]]\",\n      \"status\": \"fail\",\n      \"detail\": \"output mismatch\",\n      \"expect_failure\": false,\n      \"expected\": [\n        \"[null,1,2,3,1,2,3,null]\"\n      ],\n      \"actual\": [\n        \"[null]\"\n      ]\n    },\n    {\n      \"line\": 311,\n      \"program\": \"[while(.<100; .*2)]\",\n      \"status\": \"fail\",\n      \"detail\": \"output mismatch\",\n      \"expect_failure\": false,\n      \"expected\": [\n        \"[1,2,4,8,16,32,64]\"\n      ],\n      \"actual\": []\n    },\n    {\n      \"line\": 329,\n      \"program\": \"[.[]|[.,1]|until(.[0] < 1; [.[0] - 1, .[1] * .[0]])|.[1]]\",\n      \"status\": \"fail\",\n      \"detail\": \"output mismatch\",\n      \"expect_failure\": false,\n      \"expected\": [\n        \"[1,2,6,24,120]\"\n      ],\n      \"actual\": []\n    },\n    {\n      \"line\": 353,\n      \"program\": \"[foreach .[] / .[] as $i (0; . + $i)]\",\n      \"status\": \"fail\",\n      \"detail\": \"output mismatch\",\n      \"expect_failure\": false,\n      \"expected\": [\n        \"[1,3,3.5,4.5]\"\n      ],\n      \"actual\": [\n        \"[1.0,1.5,3.5,4.5]\"\n      ]\n    },\n    {\n      \"line\": 405,\n      \"program\": \"[nth(0,5,9,10,15; range(.)), try nth(-1; range(.)) catch .]\",\n      \"status\": \"fail\",\n      \"detail\": \"output mismatch\",\n      \"expect_failure\": false,\n      \"expected\": [\n        \"[0,5,9,\\\"nth doesn't support negative indices\\\"]\"\n      ],\n      \"actual\": []\n    },\n    {\n      \"line\": 425,\n      \"program\": \"[nth(5,7; range(9;0;-1))]\",\n      \"status\": \"fail\",\n      \"detail\": \"output mismatch\",\n      \"expect_failure\": false,\n      \"expected\": [\n        \"[4,2]\"\n      ],\n      \"actual\": []\n    },\n    {\n      \"line\": 474,\n      \"program\": \"del(.[2:4],.[0],.[-2:])\",\n      \"status\": \"fail\",\n      \"detail\": \"output mismatch\",\n      \"expect_failure\": false,\n      \"expected\": [\n        \"[1,4,5]\"\n      ],\n      \"actual\": []\n    },\n    {\n      \"line\": 530,\n      \"program\": \". as {as: $kw, \\\"str\\\": $str, (\\\"e\\\"+\\\"x\\\"+\\\"p\\\"): $exp} | [$kw, $str, $exp]\",\n      \"status\": \"fail\",\n      \"detail\": \"output mismatch\",\n      \"expect_failure\": false,\n      \"expected\": [\n        \"[1, 2, 3]\"\n      ],\n      \"actual\": [\n        \"[1,2,null]\"\n      ]\n    },\n    {\n      \"line\": 566,\n      \"program\": \". as {(true):$foo} | $foo\",\n      \"status\": \"fail\",\n      \"detail\": \"program was accepted, but the corpus marks it %%FAIL\",\n      \"expect_failure\": true,\n      \"expected\": [],\n      \"actual\": []\n    },\n    {\n      \"line\": 617,\n      \"program\": \"{\\\"a\\\":1} + {\\\"b\\\":2} + {\\\"c\\\":3}\",\n      \"status\": \"fail\",\n      \"detail\": \"output mismatch\",\n      \"expect_failure\": false,\n      \"expected\": [\n        \"{\\\"a\\\":1, \\\"b\\\":2, \\\"c\\\":3}\"\n      ],\n      \"actual\": []\n    },\n    {\n      \"line\": 633,\n      \"program\": \"[1,2,3,4,1] - [.,3]\",\n      \"status\": \"fail\",\n      \"detail\": \"output mismatch\",\n      \"expect_failure\": false,\n      \"expected\": [\n        \"[2,4]\"\n      ],\n      \"actual\": []\n    },\n    {\n      \"line\": 661,\n      \"program\": \"9E999999999, 9999999999E999999990, 1E-999999999, 0.000000001E-999999990\",\n      \"status\": \"fail\",\n      \"detail\": \"output mismatch\",\n      \"expect_failure\": false,\n      \"expected\": [\n        \"9E+999999999\",\n        \"9.999999999E+999999999\",\n        \"1E-999999999\",\n        \"1E-999999999\"\n      ],\n      \"actual\": [\n        \"null\",\n        \"null\",\n        \"0.0\",\n        \"0.0\"\n      ]\n    },\n    {\n      \"line\": 689,\n      \"program\": \"[(infinite, -infinite) % (1, -1, infinite)]\",\n      \"status\": \"fail\",\n      \"detail\": \"output mismatch\",\n      \"expect_failure\": false,\n      \"expected\": [\n        \"[0,0,0,0,0,-1]\"\n      ],\n      \"actual\": []\n    },\n    {\n      \"line\": 693,\n      \"program\": \"[nan % 1, 1 % nan | isnan]\",\n      \"status\": \"fail\",\n      \"detail\": \"output mismatch\",\n      \"expect_failure\": false,\n      \"expected\": [\n        \"[true,true]\"\n      ],\n      \"actual\": [\n        \"[null,true]\"\n      ]\n    },\n    {\n      \"line\": 725,\n      \"program\": \"[{\\\"a\\\":42},.object,10,.num,false,true,null,\\\"b\\\",[1,4]] | .[] as $x | [$x == .[]]\",\n      \"status\": \"fail\",\n      \"detail\": \"output mismatch\",\n      \"expect_failure\": false,\n      \"expected\": [\n        \"[true,  true,  false, false, false, false, false, false, false]\",\n        \"[true,  true,  false, false, false, false, false, false, false]\",\n        \"[false, false, true,  true,  false, false, false, false, false]\",\n        \"[false, false, true,  true,  false, false, false, false, false]\",\n        \"[false, false, false, false, true,  false, false, false, false]\",\n        \"[false, false, false, false, false, true,  false, false, false]\",\n        \"[false, false, false, false, false, false, true,  false, false]\",\n        \"[false, false, false, false, false, false, false, true,  false]\",\n        \"[false, false, false, false, false, false, false, false, true ]\"\n      ],\n      \"actual\": []\n    },\n    {\n      \"line\": 798,\n      \"program\": \"def f: 1; def g: f, def f: 2; def g: 3; f, def f: g; f, g; def f: 4; [f, def f: g; def g: 5; f, g]+[f,g]\",\n      \"status\": \"fail\",\n      \"detail\": \"output mismatch\",\n      \"expect_failure\": false,\n      \"expected\": [\n        \"[4,1,2,3,3,5,4,1,2,3,3]\"\n      ],\n      \"actual\": [\n        \"[4,5,5,4,4,2,3,3]\"\n      ]\n    },\n    {\n      \"line\": 868,\n      \"program\": \"def f: .+1; def g: f; def f: .+100; def f(a):a+.+11; [(g|f(20)), f]\",\n      \"status\": \"fail\",\n      \"detail\": \"output mismatch\",\n      \"expect_failure\": false,\n      \"expected\": [\n        \"[33,101]\"\n      ],\n      \"actual\": [\n        \"[132,101]\"\n      ]\n    },\n    {\n      \"line\": 873,\n      \"program\": \"def id(x):x; 2000 as $x | def f(x):1 as $x | id([$x, x, x]); def g(x): 100 as $x | f($x,$x+x); g($x)\",\n      \"status\": \"fail\",\n      \"detail\": \"output mismatch\",\n      \"expect_failure\": false,\n      \"expected\": [\n        \"[1,100,2100.0,100,2100.0]\"\n      ],\n      \"actual\": [\n        \"[1,1,1]\"\n      ]\n    },\n    {\n      \"line\": 884,\n      \"program\": \"[[20,10][1,0] as $x | def f: (100,200) as $y | def g: [$x + $y, .]; . + $x | g; f[0] | [f][0][1] | f]\",\n      \"status\": \"fail\",\n      \"detail\": \"output mismatch\",\n      \"expect_failure\": false,\n      \"expected\": [\n        \"[[110.0, 130.0], [210.0, 130.0], [110.0, 230.0], [210.0, 230.0], [120.0, 160.0], [220.0, 160.0], [120.0, 260.0], [220.0, 260.0]]\"\n      ],\n      \"actual\": [\n        \"[[110,130],[210,130],[110,230],[210,230]]\"\n      ]\n    },\n    {\n      \"line\": 938,\n      \"program\": \".[] | . as {$a, b: [$c, {$d}]} ?// [$a, {$b}, $e] ?// $f | [$a, $b, $c, $d, $e, $f]\",\n      \"status\": \"fail\",\n      \"detail\": \"output mismatch\",\n      \"expect_failure\": false,\n      \"expected\": [\n        \"[1, null, 2, 3, null, null]\",\n        \"[4, 5, null, null, 7, null]\",\n        \"[null, null, null, null, null, \\\"foo\\\"]\"\n      ],\n      \"actual\": []\n    },\n    {\n      \"line\": 1169,\n      \"program\": \"delpaths([[-200]])\",\n      \"status\": \"fail\",\n      \"detail\": \"output mismatch\",\n      \"expect_failure\": false,\n      \"expected\": [\n        \"[1,2,3]\"\n      ],\n      \"actual\": []\n    },\n    {\n      \"line\": 1184,\n      \"program\": \"del(.[1], .[-6], .[2], .[-3:9])\",\n      \"status\": \"fail\",\n      \"detail\": \"output mismatch\",\n      \"expect_failure\": false,\n      \"expected\": [\n        \"[0, 3, 5, 6, 9]\"\n      ],\n      \"actual\": []\n    },\n    {\n      \"line\": 1197,\n      \"program\": \"setpath([-1]; 1)\",\n      \"status\": \"fail\",\n      \"detail\": \"output mismatch\",\n      \"expect_failure\": false,\n      \"expected\": [\n        \"[1]\"\n      ],\n      \"actual\": []\n    },\n    {\n      \"line\": 1253,\n      \"program\": \"def inc(x): x |= .+1; inc(.[].a)\",\n      \"status\": \"fail\",\n      \"detail\": \"output mismatch\",\n      \"expect_failure\": false,\n      \"expected\": [\n        \"[{\\\"a\\\":2,\\\"b\\\":2},{\\\"a\\\":3,\\\"b\\\":4},{\\\"a\\\":8,\\\"b\\\":8}]\"\n      ],\n      \"actual\": []\n    },\n    {\n      \"line\": 1294,\n      \"program\": \"try ((map(select(.a == 1))[].a) |= .+1) catch .\",\n      \"status\": \"fail\",\n      \"detail\": \"output mismatch\",\n      \"expect_failure\": false,\n      \"expected\": [\n        \"\\\"Invalid path expression near attempt to iterate through [{\\\\\\\"a\\\\\\\":1}]\\\"\"\n      ],\n      \"actual\": []\n    },\n    {\n      \"line\": 1370,\n      \"program\": \"[.[] | [.foo[] // .bar]]\",\n      \"status\": \"fail\",\n      \"detail\": \"output mismatch\",\n      \"expect_failure\": false,\n      \"expected\": [\n        \"[[1,2], [1], [3], [42], [41]]\"\n      ],\n      \"actual\": [\n        \"[[1,2],[1],[18,18,3],[],[41,41,41]]\"\n      ]\n    },\n    {\n      \"line\": 1374,\n      \"program\": \".[] //= .[0]\",\n      \"status\": \"fail\",\n      \"detail\": \"output mismatch\",\n      \"expect_failure\": false,\n      \"expected\": [\n        \"[\\\"hello\\\",true,\\\"hello\\\",[false],\\\"hello\\\"]\"\n      ],\n      \"actual\": []\n    },\n    {\n      \"line\": 1411,\n      \"program\": \"[{\\\"foo\\\":42} == {\\\"foo\\\":42},{\\\"foo\\\":42} != {\\\"foo\\\":42}, {\\\"foo\\\":42} != {\\\"bar\\\":42}, {\\\"foo\\\":42} == {\\\"bar\\\":42}]\",\n      \"status\": \"fail\",\n      \"detail\": \"output mismatch\",\n      \"expect_failure\": false,\n      \"expected\": [\n        \"[true,false,true,false]\"\n      ],\n      \"actual\": []\n    },\n    {\n      \"line\": 1416,\n      \"program\": \"[{\\\"foo\\\":[1,2,{\\\"bar\\\":18},\\\"world\\\"]} == {\\\"foo\\\":[1,2,{\\\"bar\\\":18},\\\"world\\\"]},{\\\"foo\\\":[1,2,{\\\"bar\\\":18},\\\"world\\\"]} == {\\\"foo\\\":[1,2,{\\\"bar\\\":19},\\\"world\\\"]}]\",\n      \"status\": \"fail\",\n      \"detail\": \"output mismatch\",\n      \"expect_failure\": false,\n      \"expected\": [\n        \"[true,false]\"\n      ],\n      \"actual\": []\n    },\n    {\n      \"line\": 1464,\n      \"program\": \"try error(0) // 1\",\n      \"status\": \"fail\",\n      \"detail\": \"output mismatch\",\n      \"expect_failure\": false,\n      \"expected\": [\n        \"1\"\n      ],\n      \"actual\": []\n    },\n    {\n      \"line\": 1473,\n      \"program\": \"1 + try 2 catch 3 + 4\",\n      \"status\": \"fail\",\n      \"detail\": \"output mismatch\",\n      \"expect_failure\": false,\n      \"expected\": [\n        \"7\"\n      ],\n      \"actual\": [\n        \"3\"\n      ]\n    },\n    {\n      \"line\": 1481,\n      \"program\": \"try -.? catch .\",\n      \"status\": \"fail\",\n      \"detail\": \"output mismatch\",\n      \"expect_failure\": false,\n      \"expected\": [\n        \"\\\"string (\\\\\\\"foo\\\\\\\") cannot be negated\\\"\"\n      ],\n      \"actual\": []\n    },\n    {\n      \"line\": 1625,\n      \"program\": \"[.[] * \\\"abc\\\"]\",\n      \"status\": \"fail\",\n      \"detail\": \"output mismatch\",\n      \"expect_failure\": false,\n      \"expected\": [\n        \"[null,null,\\\"\\\",\\\"\\\",\\\"abc\\\",\\\"abc\\\",\\\"abcabcabc\\\",\\\"abcabcabcabcabcabcabcabcabcabc\\\"]\"\n      ],\n      \"actual\": [\n        \"[\\\"\\\",\\\"\\\",\\\"\\\",\\\"\\\",\\\"abc\\\",\\\"abc\\\",\\\"abcabcabc\\\",\\\"abcabcabcabcabcabcabcabcabcabc\\\"]\"\n      ]\n    },\n    {\n      \"line\": 1629,\n      \"program\": \"[. * (nan,-nan)]\",\n      \"status\": \"fail\",\n      \"detail\": \"output mismatch\",\n      \"expect_failure\": false,\n      \"expected\": [\n        \"[null,null]\"\n      ],\n      \"actual\": []\n    },\n    {\n      \"line\": 1677,\n      \"program\": \"(sort_by(.b) | sort_by(.a)), sort_by(.a, .b), sort_by(.b, .c), group_by(.b), group_by(.a + .b - .c == 2)\",\n      \"status\": \"fail\",\n      \"detail\": \"output mismatch\",\n      \"expect_failure\": false,\n      \"expected\": [\n        \"[{\\\"a\\\": 0, \\\"b\\\": 2, \\\"c\\\": 43}, {\\\"a\\\": 1, \\\"b\\\": 4, \\\"c\\\": 14}, {\\\"a\\\": 1, \\\"b\\\": 4, \\\"c\\\": 3}, {\\\"a\\\": 4, \\\"b\\\": 1, \\\"c\\\": 3}]\",\n        \"[{\\\"a\\\": 0, \\\"b\\\": 2, \\\"c\\\": 43}, {\\\"a\\\": 1, \\\"b\\\": 4, \\\"c\\\": 14}, {\\\"a\\\": 1, \\\"b\\\": 4, \\\"c\\\": 3}, {\\\"a\\\": 4, \\\"b\\\": 1, \\\"c\\\": 3}]\",\n        \"[{\\\"a\\\": 4, \\\"b\\\": 1, \\\"c\\\": 3}, {\\\"a\\\": 0, \\\"b\\\": 2, \\\"c\\\": 43}, {\\\"a\\\": 1, \\\"b\\\": 4, \\\"c\\\": 3}, {\\\"a\\\": 1, \\\"b\\\": 4, \\\"c\\\": 14}]\",\n        \"[[{\\\"a\\\": 4, \\\"b\\\": 1, \\\"c\\\": 3}], [{\\\"a\\\": 0, \\\"b\\\": 2, \\\"c\\\": 43}], [{\\\"a\\\": 1, \\\"b\\\": 4, \\\"c\\\": 14}, {\\\"a\\\": 1, \\\"b\\\": 4, \\\"c\\\": 3}]]\",\n        \"[[{\\\"a\\\": 1, \\\"b\\\": 4, \\\"c\\\": 14}, {\\\"a\\\": 0, \\\"b\\\": 2, \\\"c\\\": 43}], [{\\\"a\\\": 4, \\\"b\\\": 1, \\\"c\\\": 3}, {\\\"a\\\": 1, \\\"b\\\": 4, \\\"c\\\": 3}]]\"\n      ],\n      \"actual\": []\n    },\n    {\n      \"line\": 1721,\n      \"program\": \"with_entries(.key |= \\\"KEY_\\\" + .)\",\n      \"status\": \"fail\",\n      \"detail\": \"output mismatch\",\n      \"expect_failure\": false,\n      \"expected\": [\n        \"{\\\"KEY_a\\\": 1, \\\"KEY_b\\\": 2}\"\n      ],\n      \"actual\": []\n    },\n    {\n      \"line\": 1835,\n      \"program\": \"bsearch({x:1})\",\n      \"status\": \"fail\",\n      \"detail\": \"output mismatch\",\n      \"expect_failure\": false,\n      \"expected\": [\n        \"1\"\n      ],\n      \"actual\": []\n    },\n    {\n      \"line\": 1843,\n      \"program\": \"strftime(\\\"%Y-%m-%dT%H:%M:%SZ\\\")\",\n      \"status\": \"fail\",\n      \"detail\": \"output mismatch\",\n      \"expect_failure\": false,\n      \"expected\": [\n        \"\\\"2015-03-05T23:51:47Z\\\"\"\n      ],\n      \"actual\": []\n    },\n    {\n      \"line\": 1847,\n      \"program\": \"strftime(\\\"%A, %B %d, %Y\\\")\",\n      \"status\": \"fail\",\n      \"detail\": \"output mismatch\",\n      \"expect_failure\": false,\n      \"expected\": [\n        \"\\\"Tuesday, June 30, 2015\\\"\"\n      ],\n      \"actual\": []\n    },\n    {\n      \"line\": 1851,\n      \"program\": \"strftime(\\\"%Y-%m-%dT%H:%M:%SZ\\\")\",\n      \"status\": \"fail\",\n      \"detail\": \"output mismatch\",\n      \"expect_failure\": false,\n      \"expected\": [\n        \"\\\"2024-03-15T00:00:00Z\\\"\"\n      ],\n      \"actual\": []\n    },\n    {\n      \"line\": 1868,\n      \"program\": \"try strftime(\\\"%Y-%m-%dT%H:%M:%SZ\\\") catch .\",\n      \"status\": \"fail\",\n      \"detail\": \"output mismatch\",\n      \"expect_failure\": false,\n      \"expected\": [\n        \"\\\"strftime/1 requires parsed datetime inputs\\\"\"\n      ],\n      \"actual\": [\n        \"\\\"unknown function strftime\\\"\"\n      ]\n    },\n    {\n      \"line\": 1872,\n      \"program\": \"try strflocaltime(\\\"%Y-%m-%dT%H:%M:%SZ\\\") catch .\",\n      \"status\": \"fail\",\n      \"detail\": \"output mismatch\",\n      \"expect_failure\": false,\n      \"expected\": [\n        \"\\\"strflocaltime/1 requires parsed datetime inputs\\\"\"\n      ],\n      \"actual\": [\n        \"\\\"unknown function strflocaltime\\\"\"\n      ]\n    },\n    {\n      \"line\": 1885,\n      \"program\": \"try [\\\"OK\\\", strflocaltime({})] catch [\\\"KO\\\", .]\",\n      \"status\": \"fail\",\n      \"detail\": \"output mismatch\",\n      \"expect_failure\": false,\n      \"expected\": [\n        \"[\\\"KO\\\",\\\"strflocaltime/1 requires a string format\\\"]\"\n      ],\n      \"actual\": [\n        \"[\\\"KO\\\",\\\"unknown function strflocaltime\\\"]\"\n      ]\n    },\n    {\n      \"line\": 1889,\n      \"program\": \"[strptime(\\\"%Y-%m-%dT%H:%M:%SZ\\\")|(.,mktime)]\",\n      \"status\": \"fail\",\n      \"detail\": \"output mismatch\",\n      \"expect_failure\": false,\n      \"expected\": [\n        \"[[2015,2,5,23,51,47,4,63],1425599507]\"\n      ],\n      \"actual\": []\n    },\n    {\n      \"line\": 1895,\n      \"program\": \"last(range(365 * 67)|(\\\"1970-03-01T01:02:03Z\\\"|strptime(\\\"%Y-%m-%dT%H:%M:%SZ\\\")|mktime) + (86400 * .)|strftime(\\\"%Y-%m-%dT%H:%M:%SZ\\\")|strptime(\\\"%Y-%m-%dT%H:%M:%SZ\\\"))\",\n      \"status\": \"fail\",\n      \"detail\": \"output mismatch\",\n      \"expect_failure\": false,\n      \"expected\": [\n        \"[2037,1,11,1,2,3,3,41]\"\n      ],\n      \"actual\": []\n    },\n    {\n      \"line\": 1917,\n      \"program\": \"import \\\"data\\\" as $a; import \\\"data\\\" as $b; def f: {$a, $b}; f\",\n      \"status\": \"skip\",\n      \"detail\": \"declared in exclusions.txt\",\n      \"expect_failure\": false,\n      \"expected\": [\n        \"{\\\"a\\\":[{\\\"this\\\":\\\"is a test\\\",\\\"that\\\":\\\"is too\\\"}],\\\"b\\\":[{\\\"this\\\":\\\"is a test\\\",\\\"that\\\":\\\"is too\\\"}]}\"\n      ],\n      \"actual\": []\n    },\n    {\n      \"line\": 1997,\n      \"program\": \"try -. catch .\",\n      \"status\": \"fail\",\n      \"detail\": \"output mismatch\",\n      \"expect_failure\": false,\n      \"expected\": [\n        \"\\\"string (\\\\\\\"very-long-long-long-long...\\\\\\\") cannot be negated\\\"\"\n      ],\n      \"actual\": []\n    },\n    {\n      \"line\": 2001,\n      \"program\": \"try (.-.) catch .\",\n      \"status\": \"fail\",\n      \"detail\": \"output mismatch\",\n      \"expect_failure\": false,\n      \"expected\": [\n        \"\\\"string (\\\\\\\"very-long-long-long-long...\\\\\\\") and string (\\\\\\\"very-long-long-long-long...\\\\\\\") cannot be subtracted\\\"\"\n      ],\n      \"actual\": []\n    },\n    {\n      \"line\": 2005,\n      \"program\": \"\\\"x\\\" * range(0; 12; 2) + \\\"\\u2606\\\" * 8 | try -. catch .\",\n      \"status\": \"fail\",\n      \"detail\": \"output mismatch\",\n      \"expect_failure\": false,\n      \"expected\": [\n        \"\\\"string (\\\\\\\"\\u2606\\u2606\\u2606\\u2606\\u2606\\u2606\\u2606\\u2606\\\\\\\") cannot be negated\\\"\",\n        \"\\\"string (\\\\\\\"xx\\u2606\\u2606\\u2606\\u2606\\u2606\\u2606\\u2606\\u2606\\\\\\\") cannot be negated\\\"\",\n        \"\\\"string (\\\\\\\"xxxx\\u2606\\u2606\\u2606\\u2606\\u2606\\u2606...\\\\\\\") cannot be negated\\\"\",\n        \"\\\"string (\\\\\\\"xxxxxx\\u2606\\u2606\\u2606\\u2606\\u2606\\u2606...\\\\\\\") cannot be negated\\\"\",\n        \"\\\"string (\\\\\\\"xxxxxxxx\\u2606\\u2606\\u2606\\u2606\\u2606...\\\\\\\") cannot be negated\\\"\",\n        \"\\\"string (\\\\\\\"xxxxxxxxxx\\u2606\\u2606\\u2606\\u2606...\\\\\\\") cannot be negated\\\"\"\n      ],\n      \"actual\": []\n    },\n    {\n      \"line\": 2014,\n      \"program\": \"try (. + \\\"x\\\") catch . == if have_decnum then \\\"number (12345678901234567890123456...) and string (\\\\\\\"x\\\\\\\") cannot be added\\\" else \\\"number (12345678901234568000000000...) and string (\\\\\\\"x\\\\\\\") cannot be added\\\" end\",\n      \"status\": \"fail\",\n      \"detail\": \"output mismatch\",\n      \"expect_failure\": false,\n      \"expected\": [\n        \"true\"\n      ],\n      \"actual\": []\n    },\n    {\n      \"line\": 2067,\n      \"program\": \"[range(-52;52;1)] as $powers | [$powers[]|pow(2;.)|log2|round] == $powers\",\n      \"status\": \"fail\",\n      \"detail\": \"exited 1: Traceback (most recent call last):\",\n      \"expect_failure\": false,\n      \"expected\": [\n        \"true\"\n      ],\n      \"actual\": []\n    },\n    {\n      \"line\": 2075,\n      \"program\": \"{\",\n      \"status\": \"fail\",\n      \"detail\": \"exited 1; a rejected program must exit 3\",\n      \"expect_failure\": true,\n      \"expected\": [],\n      \"actual\": []\n    },\n    {\n      \"line\": 2086,\n      \"program\": \"(.[{}] = 0)?\",\n      \"status\": \"fail\",\n      \"detail\": \"output mismatch\",\n      \"expect_failure\": false,\n      \"expected\": [],\n      \"actual\": [\n        \"{\\\"{}\\\":0}\"\n      ]\n    },\n    {\n      \"line\": 2093,\n      \"program\": \"JOIN({\\\"0\\\":[0,\\\"abc\\\"],\\\"1\\\":[1,\\\"bcd\\\"],\\\"2\\\":[2,\\\"def\\\"],\\\"3\\\":[3,\\\"efg\\\"],\\\"4\\\":[4,\\\"fgh\\\"]}; .[0]|tostring)\",\n      \"status\": \"fail\",\n      \"detail\": \"output mismatch\",\n      \"expect_failure\": false,\n      \"expected\": [\n        \"[[[5,\\\"foo\\\"],null],[[3,\\\"bar\\\"],[3,\\\"efg\\\"]],[[1,\\\"foobar\\\"],[1,\\\"bcd\\\"]]]\"\n      ],\n      \"actual\": []\n    },\n    {\n      \"line\": 2161,\n      \"program\": \"\\\"-1\\\"|IN(builtins[] / \\\"/\\\"|.[1])\",\n      \"status\": \"fail\",\n      \"detail\": \"output mismatch\",\n      \"expect_failure\": false,\n      \"expected\": [\n        \"false\"\n      ],\n      \"actual\": []\n    },\n    {\n      \"line\": 2165,\n      \"program\": \"all(builtins[] / \\\"/\\\"; .[1]|tonumber >= 0)\",\n      \"status\": \"fail\",\n      \"detail\": \"output mismatch\",\n      \"expect_failure\": false,\n      \"expected\": [\n        \"true\"\n      ],\n      \"actual\": []\n    },\n    {\n      \"line\": 2211,\n      \"program\": \". - 10\",\n      \"status\": \"fail\",\n      \"detail\": \"output mismatch\",\n      \"expect_failure\": false,\n      \"expected\": [\n        \"13911860366432382\"\n      ],\n      \"actual\": [\n        \"13911860366432383\"\n      ]\n    },\n    {\n      \"line\": 2215,\n      \"program\": \".[0] - 10\",\n      \"status\": \"fail\",\n      \"detail\": \"output mismatch\",\n      \"expect_failure\": false,\n      \"expected\": [\n        \"13911860366432382\"\n      ],\n      \"actual\": [\n        \"13911860366432383\"\n      ]\n    },\n    {\n      \"line\": 2219,\n      \"program\": \".x - 10\",\n      \"status\": \"fail\",\n      \"detail\": \"output mismatch\",\n      \"expect_failure\": false,\n      \"expected\": [\n        \"13911860366432382\"\n      ],\n      \"actual\": [\n        \"13911860366432383\"\n      ]\n    },\n    {\n      \"line\": 2224,\n      \"program\": \"-. | tojson == if have_decnum then \\\"-13911860366432393\\\" else \\\"-13911860366432392\\\" end\",\n      \"status\": \"fail\",\n      \"detail\": \"output mismatch\",\n      \"expect_failure\": false,\n      \"expected\": [\n        \"true\"\n      ],\n      \"actual\": [\n        \"false\"\n      ]\n    },\n    {\n      \"line\": 2232,\n      \"program\": \"[1E+1000,-1E+1000 | tojson] == if have_decnum then [\\\"1E+1000\\\",\\\"-1E+1000\\\"] else [\\\"1.7976931348623157e+308\\\",\\\"-1.7976931348623157e+308\\\"] end\",\n      \"status\": \"fail\",\n      \"detail\": \"output mismatch\",\n      \"expect_failure\": false,\n      \"expected\": [\n        \"true\"\n      ],\n      \"actual\": []\n    },\n    {\n      \"line\": 2241,\n      \"program\": \".[] as $n | $n+0 | [., tostring, . == $n]\",\n      \"status\": \"fail\",\n      \"detail\": \"output mismatch\",\n      \"expect_failure\": false,\n      \"expected\": [\n        \"[-9007199254740992,\\\"-9007199254740992\\\",true]\",\n        \"[-9007199254740992,\\\"-9007199254740992\\\",true]\",\n        \"[9007199254740992,\\\"9007199254740992\\\",true]\",\n        \"[9007199254740992,\\\"9007199254740992\\\",true]\",\n        \"[13911860366432392,\\\"13911860366432392\\\",true]\"\n      ],\n      \"actual\": [\n        \"[-9007199254740993,\\\"-9007199254740993\\\",true]\",\n        \"[-9007199254740992,\\\"-9007199254740992\\\",true]\",\n        \"[9007199254740992,\\\"9007199254740992\\\",true]\",\n        \"[9007199254740993,\\\"9007199254740993\\\",true]\",\n        \"[13911860366432393,\\\"13911860366432393\\\",true]\"\n      ]\n    },\n    {\n      \"line\": 2271,\n      \"program\": \"[1E+1000,-1E+1000 | abs | tojson] | unique == if have_decnum then [\\\"1E+1000\\\"] else [\\\"1.7976931348623157e+308\\\"] end\",\n      \"status\": \"fail\",\n      \"detail\": \"output mismatch\",\n      \"expect_failure\": false,\n      \"expected\": [\n        \"true\"\n      ],\n      \"actual\": []\n    },\n    {\n      \"line\": 2275,\n      \"program\": \"[1E+1000,-1E+1000 | length | tojson] | unique == if have_decnum then [\\\"1E+1000\\\"] else [\\\"1.7976931348623157e+308\\\"] end\",\n      \"status\": \"fail\",\n      \"detail\": \"output mismatch\",\n      \"expect_failure\": false,\n      \"expected\": [\n        \"true\"\n      ],\n      \"actual\": []\n    },\n    {\n      \"line\": 2304,\n      \"program\": \"{ a, $__loc__, c }\",\n      \"status\": \"fail\",\n      \"detail\": \"output mismatch\",\n      \"expect_failure\": false,\n      \"expected\": [\n        \"{\\\"a\\\":[1,2,3],\\\"__loc__\\\":{\\\"file\\\":\\\"<top-level>\\\",\\\"line\\\":1},\\\"c\\\":{\\\"hi\\\":\\\"hey\\\"}}\"\n      ],\n      \"actual\": []\n    },\n    {\n      \"line\": 2430,\n      \"program\": \"walk(select(IN({}, []) | not))\",\n      \"status\": \"fail\",\n      \"detail\": \"output mismatch\",\n      \"expect_failure\": false,\n      \"expected\": [\n        \"{\\\"a\\\":1}\"\n      ],\n      \"actual\": []\n    },\n    {\n      \"line\": 2611,\n      \"program\": \"try (reduce range(10001) as $_ ({}; {a: .}) as $x | $x * $x) catch .\",\n      \"status\": \"fail\",\n      \"detail\": \"exited 1: Traceback (most recent call last):\",\n      \"expect_failure\": false,\n      \"expected\": [\n        \"\\\"Object merge too deep\\\"\"\n      ],\n      \"actual\": []\n    }\n  ]\n}\n\n\nSELECT %%FAIL|if |try |reduce |foreach |def | as |label |module|include RC 1\n{\n  \"candidate\": [\n    \"/mnt/c/Users/barlo/projects/drydock/uat/jq/runs/20260822.044627/build/jq/jq\"\n  ],\n  \"corpus\": \"jq.test\",\n  \"summary\": {\n    \"pass\": 131,\n    \"fail\": 79,\n    \"error\": 1,\n    \"skip\": 13\n  },\n  \"cases\": [\n    {\n      \"line\": 200,\n      \"program\": \"map(try .a[] catch ., try .a.[] catch ., .a[]?, .a.[]?)\",\n      \"status\": \"fail\",\n      \"detail\": \"output mismatch\",\n      \"expect_failure\": false,\n      \"expected\": [\n        \"[1,2,1,2,1,2,1,2,\\\"Cannot iterate over number (123)\\\",\\\"Cannot iterate over number (123)\\\"]\"\n      ],\n      \"actual\": [\n        \"[1,2,1,2,1,2,1,2,\\\"cannot iterate over value\\\",\\\"cannot iterate over value\\\"]\"\n      ]\n    },\n    {\n      \"line\": 229,\n      \"program\": \"try (.[999999999] = 0) catch .\",\n      \"status\": \"error\",\n      \"detail\": \"timed out after 10s\",\n      \"expect_failure\": false,\n      \"expected\": [\n        \"\\\"Array index too large\\\"\"\n      ],\n      \"actual\": []\n    },\n    {\n      \"line\": 353,\n      \"program\": \"[foreach .[] / .[] as $i (0; . + $i)]\",\n      \"status\": \"fail\",\n      \"detail\": \"output mismatch\",\n      \"expect_failure\": false,\n      \"expected\": [\n        \"[1,3,3.5,4.5]\"\n      ],\n      \"actual\": [\n        \"[1.0,1.5,3.5,4.5]\"\n      ]\n    },\n    {\n      \"line\": 405,\n      \"program\": \"[nth(0,5,9,10,15; range(.)), try nth(-1; range(.)) catch .]\",\n      \"status\": \"fail\",\n      \"detail\": \"output mismatch\",\n      \"expect_failure\": false,\n      \"expected\": [\n        \"[0,5,9,\\\"nth doesn't support negative indices\\\"]\"\n      ],\n      \"actual\": []\n    },\n    {\n      \"line\": 530,\n      \"program\": \". as {as: $kw, \\\"str\\\": $str, (\\\"e\\\"+\\\"x\\\"+\\\"p\\\"): $exp} | [$kw, $str, $exp]\",\n      \"status\": \"fail\",\n      \"detail\": \"output mismatch\",\n      \"expect_failure\": false,\n      \"expected\": [\n        \"[1, 2, 3]\"\n      ],\n      \"actual\": [\n        \"[1,2,null]\"\n      ]\n    },\n    {\n      \"line\": 560,\n      \"program\": \". as $foo | [$foo, $bar]\",\n      \"status\": \"fail\",\n      \"detail\": \"program was accepted, but the corpus marks it %%FAIL\",\n      \"expect_failure\": true,\n      \"expected\": [],\n      \"actual\": []\n    },\n    {\n      \"line\": 566,\n      \"program\": \". as {(true):$foo} | $foo\",\n      \"status\": \"fail\",\n      \"detail\": \"program was accepted, but the corpus marks it %%FAIL\",\n      \"expect_failure\": true,\n      \"expected\": [],\n      \"actual\": []\n    },\n    {\n      \"line\": 709,\n      \"program\": \".[] | try toboolean catch .\",\n      \"status\": \"fail\",\n      \"detail\": \"output mismatch\",\n      \"expect_failure\": false,\n      \"expected\": [\n        \"\\\"null (null) cannot be parsed as a boolean\\\"\",\n        \"\\\"number (0) cannot be parsed as a boolean\\\"\",\n        \"\\\"string (\\\\\\\"tru\\\\\\\") cannot be parsed as a boolean\\\"\",\n        \"\\\"string (\\\\\\\"truee\\\\\\\") cannot be parsed as a boolean\\\"\",\n        \"\\\"string (\\\\\\\"fals\\\\\\\") cannot be parsed as a boolean\\\"\",\n        \"\\\"string (\\\\\\\"falsee\\\\\\\") cannot be parsed as a boolean\\\"\",\n        \"\\\"array ([]) cannot be parsed as a boolean\\\"\",\n        \"\\\"object ({}) cannot be parsed as a boolean\\\"\"\n      ],\n      \"actual\": [\n        \"\\\"null (null) cannot be parsed as a boolean\\\"\",\n        \"\\\"number (0) cannot be parsed as a boolean\\\"\",\n        \"\\\"string (tru) cannot be parsed as a boolean\\\"\",\n        \"\\\"string (truee) cannot be parsed as a boolean\\\"\",\n        \"\\\"string (fals) cannot be parsed as a boolean\\\"\",\n        \"\\\"string (falsee) cannot be parsed as a boolean\\\"\",\n        \"\\\"array ([]) cannot be parsed as a boolean\\\"\",\n        \"\\\"object ({}) cannot be parsed as a boolean\\\"\"\n      ]\n    },\n    {\n      \"line\": 720,\n      \"program\": \"\\\"true\\\\u0000x\\\", \\\"false\\\\u0000\\\" | try toboolean catch .\",\n      \"status\": \"fail\",\n      \"detail\": \"output mismatch\",\n      \"expect_failure\": false,\n      \"expected\": [\n        \"\\\"string (\\\\\\\"true\\\\\\\\u0000x\\\\\\\") cannot be parsed as a boolean\\\"\",\n        \"\\\"string (\\\\\\\"false\\\\\\\\u0000\\\\\\\") cannot be parsed as a boolean\\\"\"\n      ],\n      \"actual\": [\n        \"\\\"string (true\\\\u0000x) cannot be parsed as a boolean\\\"\",\n        \"\\\"string (false\\\\u0000) cannot be parsed as a boolean\\\"\"\n      ]\n    },\n    {\n      \"line\": 725,\n      \"program\": \"[{\\\"a\\\":42},.object,10,.num,false,true,null,\\\"b\\\",[1,4]] | .[] as $x | [$x == .[]]\",\n      \"status\": \"fail\",\n      \"detail\": \"output mismatch\",\n      \"expect_failure\": false,\n      \"expected\": [\n        \"[true,  true,  false, false, false, false, false, false, false]\",\n        \"[true,  true,  false, false, false, false, false, false, false]\",\n        \"[false, false, true,  true,  false, false, false, false, false]\",\n        \"[false, false, true,  true,  false, false, false, false, false]\",\n        \"[false, false, false, false, true,  false, false, false, false]\",\n        \"[false, false, false, false, false, true,  false, false, false]\",\n        \"[false, false, false, false, false, false, true,  false, false]\",\n        \"[false, false, false, false, false, false, false, true,  false]\",\n        \"[false, false, false, false, false, false, false, false, true ]\"\n      ],\n      \"actual\": []\n    },\n    {\n      \"line\": 798,\n      \"program\": \"def f: 1; def g: f, def f: 2; def g: 3; f, def f: g; f, g; def f: 4; [f, def f: g; def g: 5; f, g]+[f,g]\",\n      \"status\": \"fail\",\n      \"detail\": \"output mismatch\",\n      \"expect_failure\": false,\n      \"expected\": [\n        \"[4,1,2,3,3,5,4,1,2,3,3]\"\n      ],\n      \"actual\": [\n        \"[4,5,5,4,4,2,3,3]\"\n      ]\n    },\n    {\n      \"line\": 868,\n      \"program\": \"def f: .+1; def g: f; def f: .+100; def f(a):a+.+11; [(g|f(20)), f]\",\n      \"status\": \"fail\",\n      \"detail\": \"output mismatch\",\n      \"expect_failure\": false,\n      \"expected\": [\n        \"[33,101]\"\n      ],\n      \"actual\": [\n        \"[132,101]\"\n      ]\n    },\n    {\n      \"line\": 873,\n      \"program\": \"def id(x):x; 2000 as $x | def f(x):1 as $x | id([$x, x, x]); def g(x): 100 as $x | f($x,$x+x); g($x)\",\n      \"status\": \"fail\",\n      \"detail\": \"output mismatch\",\n      \"expect_failure\": false,\n      \"expected\": [\n        \"[1,100,2100.0,100,2100.0]\"\n      ],\n      \"actual\": [\n        \"[1,1,1]\"\n      ]\n    },\n    {\n      \"line\": 884,\n      \"program\": \"[[20,10][1,0] as $x | def f: (100,200) as $y | def g: [$x + $y, .]; . + $x | g; f[0] | [f][0][1] | f]\",\n      \"status\": \"fail\",\n      \"detail\": \"output mismatch\",\n      \"expect_failure\": false,\n      \"expected\": [\n        \"[[110.0, 130.0], [210.0, 130.0], [110.0, 230.0], [210.0, 230.0], [120.0, 160.0], [220.0, 160.0], [120.0, 260.0], [220.0, 260.0]]\"\n      ],\n      \"actual\": [\n        \"[[110,130],[210,130],[110,230],[210,230]]\"\n      ]\n    },\n    {\n      \"line\": 938,\n      \"program\": \".[] | . as {$a, b: [$c, {$d}]} ?// [$a, {$b}, $e] ?// $f | [$a, $b, $c, $d, $e, $f]\",\n      \"status\": \"fail\",\n      \"detail\": \"output mismatch\",\n      \"expect_failure\": false,\n      \"expected\": [\n        \"[1, null, 2, 3, null, null]\",\n        \"[4, 5, null, null, 7, null]\",\n        \"[null, null, null, null, null, \\\"foo\\\"]\"\n      ],\n      \"actual\": []\n    },\n    {\n      \"line\": 1045,\n      \"program\": \". as $dot|any($dot[];not)\",\n      \"status\": \"fail\",\n      \"detail\": \"output mismatch\",\n      \"expect_failure\": false,\n      \"expected\": [\n        \"true\"\n      ],\n      \"actual\": [\n        \"false\"\n      ]\n    },\n    {\n      \"line\": 1053,\n      \"program\": \". as $dot|all($dot[];.)\",\n      \"status\": \"fail\",\n      \"detail\": \"output mismatch\",\n      \"expect_failure\": false,\n      \"expected\": [\n        \"false\"\n      ],\n      \"actual\": [\n        \"true\"\n      ]\n    },\n    {\n      \"line\": 1123,\n      \"program\": \"try path(.a | map(select(.b == 0))) catch .\",\n      \"status\": \"fail\",\n      \"detail\": \"output mismatch\",\n      \"expect_failure\": false,\n      \"expected\": [\n        \"\\\"Invalid path expression with result [{\\\\\\\"b\\\\\\\":0}]\\\"\"\n      ],\n      \"actual\": [\n        \"\\\"unknown function path\\\"\"\n      ]\n    },\n    {\n      \"line\": 1127,\n      \"program\": \"try path(.a | map(select(.b == 0)) | .[0]) catch .\",\n      \"status\": \"fail\",\n      \"detail\": \"output mismatch\",\n      \"expect_failure\": false,\n      \"expected\": [\n        \"\\\"Invalid path expression near attempt to access element 0 of [{\\\\\\\"b\\\\\\\":0}]\\\"\"\n      ],\n      \"actual\": [\n        \"\\\"unknown function path\\\"\"\n      ]\n    },\n    {\n      \"line\": 1131,\n      \"program\": \"try path(.a | map(select(.b == 0)) | .c) catch .\",\n      \"status\": \"fail\",\n      \"detail\": \"output mismatch\",\n      \"expect_failure\": false,\n      \"expected\": [\n        \"\\\"Invalid path expression near attempt to access element \\\\\\\"c\\\\\\\" of [{\\\\\\\"b\\\\\\\":0}]\\\"\"\n      ],\n      \"actual\": [\n        \"\\\"unknown function path\\\"\"\n      ]\n    },\n    {\n      \"line\": 1135,\n      \"program\": \"try path(.a | map(select(.b == 0)) | .[]) catch .\",\n      \"status\": \"fail\",\n      \"detail\": \"output mismatch\",\n      \"expect_failure\": false,\n      \"expected\": [\n        \"\\\"Invalid path expression near attempt to iterate through [{\\\\\\\"b\\\\\\\":0}]\\\"\"\n      ],\n      \"actual\": [\n        \"\\\"unknown function path\\\"\"\n      ]\n    },\n    {\n      \"line\": 1147,\n      \"program\": \"[\\\"foo\\\",1] as $p | getpath($p), setpath($p; 20), delpaths([$p])\",\n      \"status\": \"fail\",\n      \"detail\": \"output mismatch\",\n      \"expect_failure\": false,\n      \"expected\": [\n        \"\\\"b\\\"\",\n        \"{\\\"bar\\\": 42, \\\"foo\\\": [\\\"a\\\", 20, \\\"c\\\", \\\"d\\\"]}\",\n        \"{\\\"bar\\\": 42, \\\"foo\\\": [\\\"a\\\", \\\"c\\\", \\\"d\\\"]}\"\n      ],\n      \"actual\": []\n    },\n    {\n      \"line\": 1163,\n      \"program\": \"[\\\"foo\\\",1] as $p | getpath($p), setpath($p; 20), delpaths([$p])\",\n      \"status\": \"fail\",\n      \"detail\": \"output mismatch\",\n      \"expect_failure\": false,\n      \"expected\": [\n        \"null\",\n        \"{\\\"bar\\\":false, \\\"foo\\\": [null, 20]}\",\n        \"{\\\"bar\\\":false}\"\n      ],\n      \"actual\": []\n    },\n    {\n      \"line\": 1173,\n      \"program\": \"try delpaths(0) catch .\",\n      \"status\": \"fail\",\n      \"detail\": \"output mismatch\",\n      \"expect_failure\": false,\n      \"expected\": [\n        \"\\\"Paths must be specified as an array\\\"\"\n      ],\n      \"actual\": [\n        \"\\\"unknown function delpaths\\\"\"\n      ]\n    },\n    {\n      \"line\": 1214,\n      \"program\": \"try pick(last) catch .\",\n      \"status\": \"fail\",\n      \"detail\": \"output mismatch\",\n      \"expect_failure\": false,\n      \"expected\": [\n        \"\\\"Out of bounds negative array index\\\"\"\n      ],\n      \"actual\": [\n        \"\\\"unknown function pick\\\"\"\n      ]\n    },\n    {\n      \"line\": 1253,\n      \"program\": \"def inc(x): x |= .+1; inc(.[].a)\",\n      \"status\": \"fail\",\n      \"detail\": \"output mismatch\",\n      \"expect_failure\": false,\n      \"expected\": [\n        \"[{\\\"a\\\":2,\\\"b\\\":2},{\\\"a\\\":3,\\\"b\\\":4},{\\\"a\\\":8,\\\"b\\\":8}]\"\n      ],\n      \"actual\": []\n    },\n    {\n      \"line\": 1258,\n      \"program\": \".[] | try (getpath([\\\"a\\\",0,\\\"b\\\"]) |= 5) catch .\",\n      \"status\": \"fail\",\n      \"detail\": \"output mismatch\",\n      \"expect_failure\": false,\n      \"expected\": [\n        \"{\\\"a\\\":[{\\\"b\\\":5}]}\",\n        \"{\\\"b\\\":0,\\\"a\\\":[{\\\"b\\\":5}]}\",\n        \"\\\"Cannot index number with number (0)\\\"\",\n        \"{\\\"a\\\":[{\\\"b\\\":5}]}\",\n        \"\\\"Cannot index number with string (\\\\\\\"b\\\\\\\")\\\"\",\n        \"\\\"Cannot index object with number (0)\\\"\",\n        \"{\\\"a\\\":[{\\\"b\\\":5}]}\",\n        \"{\\\"a\\\":[{\\\"c\\\":3,\\\"b\\\":5}]}\"\n      ],\n      \"actual\": []\n    },\n    {\n      \"line\": 1290,\n      \"program\": \"try ((map(select(.a == 1))[].b) = 10) catch .\",\n      \"status\": \"fail\",\n      \"detail\": \"output mismatch\",\n      \"expect_failure\": false,\n      \"expected\": [\n        \"\\\"Invalid path expression near attempt to iterate through [{\\\\\\\"a\\\\\\\":1}]\\\"\"\n      ],\n      \"actual\": []\n    },\n    {\n      \"line\": 1294,\n      \"program\": \"try ((map(select(.a == 1))[].a) |= .+1) catch .\",\n      \"status\": \"fail\",\n      \"detail\": \"output mismatch\",\n      \"expect_failure\": false,\n      \"expected\": [\n        \"\\\"Invalid path expression near attempt to iterate through [{\\\\\\\"a\\\\\\\":1}]\\\"\"\n      ],\n      \"actual\": []\n    },\n    {\n      \"line\": 1298,\n      \"program\": \"def x: .[1,2]; x=10\",\n      \"status\": \"fail\",\n      \"detail\": \"output mismatch\",\n      \"expect_failure\": false,\n      \"expected\": [\n        \"[0,10,10]\"\n      ],\n      \"actual\": []\n    },\n    {\n      \"line\": 1302,\n      \"program\": \"try (def x: reverse; x=10) catch .\",\n      \"status\": \"fail\",\n      \"detail\": \"output mismatch\",\n      \"expect_failure\": false,\n      \"expected\": [\n        \"\\\"Invalid path expression with result [2,1,0]\\\"\"\n      ],\n      \"actual\": []\n    },\n    {\n      \"line\": 1448,\n      \"program\": \"[.[]|try if . == 0 then error(\\\"foo\\\") elif . == 1 then .a elif . == 2 then empty else . end catch .]\",\n      \"status\": \"fail\",\n      \"detail\": \"output mismatch\",\n      \"expect_failure\": false,\n      \"expected\": [\n        \"[\\\"foo\\\",\\\"Cannot index number with string (\\\\\\\"a\\\\\\\")\\\",3]\"\n      ],\n      \"actual\": [\n        \"[\\\"foo\\\",\\\"cannot index value\\\",3]\"\n      ]\n    },\n    {\n      \"line\": 1464,\n      \"program\": \"try error(0) // 1\",\n      \"status\": \"fail\",\n      \"detail\": \"output mismatch\",\n      \"expect_failure\": false,\n      \"expected\": [\n        \"1\"\n      ],\n      \"actual\": []\n    },\n    {\n      \"line\": 1473,\n      \"program\": \"1 + try 2 catch 3 + 4\",\n      \"status\": \"fail\",\n      \"detail\": \"output mismatch\",\n      \"expect_failure\": false,\n      \"expected\": [\n        \"7\"\n      ],\n      \"actual\": [\n        \"3\"\n      ]\n    },\n    {\n      \"line\": 1481,\n      \"program\": \"try -.? catch .\",\n      \"status\": \"fail\",\n      \"detail\": \"output mismatch\",\n      \"expect_failure\": false,\n      \"expected\": [\n        \"\\\"string (\\\\\\\"foo\\\\\\\") cannot be negated\\\"\"\n      ],\n      \"actual\": []\n    },\n    {\n      \"line\": 1499,\n      \"program\": \"try error(\\\"\\\\($__loc__)\\\") catch .\",\n      \"status\": \"fail\",\n      \"detail\": \"output mismatch\",\n      \"expect_failure\": false,\n      \"expected\": [\n        \"\\\"{\\\\\\\"file\\\\\\\":\\\\\\\"<top-level>\\\\\\\",\\\\\\\"line\\\\\\\":1}\\\"\"\n      ],\n      \"actual\": [\n        \"\\\"variable $__loc__ is not defined\\\"\"\n      ]\n    },\n    {\n      \"line\": 1553,\n      \"program\": \"try _strindices(\\\"abc\\\") catch .\",\n      \"status\": \"fail\",\n      \"detail\": \"output mismatch\",\n      \"expect_failure\": false,\n      \"expected\": [\n        \"\\\"number (123) cannot be searched, as it is not a string\\\"\"\n      ],\n      \"actual\": [\n        \"\\\"unknown function _strindices\\\"\"\n      ]\n    },\n    {\n      \"line\": 1557,\n      \"program\": \"try _strindices(123) catch .\",\n      \"status\": \"fail\",\n      \"detail\": \"output mismatch\",\n      \"expect_failure\": false,\n      \"expected\": [\n        \"\\\"number (123) is not a string\\\"\"\n      ],\n      \"actual\": [\n        \"\\\"unknown function _strindices\\\"\"\n      ]\n    },\n    {\n      \"line\": 1575,\n      \"program\": \"try trim catch ., try ltrim catch ., try rtrim catch .\",\n      \"status\": \"fail\",\n      \"detail\": \"output mismatch\",\n      \"expect_failure\": false,\n      \"expected\": [\n        \"\\\"trim input must be a string\\\"\",\n        \"\\\"trim input must be a string\\\"\",\n        \"\\\"trim input must be a string\\\"\"\n      ],\n      \"actual\": [\n        \"\\\"trim input must be a string\\\"\",\n        \"\\\"ltrim input must be a string\\\"\",\n        \"\\\"rtrim input must be a string\\\"\"\n      ]\n    },\n    {\n      \"line\": 1839,\n      \"program\": \"try [\\\"OK\\\", bsearch(0)] catch [\\\"KO\\\",.]\",\n      \"status\": \"fail\",\n      \"detail\": \"output mismatch\",\n      \"expect_failure\": false,\n      \"expected\": [\n        \"[\\\"KO\\\",\\\"string (\\\\\\\"aa\\\\\\\") cannot be searched from\\\"]\"\n      ],\n      \"actual\": [\n        \"[\\\"KO\\\",\\\"unknown function bsearch\\\"]\"\n      ]\n    },\n    {\n      \"line\": 1868,\n      \"program\": \"try strftime(\\\"%Y-%m-%dT%H:%M:%SZ\\\") catch .\",\n      \"status\": \"fail\",\n      \"detail\": \"output mismatch\",\n      \"expect_failure\": false,\n      \"expected\": [\n        \"\\\"strftime/1 requires parsed datetime inputs\\\"\"\n      ],\n      \"actual\": [\n        \"\\\"unknown function strftime\\\"\"\n      ]\n    },\n    {\n      \"line\": 1872,\n      \"program\": \"try strflocaltime(\\\"%Y-%m-%dT%H:%M:%SZ\\\") catch .\",\n      \"status\": \"fail\",\n      \"detail\": \"output mismatch\",\n      \"expect_failure\": false,\n      \"expected\": [\n        \"\\\"strflocaltime/1 requires parsed datetime inputs\\\"\"\n      ],\n      \"actual\": [\n        \"\\\"unknown function strflocaltime\\\"\"\n      ]\n    },\n    {\n      \"line\": 1876,\n      \"program\": \"try mktime catch .\",\n      \"status\": \"fail\",\n      \"detail\": \"output mismatch\",\n      \"expect_failure\": false,\n      \"expected\": [\n        \"\\\"mktime requires parsed datetime inputs\\\"\"\n      ],\n      \"actual\": [\n        \"\\\"unknown function mktime\\\"\"\n      ]\n    },\n    {\n      \"line\": 1881,\n      \"program\": \"try [\\\"OK\\\", strftime([])] catch [\\\"KO\\\", .]\",\n      \"status\": \"fail\",\n      \"detail\": \"output mismatch\",\n      \"expect_failure\": false,\n      \"expected\": [\n        \"[\\\"KO\\\",\\\"strftime/1 requires a string format\\\"]\"\n      ],\n      \"actual\": [\n        \"[\\\"KO\\\",\\\"unknown function strftime\\\"]\"\n      ]\n    },\n    {\n      \"line\": 1885,\n      \"program\": \"try [\\\"OK\\\", strflocaltime({})] catch [\\\"KO\\\", .]\",\n      \"status\": \"fail\",\n      \"detail\": \"output mismatch\",\n      \"expect_failure\": false,\n      \"expected\": [\n        \"[\\\"KO\\\",\\\"strflocaltime/1 requires a string format\\\"]\"\n      ],\n      \"actual\": [\n        \"[\\\"KO\\\",\\\"unknown function strflocaltime\\\"]\"\n      ]\n    },\n    {\n      \"line\": 1900,\n      \"program\": \"import \\\"a\\\" as foo; import \\\"b\\\" as bar; def fooa: foo::a; [fooa, bar::a, bar::b, foo::a]\",\n      \"status\": \"skip\",\n      \"detail\": \"declared in exclusions.txt\",\n      \"expect_failure\": false,\n      \"expected\": [\n        \"[\\\"a\\\",\\\"b\\\",\\\"c\\\",\\\"a\\\"]\"\n      ],\n      \"actual\": []\n    },\n    {\n      \"line\": 1904,\n      \"program\": \"import \\\"c\\\" as foo; [foo::a, foo::c]\",\n      \"status\": \"skip\",\n      \"detail\": \"declared in exclusions.txt\",\n      \"expect_failure\": false,\n      \"expected\": [\n        \"[0,\\\"acmehbah\\\"]\"\n      ],\n      \"actual\": []\n    },\n    {\n      \"line\": 1908,\n      \"program\": \"include \\\"c\\\"; [a, c]\",\n      \"status\": \"skip\",\n      \"detail\": \"declared in exclusions.txt\",\n      \"expect_failure\": false,\n      \"expected\": [\n        \"[0,\\\"acmehbah\\\"]\"\n      ],\n      \"actual\": []\n    },\n    {\n      \"line\": 1912,\n      \"program\": \"import \\\"data\\\" as $e; import \\\"data\\\" as $d; [$d[].this,$e[].that,$d::d[].this,$e::e[].that]|join(\\\";\\\")\",\n      \"status\": \"skip\",\n      \"detail\": \"declared in exclusions.txt\",\n      \"expect_failure\": false,\n      \"expected\": [\n        \"\\\"is a test;is too;is a test;is too\\\"\"\n      ],\n      \"actual\": []\n    },\n    {\n      \"line\": 1917,\n      \"program\": \"import \\\"data\\\" as $a; import \\\"data\\\" as $b; def f: {$a, $b}; f\",\n      \"status\": \"skip\",\n      \"detail\": \"declared in exclusions.txt\",\n      \"expect_failure\": false,\n      \"expected\": [\n        \"{\\\"a\\\":[{\\\"this\\\":\\\"is a test\\\",\\\"that\\\":\\\"is too\\\"}],\\\"b\\\":[{\\\"this\\\":\\\"is a test\\\",\\\"that\\\":\\\"is too\\\"}]}\"\n      ],\n      \"actual\": []\n    },\n    {\n      \"line\": 1921,\n      \"program\": \"include \\\"shadow1\\\"; e\",\n      \"status\": \"skip\",\n      \"detail\": \"declared in exclusions.txt\",\n      \"expect_failure\": false,\n      \"expected\": [\n        \"2\"\n      ],\n      \"actual\": []\n    },\n    {\n      \"line\": 1925,\n      \"program\": \"include \\\"shadow1\\\"; include \\\"shadow2\\\"; e\",\n      \"status\": \"skip\",\n      \"detail\": \"declared in exclusions.txt\",\n      \"expect_failure\": false,\n      \"expected\": [\n        \"3\"\n      ],\n      \"actual\": []\n    },\n    {\n      \"line\": 1929,\n      \"program\": \"import \\\"shadow1\\\" as f; import \\\"shadow2\\\" as f; import \\\"shadow1\\\" as e; [e::e, f::e]\",\n      \"status\": \"skip\",\n      \"detail\": \"declared in exclusions.txt\",\n      \"expect_failure\": false,\n      \"expected\": [\n        \"[2,3]\"\n      ],\n      \"actual\": []\n    },\n    {\n      \"line\": 1969,\n      \"program\": \"modulemeta\",\n      \"status\": \"skip\",\n      \"detail\": \"declared in exclusions.txt\",\n      \"expect_failure\": false,\n      \"expected\": [\n        \"{\\\"whatever\\\":null,\\\"deps\\\":[{\\\"as\\\":\\\"foo\\\",\\\"is_data\\\":false,\\\"relpath\\\":\\\"a\\\"},{\\\"search\\\":\\\"./\\\",\\\"as\\\":\\\"d\\\",\\\"is_data\\\":false,\\\"relpath\\\":\\\"d\\\"},{\\\"search\\\":\\\"./\\\",\\\"as\\\":\\\"d2\\\",\\\"is_data\\\":false,\\\"relpath\\\":\\\"d\\\"},{\\\"search\\\":\\\"./../lib/jq\\\",\\\"as\\\":\\\"e\\\",\\\"is_data\\\":false,\\\"relpath\\\":\\\"e\\\"},{\\\"search\\\":\\\"./../lib/jq\\\",\\\"as\\\":\\\"f\\\",\\\"is_data\\\":false,\\\"relpath\\\":\\\"f\\\"},{\\\"as\\\":\\\"d\\\",\\\"is_data\\\":true,\\\"relpath\\\":\\\"data\\\"}],\\\"defs\\\":[\\\"a/0\\\",\\\"c/0\\\"]}\"\n      ],\n      \"actual\": []\n    },\n    {\n      \"line\": 1973,\n      \"program\": \"modulemeta | .deps | length\",\n      \"status\": \"skip\",\n      \"detail\": \"declared in exclusions.txt\",\n      \"expect_failure\": false,\n      \"expected\": [\n        \"6\"\n      ],\n      \"actual\": []\n    },\n    {\n      \"line\": 1977,\n      \"program\": \"modulemeta | .defs | length\",\n      \"status\": \"skip\",\n      \"detail\": \"declared in exclusions.txt\",\n      \"expect_failure\": false,\n      \"expected\": [\n        \"2\"\n      ],\n      \"actual\": []\n    },\n    {\n      \"line\": 1982,\n      \"program\": \"import \\\"syntaxerror\\\" as e; .\",\n      \"status\": \"skip\",\n      \"detail\": \"declared in exclusions.txt\",\n      \"expect_failure\": true,\n      \"expected\": [],\n      \"actual\": []\n    },\n    {\n      \"line\": 1993,\n      \"program\": \"import \\\"test_bind_order\\\" as check; check::check\",\n      \"status\": \"skip\",\n      \"detail\": \"declared in exclusions.txt\",\n      \"expect_failure\": false,\n      \"expected\": [\n        \"true\"\n      ],\n      \"actual\": []\n    },\n    {\n      \"line\": 1997,\n      \"program\": \"try -. catch .\",\n      \"status\": \"fail\",\n      \"detail\": \"output mismatch\",\n      \"expect_failure\": false,\n      \"expected\": [\n        \"\\\"string (\\\\\\\"very-long-long-long-long...\\\\\\\") cannot be negated\\\"\"\n      ],\n      \"actual\": []\n    },\n    {\n      \"line\": 2001,\n      \"program\": \"try (.-.) catch .\",\n      \"status\": \"fail\",\n      \"detail\": \"output mismatch\",\n      \"expect_failure\": false,\n      \"expected\": [\n        \"\\\"string (\\\\\\\"very-long-long-long-long...\\\\\\\") and string (\\\\\\\"very-long-long-long-long...\\\\\\\") cannot be subtracted\\\"\"\n      ],\n      \"actual\": []\n    },\n    {\n      \"line\": 2005,\n      \"program\": \"\\\"x\\\" * range(0; 12; 2) + \\\"\\u2606\\\" * 8 | try -. catch .\",\n      \"status\": \"fail\",\n      \"detail\": \"output mismatch\",\n      \"expect_failure\": false,\n      \"expected\": [\n        \"\\\"string (\\\\\\\"\\u2606\\u2606\\u2606\\u2606\\u2606\\u2606\\u2606\\u2606\\\\\\\") cannot be negated\\\"\",\n        \"\\\"string (\\\\\\\"xx\\u2606\\u2606\\u2606\\u2606\\u2606\\u2606\\u2606\\u2606\\\\\\\") cannot be negated\\\"\",\n        \"\\\"string (\\\\\\\"xxxx\\u2606\\u2606\\u2606\\u2606\\u2606\\u2606...\\\\\\\") cannot be negated\\\"\",\n        \"\\\"string (\\\\\\\"xxxxxx\\u2606\\u2606\\u2606\\u2606\\u2606\\u2606...\\\\\\\") cannot be negated\\\"\",\n        \"\\\"string (\\\\\\\"xxxxxxxx\\u2606\\u2606\\u2606\\u2606\\u2606...\\\\\\\") cannot be negated\\\"\",\n        \"\\\"string (\\\\\\\"xxxxxxxxxx\\u2606\\u2606\\u2606\\u2606...\\\\\\\") cannot be negated\\\"\"\n      ],\n      \"actual\": []\n    },\n    {\n      \"line\": 2014,\n      \"program\": \"try (. + \\\"x\\\") catch . == if have_decnum then \\\"number (12345678901234567890123456...) and string (\\\\\\\"x\\\\\\\") cannot be added\\\" else \\\"number (12345678901234568000000000...) and string (\\\\\\\"x\\\\\\\") cannot be added\\\" end\",\n      \"status\": \"fail\",\n      \"detail\": \"output mismatch\",\n      \"expect_failure\": false,\n      \"expected\": [\n        \"true\"\n      ],\n      \"actual\": []\n    },\n    {\n      \"line\": 2034,\n      \"program\": \"try join(\\\",\\\") catch .\",\n      \"status\": \"fail\",\n      \"detail\": \"output mismatch\",\n      \"expect_failure\": false,\n      \"expected\": [\n        \"\\\"string (\\\\\\\"1,2,\\\\\\\") and object ({\\\\\\\"a\\\\\\\":{\\\\\\\"b\\\\\\\":{\\\\\\\"c\\\\\\\":33}}}) cannot be added\\\"\"\n      ],\n      \"actual\": [\n        \"\\\"1,2,{\\\\\\\"a\\\\\\\":{\\\\\\\"b\\\\\\\":{\\\\\\\"c\\\\\\\":33}}}\\\"\"\n      ]\n    },\n    {\n      \"line\": 2038,\n      \"program\": \"try join(\\\",\\\") catch .\",\n      \"status\": \"fail\",\n      \"detail\": \"output mismatch\",\n      \"expect_failure\": false,\n      \"expected\": [\n        \"\\\"string (\\\\\\\"1,2,\\\\\\\") and array ([3,4,5]) cannot be added\\\"\"\n      ],\n      \"actual\": [\n        \"\\\"1,2,[3,4,5]\\\"\"\n      ]\n    },\n    {\n      \"line\": 2067,\n      \"program\": \"[range(-52;52;1)] as $powers | [$powers[]|pow(2;.)|log2|round] == $powers\",\n      \"status\": \"fail\",\n      \"detail\": \"exited 1: Traceback (most recent call last):\",\n      \"expect_failure\": false,\n      \"expected\": [\n        \"true\"\n      ],\n      \"actual\": []\n    },\n    {\n      \"line\": 2130,\n      \"program\": \"(.a as $x | .b) = \\\"b\\\"\",\n      \"status\": \"fail\",\n      \"detail\": \"output mismatch\",\n      \"expect_failure\": false,\n      \"expected\": [\n        \"{\\\"a\\\":null,\\\"b\\\":\\\"b\\\"}\"\n      ],\n      \"actual\": []\n    },\n    {\n      \"line\": 2196,\n      \"program\": \".[0] | tostring | . == if have_decnum then \\\"13911860366432393\\\" else \\\"13911860366432392\\\" end\",\n      \"status\": \"fail\",\n      \"detail\": \"output mismatch\",\n      \"expect_failure\": false,\n      \"expected\": [\n        \"true\"\n      ],\n      \"actual\": [\n        \"false\"\n      ]\n    },\n    {\n      \"line\": 2200,\n      \"program\": \".x | tojson | . == if have_decnum then \\\"13911860366432393\\\" else \\\"13911860366432392\\\" end\",\n      \"status\": \"fail\",\n      \"detail\": \"output mismatch\",\n      \"expect_failure\": false,\n      \"expected\": [\n        \"true\"\n      ],\n      \"actual\": [\n        \"false\"\n      ]\n    },\n    {\n      \"line\": 2204,\n      \"program\": \"(13911860366432393 == 13911860366432392) | . == if have_decnum then false else true end\",\n      \"status\": \"fail\",\n      \"detail\": \"output mismatch\",\n      \"expect_failure\": false,\n      \"expected\": [\n        \"true\"\n      ],\n      \"actual\": [\n        \"false\"\n      ]\n    },\n    {\n      \"line\": 2224,\n      \"program\": \"-. | tojson == if have_decnum then \\\"-13911860366432393\\\" else \\\"-13911860366432392\\\" end\",\n      \"status\": \"fail\",\n      \"detail\": \"output mismatch\",\n      \"expect_failure\": false,\n      \"expected\": [\n        \"true\"\n      ],\n      \"actual\": [\n        \"false\"\n      ]\n    },\n    {\n      \"line\": 2232,\n      \"program\": \"[1E+1000,-1E+1000 | tojson] == if have_decnum then [\\\"1E+1000\\\",\\\"-1E+1000\\\"] else [\\\"1.7976931348623157e+308\\\",\\\"-1.7976931348623157e+308\\\"] end\",\n      \"status\": \"fail\",\n      \"detail\": \"output mismatch\",\n      \"expect_failure\": false,\n      \"expected\": [\n        \"true\"\n      ],\n      \"actual\": []\n    },\n    {\n      \"line\": 2241,\n      \"program\": \".[] as $n | $n+0 | [., tostring, . == $n]\",\n      \"status\": \"fail\",\n      \"detail\": \"output mismatch\",\n      \"expect_failure\": false,\n      \"expected\": [\n        \"[-9007199254740992,\\\"-9007199254740992\\\",true]\",\n        \"[-9007199254740992,\\\"-9007199254740992\\\",true]\",\n        \"[9007199254740992,\\\"9007199254740992\\\",true]\",\n        \"[9007199254740992,\\\"9007199254740992\\\",true]\",\n        \"[13911860366432392,\\\"13911860366432392\\\",true]\"\n      ],\n      \"actual\": [\n        \"[-9007199254740993,\\\"-9007199254740993\\\",true]\",\n        \"[-9007199254740992,\\\"-9007199254740992\\\",true]\",\n        \"[9007199254740992,\\\"9007199254740992\\\",true]\",\n        \"[9007199254740993,\\\"9007199254740993\\\",true]\",\n        \"[13911860366432393,\\\"13911860366432393\\\",true]\"\n      ]\n    },\n    {\n      \"line\": 2271,\n      \"program\": \"[1E+1000,-1E+1000 | abs | tojson] | unique == if have_decnum then [\\\"1E+1000\\\"] else [\\\"1.7976931348623157e+308\\\"] end\",\n      \"status\": \"fail\",\n      \"detail\": \"output mismatch\",\n      \"expect_failure\": false,\n      \"expected\": [\n        \"true\"\n      ],\n      \"actual\": []\n    },\n    {\n      \"line\": 2275,\n      \"program\": \"[1E+1000,-1E+1000 | length | tojson] | unique == if have_decnum then [\\\"1E+1000\\\"] else [\\\"1.7976931348623157e+308\\\"] end\",\n      \"status\": \"fail\",\n      \"detail\": \"output mismatch\",\n      \"expect_failure\": false,\n      \"expected\": [\n        \"true\"\n      ],\n      \"actual\": []\n    },\n    {\n      \"line\": 2324,\n      \"program\": \".[] | try (fromjson | isnan) catch .\",\n      \"status\": \"fail\",\n      \"detail\": \"output mismatch\",\n      \"expect_failure\": false,\n      \"expected\": [\n        \"true\",\n        \"true\",\n        \"\\\"Invalid numeric literal at EOF at line 1, column 4 (while parsing 'NaN1')\\\"\",\n        \"\\\"Invalid numeric literal at EOF at line 1, column 5 (while parsing 'NaN10')\\\"\",\n        \"\\\"Invalid numeric literal at EOF at line 1, column 6 (while parsing 'NaN100')\\\"\",\n        \"\\\"Invalid numeric literal at EOF at line 1, column 7 (while parsing 'NaN1000')\\\"\",\n        \"\\\"Invalid numeric literal at EOF at line 1, column 8 (while parsing 'NaN10000')\\\"\",\n        \"\\\"Invalid numeric literal at EOF at line 1, column 9 (while parsing 'NaN100000')\\\"\"\n      ],\n      \"actual\": [\n        \"true\",\n        \"\\\"invalid JSON\\\"\",\n        \"\\\"invalid JSON\\\"\",\n        \"\\\"invalid JSON\\\"\",\n        \"\\\"invalid JSON\\\"\",\n        \"\\\"invalid JSON\\\"\",\n        \"\\\"invalid JSON\\\"\",\n        \"\\\"invalid JSON\\\"\"\n      ]\n    },\n    {\n      \"line\": 2337,\n      \"program\": \"try input catch .\",\n      \"status\": \"fail\",\n      \"detail\": \"output mismatch\",\n      \"expect_failure\": false,\n      \"expected\": [\n        \"\\\"break\\\"\"\n      ],\n      \"actual\": [\n        \"\\\"unknown function input\\\"\"\n      ]\n    },\n    {\n      \"line\": 2390,\n      \"program\": \".[] |= try tonumber\",\n      \"status\": \"fail\",\n      \"detail\": \"output mismatch\",\n      \"expect_failure\": false,\n      \"expected\": [\n        \"[1, 3, 6.7, 0.89, -876, 5.43, 21]\"\n      ],\n      \"actual\": [\n        \"[1,3,4,5,6.7,-876,21]\"\n      ]\n    },\n    {\n      \"line\": 2407,\n      \"program\": \"map(try implode catch .)\",\n      \"status\": \"fail\",\n      \"detail\": \"output mismatch\",\n      \"expect_failure\": false,\n      \"expected\": [\n        \"[\\\"implode input must be an array\\\",\\\"string (\\\\\\\"a\\\\\\\") can't be imploded, unicode codepoint needs to be numeric\\\",\\\"number (null) can't be imploded, unicode codepoint needs to be numeric\\\"]\"\n      ],\n      \"actual\": []\n    },\n    {\n      \"line\": 2411,\n      \"program\": \"try 0[implode] catch .\",\n      \"status\": \"fail\",\n      \"detail\": \"output mismatch\",\n      \"expect_failure\": false,\n      \"expected\": [\n        \"\\\"Cannot index number with string (\\\\\\\"\\\\\\\")\\\"\"\n      ],\n      \"actual\": [\n        \"\\\"implode input must be an array\\\"\"\n      ]\n    },\n    {\n      \"line\": 2475,\n      \"program\": \"try ([range(3)] | .[nan] = 9) catch .\",\n      \"status\": \"fail\",\n      \"detail\": \"output mismatch\",\n      \"expect_failure\": false,\n      \"expected\": [\n        \"\\\"Cannot set array element at NaN index\\\"\"\n      ],\n      \"actual\": []\n    },\n    {\n      \"line\": 2479,\n      \"program\": \"try (\\\"foobar\\\" | .[1.5:3.5] = \\\"xyz\\\") catch .\",\n      \"status\": \"fail\",\n      \"detail\": \"output mismatch\",\n      \"expect_failure\": false,\n      \"expected\": [\n        \"\\\"Cannot update string slices\\\"\"\n      ],\n      \"actual\": []\n    },\n    {\n      \"line\": 2483,\n      \"program\": \"try ([range(10)] | .[1.5:3.5] = [\\\"xyz\\\"]) catch .\",\n      \"status\": \"fail\",\n      \"detail\": \"output mismatch\",\n      \"expect_failure\": false,\n      \"expected\": [\n        \"[0,\\\"xyz\\\",4,5,6,7,8,9]\"\n      ],\n      \"actual\": []\n    },\n    {\n      \"line\": 2487,\n      \"program\": \"try (\\\"foobar\\\" | .[1.5]) catch .\",\n      \"status\": \"fail\",\n      \"detail\": \"output mismatch\",\n      \"expect_failure\": false,\n      \"expected\": [\n        \"\\\"Cannot index string with number (1.5)\\\"\"\n      ],\n      \"actual\": [\n        \"\\\"cannot index string with number\\\"\"\n      ]\n    },\n    {\n      \"line\": 2494,\n      \"program\": \"try [\\\"ok\\\", setpath([1]; 1)] catch [\\\"ko\\\", .]\",\n      \"status\": \"fail\",\n      \"detail\": \"output mismatch\",\n      \"expect_failure\": false,\n      \"expected\": [\n        \"[\\\"ko\\\",\\\"Cannot index object with number (1)\\\"]\"\n      ],\n      \"actual\": [\n        \"[\\\"ko\\\",\\\"unknown function setpath\\\"]\"\n      ]\n    },\n    {\n      \"line\": 2498,\n      \"program\": \"try fromjson catch .\",\n      \"status\": \"fail\",\n      \"detail\": \"output mismatch\",\n      \"expect_failure\": false,\n      \"expected\": [\n        \"\\\"Invalid string literal; expected \\\\\\\", but got ' at line 1, column 5 (while parsing '{'a': 123}')\\\"\"\n      ],\n      \"actual\": [\n        \"\\\"invalid JSON\\\"\"\n      ]\n    },\n    {\n      \"line\": 2504,\n      \"program\": \"try ltrimstr(1) catch \\\"x\\\", try rtrimstr(1) catch \\\"x\\\" | \\\"ok\\\"\",\n      \"status\": \"fail\",\n      \"detail\": \"output mismatch\",\n      \"expect_failure\": false,\n      \"expected\": [\n        \"\\\"ok\\\"\",\n        \"\\\"ok\\\"\"\n      ],\n      \"actual\": [\n        \"\\\"x\\\"\",\n        \"\\\"ok\\\"\"\n      ]\n    },\n    {\n      \"line\": 2509,\n      \"program\": \"try ltrimstr(\\\"x\\\") catch \\\"x\\\", try rtrimstr(\\\"x\\\") catch \\\"x\\\" | \\\"ok\\\"\",\n      \"status\": \"fail\",\n      \"detail\": \"output mismatch\",\n      \"expect_failure\": false,\n      \"expected\": [\n        \"\\\"ok\\\"\",\n        \"\\\"ok\\\"\"\n      ],\n      \"actual\": [\n        \"\\\"x\\\"\",\n        \"\\\"ok\\\"\"\n      ]\n    },\n    {\n      \"line\": 2533,\n      \"program\": \"try [\\\"OK\\\", setpath([[1]]; 1)] catch [\\\"KO\\\", .]\",\n      \"status\": \"fail\",\n      \"detail\": \"output mismatch\",\n      \"expect_failure\": false,\n      \"expected\": [\n        \"[\\\"KO\\\",\\\"Cannot update field at array index of array\\\"]\"\n      ],\n      \"actual\": [\n        \"[\\\"KO\\\",\\\"unknown function setpath\\\"]\"\n      ]\n    },\n    {\n      \"line\": 2577,\n      \"program\": \"try setpath([range(10001) | 0]; 0) catch .\",\n      \"status\": \"fail\",\n      \"detail\": \"output mismatch\",\n      \"expect_failure\": false,\n      \"expected\": [\n        \"\\\"Path too deep\\\"\"\n      ],\n      \"actual\": [\n        \"\\\"unknown function setpath\\\"\"\n      ]\n    },\n    {\n      \"line\": 2585,\n      \"program\": \"try getpath([range(10001) | 0]) catch .\",\n      \"status\": \"fail\",\n      \"detail\": \"output mismatch\",\n      \"expect_failure\": false,\n      \"expected\": [\n        \"\\\"Path too deep\\\"\"\n      ],\n      \"actual\": [\n        \"\\\"unknown function getpath\\\"\"\n      ]\n    },\n    {\n      \"line\": 2593,\n      \"program\": \"try delpaths([[range(10001) | 0]]) catch .\",\n      \"status\": \"fail\",\n      \"detail\": \"output mismatch\",\n      \"expect_failure\": false,\n      \"expected\": [\n        \"\\\"Path too deep\\\"\"\n      ],\n      \"actual\": [\n        \"\\\"unknown function delpaths\\\"\"\n      ]\n    },\n    {\n      \"line\": 2602,\n      \"program\": \"try (reduce range(10001) as $_ ([]; [.]) as $x | $x | contains($x)) catch .\",\n      \"status\": \"fail\",\n      \"detail\": \"exited 1: Traceback (most recent call last):\",\n      \"expect_failure\": false,\n      \"expected\": [\n        \"\\\"Containment check too deep\\\"\"\n      ],\n      \"actual\": []\n    },\n    {\n      \"line\": 2611,\n      \"program\": \"try (reduce range(10001) as $_ ({}; {a: .}) as $x | $x * $x) catch .\",\n      \"status\": \"fail\",\n      \"detail\": \"exited 1: Traceback (most recent call last):\",\n      \"expect_failure\": false,\n      \"expected\": [\n        \"\\\"Object merge too deep\\\"\"\n      ],\n      \"actual\": []\n    }\n  ]\n}\n\n\n","exit_code":0,"status":"completed"}}
{"type":"item.started","item":{"id":"item_6","type":"command_execution","command":"/bin/bash -lc \"python3 - <<'PY'\nimport subprocess,os\np='try ((reduce range(10001) as \"'$_ ([]; [.])) as $x | (reduce range(10001) as $_ ([]; [.])) as $y | $x == $y) catch .'\"'\nr=subprocess.run(['./jq','-c',p],input='null\\\\n',text=True,capture_output=True,env={**os.environ})\nprint(r.returncode, r.stdout, r.stderr[-200:])\nPY\npython3 - <<'PY'\nimport json,os,subprocess,sys\nfor sel in [r'\\\\.\\\\|\\\\[|\\\\{|\\\\+|\\\\-|\\\\*|/|%', r'%%FAIL|if |try |reduce |foreach |def | as |label |module|include']:\n r=subprocess.run([sys.executable,'sources/run_conformance.py','--select',sel,'--json'],capture_output=True,text=True,env={**os.environ,'JQ':os.path.abspath('jq')})\n print('RC',r.returncode, json.loads(r.stdout)['summary'])\nPY\"","aggregated_output":"","exit_code":null,"status":"in_progress"}}
{"type":"item.completed","item":{"id":"item_7","type":"agent_message","text":"The isolated deep-equality case now returns the required jq runtime value and exit 0. I’m rerunning the full declared slices with a longer harness window; the earlier combined run hit the shell timeout before the second report completed."}}
{"type":"item.started","item":{"id":"item_8","type":"command_execution","command":"/bin/bash -lc \"python3 - <<'PY'\nimport json,os,subprocess,sys\nselectors=[r'\\\\.\\\\|\\\\[|\\\\{|\\\\+|\\\\-|\\\\*|/|%', r'%%FAIL|if |try |reduce |foreach |def | as |label |module|include']\nfor sel in selectors:\n r=subprocess.run([sys.executable,'sources/run_conformance.py','--select',sel,'--json'],capture_output=True,text=True,env={**os.environ,'JQ':os.path.abspath('jq')},timeout=180)\n report=json.loads(r.stdout)\n print(sel, 'rc=',r.returncode, 'summary=',report['summary'])\n for case in report['cases']:\n  if case['status'] in ('fail','error'):\n   print(case['line'],case['program'],case['detail'])\nPY\"","aggregated_output":"","exit_code":null,"status":"in_progress"}}
{"type":"item.completed","item":{"id":"item_6","type":"command_execution","command":"/bin/bash -lc \"python3 - <<'PY'\nimport subprocess,os\np='try ((reduce range(10001) as \"'$_ ([]; [.])) as $x | (reduce range(10001) as $_ ([]; [.])) as $y | $x == $y) catch .'\"'\nr=subprocess.run(['./jq','-c',p],input='null\\\\n',text=True,capture_output=True,env={**os.environ})\nprint(r.returncode, r.stdout, r.stderr[-200:])\nPY\npython3 - <<'PY'\nimport json,os,subprocess,sys\nfor sel in [r'\\\\.\\\\|\\\\[|\\\\{|\\\\+|\\\\-|\\\\*|/|%', r'%%FAIL|if |try |reduce |foreach |def | as |label |module|include']:\n r=subprocess.run([sys.executable,'sources/run_conformance.py','--select',sel,'--json'],capture_output=True,text=True,env={**os.environ,'JQ':os.path.abspath('jq')})\n print('RC',r.returncode, json.loads(r.stdout)['summary'])\nPY\"","aggregated_output":"0 \"Equality check too deep\"\n \nRC 1 {'pass': 145, 'fail': 64, 'error': 0, 'skip': 1}\nRC 1 {'pass': 132, 'fail': 78, 'error': 1, 'skip': 13}\n","exit_code":0,"status":"completed"}}
{"type":"item.completed","item":{"id":"item_8","type":"command_execution","command":"/bin/bash -lc \"python3 - <<'PY'\nimport json,os,subprocess,sys\nselectors=[r'\\\\.\\\\|\\\\[|\\\\{|\\\\+|\\\\-|\\\\*|/|%', r'%%FAIL|if |try |reduce |foreach |def | as |label |module|include']\nfor sel in selectors:\n r=subprocess.run([sys.executable,'sources/run_conformance.py','--select',sel,'--json'],capture_output=True,text=True,env={**os.environ,'JQ':os.path.abspath('jq')},timeout=180)\n report=json.loads(r.stdout)\n print(sel, 'rc=',r.returncode, 'summary=',report['summary'])\n for case in report['cases']:\n  if case['status'] in ('fail','error'):\n   print(case['line'],case['program'],case['detail'])\nPY\"","aggregated_output":"\\.\\|\\[|\\{|\\+|\\-|\\*|/|% rc= 1 summary= {'pass': 145, 'fail': 64, 'error': 0, 'skip': 1}\n122 {\"a\",b,\"a$\\(1+1)\"} output mismatch\n283 [.[-4,-3,-2,-1,0,1,2,3]] output mismatch\n311 [while(.<100; .*2)] output mismatch\n329 [.[]|[.,1]|until(.[0] < 1; [.[0] - 1, .[1] * .[0]])|.[1]] output mismatch\n353 [foreach .[] / .[] as $i (0; . + $i)] output mismatch\n405 [nth(0,5,9,10,15; range(.)), try nth(-1; range(.)) catch .] output mismatch\n425 [nth(5,7; range(9;0;-1))] output mismatch\n474 del(.[2:4],.[0],.[-2:]) output mismatch\n530 . as {as: $kw, \"str\": $str, (\"e\"+\"x\"+\"p\"): $exp} | [$kw, $str, $exp] output mismatch\n566 . as {(true):$foo} | $foo program was accepted, but the corpus marks it %%FAIL\n617 {\"a\":1} + {\"b\":2} + {\"c\":3} output mismatch\n633 [1,2,3,4,1] - [.,3] output mismatch\n661 9E999999999, 9999999999E999999990, 1E-999999999, 0.000000001E-999999990 output mismatch\n689 [(infinite, -infinite) % (1, -1, infinite)] output mismatch\n693 [nan % 1, 1 % nan | isnan] output mismatch\n798 def f: 1; def g: f, def f: 2; def g: 3; f, def f: g; f, g; def f: 4; [f, def f: g; def g: 5; f, g]+[f,g] output mismatch\n868 def f: .+1; def g: f; def f: .+100; def f(a):a+.+11; [(g|f(20)), f] output mismatch\n873 def id(x):x; 2000 as $x | def f(x):1 as $x | id([$x, x, x]); def g(x): 100 as $x | f($x,$x+x); g($x) output mismatch\n884 [[20,10][1,0] as $x | def f: (100,200) as $y | def g: [$x + $y, .]; . + $x | g; f[0] | [f][0][1] | f] output mismatch\n938 .[] | . as {$a, b: [$c, {$d}]} ?// [$a, {$b}, $e] ?// $f | [$a, $b, $c, $d, $e, $f] output mismatch\n1169 delpaths([[-200]]) output mismatch\n1184 del(.[1], .[-6], .[2], .[-3:9]) output mismatch\n1197 setpath([-1]; 1) output mismatch\n1253 def inc(x): x |= .+1; inc(.[].a) output mismatch\n1294 try ((map(select(.a == 1))[].a) |= .+1) catch . output mismatch\n1370 [.[] | [.foo[] // .bar]] output mismatch\n1374 .[] //= .[0] output mismatch\n1464 try error(0) // 1 output mismatch\n1473 1 + try 2 catch 3 + 4 output mismatch\n1481 try -.? catch . output mismatch\n1625 [.[] * \"abc\"] output mismatch\n1629 [. * (nan,-nan)] output mismatch\n1677 (sort_by(.b) | sort_by(.a)), sort_by(.a, .b), sort_by(.b, .c), group_by(.b), group_by(.a + .b - .c == 2) output mismatch\n1721 with_entries(.key |= \"KEY_\" + .) output mismatch\n1835 bsearch({x:1}) output mismatch\n1843 strftime(\"%Y-%m-%dT%H:%M:%SZ\") output mismatch\n1847 strftime(\"%A, %B %d, %Y\") output mismatch\n1851 strftime(\"%Y-%m-%dT%H:%M:%SZ\") output mismatch\n1868 try strftime(\"%Y-%m-%dT%H:%M:%SZ\") catch . output mismatch\n1872 try strflocaltime(\"%Y-%m-%dT%H:%M:%SZ\") catch . output mismatch\n1885 try [\"OK\", strflocaltime({})] catch [\"KO\", .] output mismatch\n1889 [strptime(\"%Y-%m-%dT%H:%M:%SZ\")|(.,mktime)] output mismatch\n1895 last(range(365 * 67)|(\"1970-03-01T01:02:03Z\"|strptime(\"%Y-%m-%dT%H:%M:%SZ\")|mktime) + (86400 * .)|strftime(\"%Y-%m-%dT%H:%M:%SZ\")|strptime(\"%Y-%m-%dT%H:%M:%SZ\")) output mismatch\n1997 try -. catch . output mismatch\n2001 try (.-.) catch . output mismatch\n2005 \"x\" * range(0; 12; 2) + \"☆\" * 8 | try -. catch . output mismatch\n2014 try (. + \"x\") catch . == if have_decnum then \"number (12345678901234567890123456...) and string (\\\"x\\\") cannot be added\" else \"number (12345678901234568000000000...) and string (\\\"x\\\") cannot be added\" end output mismatch\n2067 [range(-52;52;1)] as $powers | [$powers[]|pow(2;.)|log2|round] == $powers exited 1: Traceback (most recent call last):\n2075 { exited 1; a rejected program must exit 3\n2086 (.[{}] = 0)? output mismatch\n2093 JOIN({\"0\":[0,\"abc\"],\"1\":[1,\"bcd\"],\"2\":[2,\"def\"],\"3\":[3,\"efg\"],\"4\":[4,\"fgh\"]}; .[0]|tostring) output mismatch\n2161 \"-1\"|IN(builtins[] / \"/\"|.[1]) output mismatch\n2165 all(builtins[] / \"/\"; .[1]|tonumber >= 0) output mismatch\n2211 . - 10 output mismatch\n2215 .[0] - 10 output mismatch\n2219 .x - 10 output mismatch\n2224 -. | tojson == if have_decnum then \"-13911860366432393\" else \"-13911860366432392\" end output mismatch\n2232 [1E+1000,-1E+1000 | tojson] == if have_decnum then [\"1E+1000\",\"-1E+1000\"] else [\"1.7976931348623157e+308\",\"-1.7976931348623157e+308\"] end output mismatch\n2241 .[] as $n | $n+0 | [., tostring, . == $n] output mismatch\n2271 [1E+1000,-1E+1000 | abs | tojson] | unique == if have_decnum then [\"1E+1000\"] else [\"1.7976931348623157e+308\"] end output mismatch\n2275 [1E+1000,-1E+1000 | length | tojson] | unique == if have_decnum then [\"1E+1000\"] else [\"1.7976931348623157e+308\"] end output mismatch\n2304 { a, $__loc__, c } output mismatch\n2430 walk(select(IN({}, []) | not)) output mismatch\n2611 try (reduce range(10001) as $_ ({}; {a: .}) as $x | $x * $x) catch . exited 1: Traceback (most recent call last):\n%%FAIL|if |try |reduce |foreach |def | as |label |module|include rc= 1 summary= {'pass': 132, 'fail': 78, 'error': 1, 'skip': 13}\n200 map(try .a[] catch ., try .a.[] catch ., .a[]?, .a.[]?) output mismatch\n229 try (.[999999999] = 0) catch . timed out after 10s\n353 [foreach .[] / .[] as $i (0; . + $i)] output mismatch\n405 [nth(0,5,9,10,15; range(.)), try nth(-1; range(.)) catch .] output mismatch\n530 . as {as: $kw, \"str\": $str, (\"e\"+\"x\"+\"p\"): $exp} | [$kw, $str, $exp] output mismatch\n560 . as $foo | [$foo, $bar] program was accepted, but the corpus marks it %%FAIL\n566 . as {(true):$foo} | $foo program was accepted, but the corpus marks it %%FAIL\n709 .[] | try toboolean catch . output mismatch\n720 \"true\\u0000x\", \"false\\u0000\" | try toboolean catch . output mismatch\n798 def f: 1; def g: f, def f: 2; def g: 3; f, def f: g; f, g; def f: 4; [f, def f: g; def g: 5; f, g]+[f,g] output mismatch\n868 def f: .+1; def g: f; def f: .+100; def f(a):a+.+11; [(g|f(20)), f] output mismatch\n873 def id(x):x; 2000 as $x | def f(x):1 as $x | id([$x, x, x]); def g(x): 100 as $x | f($x,$x+x); g($x) output mismatch\n884 [[20,10][1,0] as $x | def f: (100,200) as $y | def g: [$x + $y, .]; . + $x | g; f[0] | [f][0][1] | f] output mismatch\n938 .[] | . as {$a, b: [$c, {$d}]} ?// [$a, {$b}, $e] ?// $f | [$a, $b, $c, $d, $e, $f] output mismatch\n1045 . as $dot|any($dot[];not) output mismatch\n1053 . as $dot|all($dot[];.) output mismatch\n1123 try path(.a | map(select(.b == 0))) catch . output mismatch\n1127 try path(.a | map(select(.b == 0)) | .[0]) catch . output mismatch\n1131 try path(.a | map(select(.b == 0)) | .c) catch . output mismatch\n1135 try path(.a | map(select(.b == 0)) | .[]) catch . output mismatch\n1147 [\"foo\",1] as $p | getpath($p), setpath($p; 20), delpaths([$p]) output mismatch\n1163 [\"foo\",1] as $p | getpath($p), setpath($p; 20), delpaths([$p]) output mismatch\n1173 try delpaths(0) catch . output mismatch\n1214 try pick(last) catch . output mismatch\n1253 def inc(x): x |= .+1; inc(.[].a) output mismatch\n1258 .[] | try (getpath([\"a\",0,\"b\"]) |= 5) catch . output mismatch\n1290 try ((map(select(.a == 1))[].b) = 10) catch . output mismatch\n1294 try ((map(select(.a == 1))[].a) |= .+1) catch . output mismatch\n1298 def x: .[1,2]; x=10 output mismatch\n1302 try (def x: reverse; x=10) catch . output mismatch\n1448 [.[]|try if . == 0 then error(\"foo\") elif . == 1 then .a elif . == 2 then empty else . end catch .] output mismatch\n1464 try error(0) // 1 output mismatch\n1473 1 + try 2 catch 3 + 4 output mismatch\n1481 try -.? catch . output mismatch\n1499 try error(\"\\($__loc__)\") catch . output mismatch\n1553 try _strindices(\"abc\") catch . output mismatch\n1557 try _strindices(123) catch . output mismatch\n1575 try trim catch ., try ltrim catch ., try rtrim catch . output mismatch\n1839 try [\"OK\", bsearch(0)] catch [\"KO\",.] output mismatch\n1868 try strftime(\"%Y-%m-%dT%H:%M:%SZ\") catch . output mismatch\n1872 try strflocaltime(\"%Y-%m-%dT%H:%M:%SZ\") catch . output mismatch\n1876 try mktime catch . output mismatch\n1881 try [\"OK\", strftime([])] catch [\"KO\", .] output mismatch\n1885 try [\"OK\", strflocaltime({})] catch [\"KO\", .] output mismatch\n1997 try -. catch . output mismatch\n2001 try (.-.) catch . output mismatch\n2005 \"x\" * range(0; 12; 2) + \"☆\" * 8 | try -. catch . output mismatch\n2014 try (. + \"x\") catch . == if have_decnum then \"number (12345678901234567890123456...) and string (\\\"x\\\") cannot be added\" else \"number (12345678901234568000000000...) and string (\\\"x\\\") cannot be added\" end output mismatch\n2034 try join(\",\") catch . output mismatch\n2038 try join(\",\") catch . output mismatch\n2067 [range(-52;52;1)] as $powers | [$powers[]|pow(2;.)|log2|round] == $powers exited 1: Traceback (most recent call last):\n2130 (.a as $x | .b) = \"b\" output mismatch\n2196 .[0] | tostring | . == if have_decnum then \"13911860366432393\" else \"13911860366432392\" end output mismatch\n2200 .x | tojson | . == if have_decnum then \"13911860366432393\" else \"13911860366432392\" end output mismatch\n2204 (13911860366432393 == 13911860366432392) | . == if have_decnum then false else true end output mismatch\n2224 -. | tojson == if have_decnum then \"-13911860366432393\" else \"-13911860366432392\" end output mismatch\n2232 [1E+1000,-1E+1000 | tojson] == if have_decnum then [\"1E+1000\",\"-1E+1000\"] else [\"1.7976931348623157e+308\",\"-1.7976931348623157e+308\"] end output mismatch\n2241 .[] as $n | $n+0 | [., tostring, . == $n] output mismatch\n2271 [1E+1000,-1E+1000 | abs | tojson] | unique == if have_decnum then [\"1E+1000\"] else [\"1.7976931348623157e+308\"] end output mismatch\n2275 [1E+1000,-1E+1000 | length | tojson] | unique == if have_decnum then [\"1E+1000\"] else [\"1.7976931348623157e+308\"] end output mismatch\n2324 .[] | try (fromjson | isnan) catch . output mismatch\n2337 try input catch . output mismatch\n2390 .[] |= try tonumber output mismatch\n2407 map(try implode catch .) output mismatch\n2411 try 0[implode] catch . output mismatch\n2475 try ([range(3)] | .[nan] = 9) catch . output mismatch\n2479 try (\"foobar\" | .[1.5:3.5] = \"xyz\") catch . output mismatch\n2483 try ([range(10)] | .[1.5:3.5] = [\"xyz\"]) catch . output mismatch\n2487 try (\"foobar\" | .[1.5]) catch . output mismatch\n2494 try [\"ok\", setpath([1]; 1)] catch [\"ko\", .] output mismatch\n2498 try fromjson catch . output mismatch\n2504 try ltrimstr(1) catch \"x\", try rtrimstr(1) catch \"x\" | \"ok\" output mismatch\n2509 try ltrimstr(\"x\") catch \"x\", try rtrimstr(\"x\") catch \"x\" | \"ok\" output mismatch\n2533 try [\"OK\", setpath([[1]]; 1)] catch [\"KO\", .] output mismatch\n2577 try setpath([range(10001) | 0]; 0) catch . output mismatch\n2585 try getpath([range(10001) | 0]) catch . output mismatch\n2593 try delpaths([[range(10001) | 0]]) catch . output mismatch\n2602 try (reduce range(10001) as $_ ([]; [.]) as $x | $x | contains($x)) catch . exited 1: Traceback (most recent call last):\n2611 try (reduce range(10001) as $_ ({}; {a: .}) as $x | $x * $x) catch . exited 1: Traceback (most recent call last):\n","exit_code":0,"status":"completed"}}
{"type":"item.started","item":{"id":"item_9","type":"command_execution","command":"/bin/bash -lc \"python3 - <<'PY'\nimport subprocess,os\nfor p in ['{', 'try (reduce range(10001) as \"'$_ ({}; {a: .}) as $x | $x * $x) catch .'\"','[range(-52;52;1)] as \"'$powers | [$powers[]|pow(2;.)|log2|round] == $powers'\"']:\n r=subprocess.run(['./jq','-c',p],input='null\\\\n',text=True,capture_output=True,env={**os.environ}); print('\\\\nP',p,'RC',r.returncode,'OUT',r.stdout,'ERR',r.stderr[-1200:])\nPY\"","aggregated_output":"","exit_code":null,"status":"in_progress"}}
{"type":"item.completed","item":{"id":"item_9","type":"command_execution","command":"/bin/bash -lc \"python3 - <<'PY'\nimport subprocess,os\nfor p in ['{', 'try (reduce range(10001) as \"'$_ ({}; {a: .}) as $x | $x * $x) catch .'\"','[range(-52;52;1)] as \"'$powers | [$powers[]|pow(2;.)|log2|round] == $powers'\"']:\n r=subprocess.run(['./jq','-c',p],input='null\\\\n',text=True,capture_output=True,env={**os.environ}); print('\\\\nP',p,'RC',r.returncode,'OUT',r.stdout,'ERR',r.stderr[-1200:])\nPY\"","aggregated_output":"\nP { RC 1 OUT  ERR                      ^^^^^^^^^^^^^^\n  File \"/mnt/c/Users/barlo/projects/drydock/uat/jq/runs/20260822.044627/build/jq/jq_interpreter/parser.py\", line 273, in parse\n    result=Parser(source).parse()\n           ^^^^^^^^^^^^^^^^^^^^^^\n  File \"/mnt/c/Users/barlo/projects/drydock/uat/jq/runs/20260822.044627/build/jq/jq_interpreter/parser.py\", line 60, in parse\n    x=self.expr(0)\n      ^^^^^^^^^^^^\n  File \"/mnt/c/Users/barlo/projects/drydock/uat/jq/runs/20260822.044627/build/jq/jq_interpreter/parser.py\", line 65, in expr\n    x=self.prefix()\n      ^^^^^^^^^^^^^\n  File \"/mnt/c/Users/barlo/projects/drydock/uat/jq/runs/20260822.044627/build/jq/jq_interpreter/parser.py\", line 95, in prefix\n    if t=='{': return self.object()\n                      ^^^^^^^^^^^^^\n  File \"/mnt/c/Users/barlo/projects/drydock/uat/jq/runs/20260822.044627/build/jq/jq_interpreter/parser.py\", line 146, in object\n    if self.p()==':': self.take(); v=self.expr(1, True)\n       ^^^^^^^^\n  File \"/mnt/c/Users/barlo/projects/drydock/uat/jq/runs/20260822.044627/build/jq/jq_interpreter/parser.py\", line 53, in p\n    def p(self): return self.t[self.i].text\n                        ~~~~~~^^^^^^^^\nIndexError: list index out of range\n\n\nP try (reduce range(10001) as $_ ({}; {a: .}) as $x | $x * $x) catch . RC 1 OUT  ERR s/20260822.044627/build/jq/./jq\", line 20, in <module>\n    raise SystemExit(run())\n                     ^^^^^\n  File \"/mnt/c/Users/barlo/projects/drydock/uat/jq/runs/20260822.044627/build/jq/./jq\", line 16, in run\n    return main()\n           ^^^^^^\n  File \"/mnt/c/Users/barlo/projects/drydock/uat/jq/runs/20260822.044627/build/jq/jq_interpreter/cli.py\", line 51, in main\n    json.dumps(_json_output(output), separators=(\",\", \":\"), ensure_ascii=False),\n    ^^^^^^^^^^^^^^^^^^^^^^^^^^^^^^^^^^^^^^^^^^^^^^^^^^^^^^^^^^^^^^^^^^^^^^^^^^^\n  File \"/home/barlo/.local/share/uv/python/cpython-3.12.13-linux-x86_64-gnu/lib/python3.12/json/__init__.py\", line 238, in dumps\n    **kw).encode(obj)\n          ^^^^^^^^^^^\n  File \"/home/barlo/.local/share/uv/python/cpython-3.12.13-linux-x86_64-gnu/lib/python3.12/json/encoder.py\", line 200, in encode\n    chunks = self.iterencode(o, _one_shot=True)\n             ^^^^^^^^^^^^^^^^^^^^^^^^^^^^^^^^^^\n  File \"/home/barlo/.local/share/uv/python/cpython-3.12.13-linux-x86_64-gnu/lib/python3.12/json/encoder.py\", line 258, in iterencode\n    return _iterencode(o, 0)\n           ^^^^^^^^^^^^^^^^^\nRecursionError: maximum recursion depth exceeded while encoding a JSON object\n\n\nP [range(-52;52;1)] as $powers | [$powers[]|pow(2;.)|log2|round] == $powers RC 1 OUT  ERR p == \"array\": yield [] if a[0] is None else list(_node(a[0],value,env))\n                                                      ^^^^^^^^^^^^^^^^^^^^^^^^^^^\n  File \"/mnt/c/Users/barlo/projects/drydock/uat/jq/runs/20260822.044627/build/jq/jq_interpreter/evaluator.py\", line 130, in _node\n    elif op == \"binary\": yield from _binary(a[0],a[1],a[2],value,env)\n                         ^^^^^^^^^^^^^^^^^^^^^^^^^^^^^^^^^^^^^^^^^^^^\n  File \"/mnt/c/Users/barlo/projects/drydock/uat/jq/runs/20260822.044627/build/jq/jq_interpreter/evaluator.py\", line 248, in _binary\n    for x in _node(left,value,env): yield from _node(right,x,env)\n                                    ^^^^^^^^^^^^^^^^^^^^^^^^^^^^^\n  File \"/mnt/c/Users/barlo/projects/drydock/uat/jq/runs/20260822.044627/build/jq/jq_interpreter/evaluator.py\", line 187, in _node\n    elif op == \"call\": yield from _call(a[0],a[1],value,env)\n                       ^^^^^^^^^^^^^^^^^^^^^^^^^^^^^^^^^^^^^\n  File \"/mnt/c/Users/barlo/projects/drydock/uat/jq/runs/20260822.044627/build/jq/jq_interpreter/evaluator.py\", line 685, in _call\n    yield getattr(math, name)(value); return\n          ^^^^^^^^^^^^^^^^^^^\nAttributeError: module 'math' has no attribute 'round'\n\n","exit_code":0,"status":"completed"}}
{"type":"item.started","item":{"id":"item_10","type":"command_execution","command":"/bin/bash -lc \"sed -n '250,290p' jq_interpreter/parser.py; sed -n '620,710p' jq_interpreter/evaluator.py; sed -n '1,100p' jq_interpreter/interpreter.py\"","aggregated_output":"","exit_code":null,"status":"in_progress"}}
{"type":"item.completed","item":{"id":"item_10","type":"command_execution","command":"/bin/bash -lc \"sed -n '250,290p' jq_interpreter/parser.py; sed -n '620,710p' jq_interpreter/evaluator.py; sed -n '1,100p' jq_interpreter/interpreter.py\"","aggregated_output":"    for label in re.findall(r'\\blabel\\s+\\$([A-Za-z_]\\w*)', source):\n        pass\n    for name in re.findall(r'\\bbreak\\s+\\$([A-Za-z_]\\w*)', source):\n        if not re.search(r'\\blabel\\s+\\$' + re.escape(name) + r'\\b', source):\n            raise CompileError('break label is not defined')\n    stripped=source.strip()\n    if stripped.startswith('\"') and '\\\\(' in stripped:\n        parts=[]; pos=1; end=len(stripped)-1\n        while pos<end:\n            mark=stripped.find('\\\\(',pos)\n            if mark<0:\n                parts.append(json.loads('\"'+stripped[pos:end]+'\"')); break\n            if mark>pos: parts.append(json.loads('\"'+stripped[pos:mark]+'\"'))\n            depth=1; cursor=mark+2\n            while depth and cursor<end:\n                if stripped[cursor]=='(': depth+=1\n                elif stripped[cursor]==')': depth-=1\n                cursor+=1\n            parts.append(parse(stripped[mark+2:cursor-1])); pos=cursor\n        return StringTemplate(tuple(parts))\n    if stripped.startswith('@') and ' \"' in stripped:\n        name, template=stripped.split(None,1); inner=parse(template)\n        return Format(name[1:], inner if isinstance(inner,StringTemplate) else StringTemplate((inner,)))\n    result=Parser(source).parse()\n    # Bare calls are valid jq builtins as well as user definitions supplied by\n    # the builtin library.  Retain compile-time rejection for an unknown bare\n    # identifier while registering the standard library's zero-argument names.\n    known = set('empty error length type not tostring tojson abs fabs floor ceil round sqrt sin cos tan asin acos atan log log10 exp exp2 log2 pow keys sort add min max any all arrays objects iterables booleans numbers normals finites strings nulls values scalars unique reverse paths builtins modulemeta input debug implode explode trim ltrim rtrim isempty have_decnum'.split())\n    if isinstance(result, Node) and result.operation == 'call' and not result.arguments[1] and result.arguments[0] not in known:\n        raise CompileError('unknown filter')\n    return result\n        except RuntimeError: raise\n        except Exception: raise RuntimeError('invalid JSON')\n        return\n    if name in ('arrays','objects','iterables','booleans','numbers','strings','nulls','values','scalars','normals','finites'):\n        ok = {'arrays':isinstance(value,list),'objects':isinstance(value,dict),\n              'iterables':isinstance(value,(list,dict)),'booleans':isinstance(value,bool),\n              'numbers':isinstance(value,(int,float)) and not isinstance(value,bool),\n              'strings':isinstance(value,str),'nulls':value is None,\n              'values':value is not None,'scalars':not isinstance(value,(list,dict))}[name]\n        if ok: yield value\n        return\n    if name == 'keys':\n        if isinstance(value, dict): yield sorted(value)\n        elif isinstance(value, list): yield list(range(len(value)))\n        else: raise RuntimeError('keys requires object or array')\n        return\n    if name == 'rindex':\n        needle = _one(args[0], value, env)\n        if isinstance(value, str): yield value.rfind(needle) if needle in value else None\n        elif isinstance(value, list):\n            try: yield len(value) - 1 - value[::-1].index(needle)\n            except ValueError: yield None\n        else: raise RuntimeError('cannot search value')\n        return\n    if name == 'first':\n        try: yield next(_node(args[0], value, env))\n        except StopIteration: return\n        return\n    if name == 'last':\n        vals=list(_node(args[0], value, env));\n        if vals: yield vals[-1]\n        return\n    if name == 'select':\n        if _truth(_one(args[0], value, env)): yield value\n        return\n    if name == 'isnan': yield isinstance(value, float) and math.isnan(value); return\n    if name == 'pow': yield math.pow(_one(args[0],value,env), _one(args[1],value,env)); return\n    if name == 'implode':\n        if not isinstance(value, list): raise RuntimeError('implode input must be an array')\n        yield ''.join(chr(int(x)) for x in value); return\n    if name == 'explode':\n        if not isinstance(value, str): raise RuntimeError('explode input must be a string')\n        yield [ord(x) for x in value]; return\n    if name == 'limit':\n        count=int(_one(args[0], value, env))\n        if count < 0: raise RuntimeError(\"limit doesn't support negative count\")\n        for item in _node(args[1], value, env):\n            if count <= 0: break\n            yield item; count -= 1\n        return\n    if name == 'skip':\n        count=int(_one(args[0], value, env))\n        if count < 0: raise RuntimeError(\"skip doesn't support negative count\")\n        for item in _node(args[1], value, env):\n            if count: count -= 1\n            else: yield item\n        return\n    if name == 'join':\n        for separator in _node(args[0], value, env):\n            if not isinstance(value, list): raise RuntimeError('cannot join value')\n            yield str(separator).join('' if item is None else _stringify(item) for item in value)\n        return\n    if name in ('sin','cos','tan','asin','acos','atan','sqrt','log','log10','exp','exp2','log2'):\n        yield getattr(math, name)(value); return\n    if name in ('round','ceil','floor','fabs'):\n        yield getattr(math, name)(value); return\n    if name == 'split':\n        separator = _one(args[0], value, env); yield value.split(separator); return\n    if name in ('ltrimstr','rtrimstr','trimstr'):\n        needle = _one(args[0], value, env)\n        if not isinstance(value, str) or not isinstance(needle, str):\n            raise RuntimeError(('startswith()' if name == 'ltrimstr' else 'endswith()') + ' requires string inputs')\n        if name == 'ltrimstr': yield value[len(needle):] if value.startswith(needle) else value\n        elif name == 'rtrimstr': yield value[:-len(needle)] if needle and value.endswith(needle) else value\n        else:\n            result = value\n            if needle and result.startswith(needle): result = result[len(needle):]\n            if needle and result.endswith(needle): result = result[:-len(needle)]\n            yield result\n        return\n    if name in ('trim','ltrim','rtrim'):\n        if not isinstance(value, str): raise RuntimeError(f'{name} input must be a string')\n        yield value.strip() if name == 'trim' else value.lstrip() if name == 'ltrim' else value.rstrip(); return\n    if name == 'startswith':\n        yield value.startswith(_one(args[0], value, env)); return\n    if name == 'endswith':\n        yield value.endswith(_one(args[0], value, env)); return\n    if name in ('sort', 'unique'):\n        if not isinstance(value, list):\n            raise RuntimeError('cannot sort value')\n        ordered = sorted(value, key=_jq_sort_key)\n\"\"\"Application-facing interpreter orchestration.\"\"\"\n\nimport json\nfrom collections.abc import Iterable, Iterator\n\nfrom .evaluator import evaluate\nfrom .parser import parse\nfrom .runtime import JsonValue\n\n\nclass Interpreter:\n    \"\"\"Compile once, then evaluate each JSON input in order.\"\"\"\n\n    def __init__(self, program: str) -> None:\n        self._compiled = parse(program)\n\n    def run(self, inputs: Iterable[JsonValue]) -> Iterator[JsonValue]:\n        \"\"\"Yield every output, preserving input and generator ordering.\"\"\"\n        for value in inputs:\n            yield from evaluate(self._compiled, value)\n\n\ndef parse_input(line: str) -> JsonValue:\n    \"\"\"Decode one JSON input value.\"\"\"\n    return json.loads(line.lstrip(\"\\ufeff\"), parse_constant=_parse_json_constant)\n\n\ndef parse_inputs(text: str) -> Iterator[JsonValue]:\n    \"\"\"Decode every whitespace-separated JSON value in an input stream.\n\n    ``jq`` accepts JSON values separated by arbitrary whitespace, so a value may\n    span multiple physical lines.  ``raw_decode`` preserves the boundary\n    between successive values without requiring a non-standard JSON parser.\n    \"\"\"\n    decoder = json.JSONDecoder(parse_constant=_parse_json_constant)\n    position = 0\n    while True:\n        while position < len(text) and text[position].isspace():\n            position += 1\n        if position >= len(text):\n            return\n        if position == 0 and text.startswith(\"\\ufeff\"):\n            position += 1\n            continue\n        value, position = decoder.raw_decode(text, position)\n        yield value\n\n\ndef _parse_json_constant(value: str) -> float:\n    \"\"\"Decode jq's accepted non-standard numeric constants.\"\"\"\n    return {\"NaN\": float(\"nan\"), \"Infinity\": float(\"inf\"),\n            \"-Infinity\": float(\"-inf\")}[value]\n","exit_code":0,"status":"completed"}}
{"type":"item.started","item":{"id":"item_11","type":"command_execution","command":"/bin/bash -lc \"sed -n '42,58p' jq_interpreter/cli.py; sed -n '312,320p' jq_interpreter/evaluator.py\"","aggregated_output":"","exit_code":null,"status":"in_progress"}}
{"type":"item.completed","item":{"id":"item_11","type":"command_execution","command":"/bin/bash -lc \"sed -n '42,58p' jq_interpreter/cli.py; sed -n '312,320p' jq_interpreter/evaluator.py\"","aggregated_output":"    arguments.add_argument(\"program\")\n    options = arguments.parse_args(argv)\n    try:\n        interpreter = Interpreter(options.program)\n    except CompileError as error:\n        return report_compile_error(error)\n    try:\n        for output in interpreter.run(_inputs()):\n            print(\n                json.dumps(_json_output(output), separators=(\",\", \":\"), ensure_ascii=False),\n                flush=True,\n            )\n    except (RuntimeError, ValueError, TypeError, json.JSONDecodeError) as error:\n        return report_runtime_error(RuntimeError(str(error)))\n    return 0\n    if op == '-': return left - right\n    if op == '*': return left * right\n    if op == '/': return left / right\n    if op == '%': return math.fmod(left, right)\n    return right\n\ndef _merge_objects(left: dict, right: dict, depth: int = 0) -> dict:\n    if left is right:\n        return left\n","exit_code":0,"status":"completed"}}
{"type":"item.started","item":{"id":"item_12","type":"file_change","changes":[{"path":"/mnt/c/Users/barlo/projects/drydock/uat/jq/runs/20260822.044627/build/jq/jq_interpreter/cli.py","kind":"update"},{"path":"/mnt/c/Users/barlo/projects/drydock/uat/jq/runs/20260822.044627/build/jq/jq_interpreter/evaluator.py","kind":"update"},{"path":"/mnt/c/Users/barlo/projects/drydock/uat/jq/runs/20260822.044627/build/jq/jq_interpreter/parser.py","kind":"update"}],"status":"in_progress"}}
{"type":"item.completed","item":{"id":"item_12","type":"file_change","changes":[{"path":"/mnt/c/Users/barlo/projects/drydock/uat/jq/runs/20260822.044627/build/jq/jq_interpreter/cli.py","kind":"update"},{"path":"/mnt/c/Users/barlo/projects/drydock/uat/jq/runs/20260822.044627/build/jq/jq_interpreter/evaluator.py","kind":"update"},{"path":"/mnt/c/Users/barlo/projects/drydock/uat/jq/runs/20260822.044627/build/jq/jq_interpreter/parser.py","kind":"update"}],"status":"completed"}}
{"type":"item.started","item":{"id":"item_13","type":"file_change","changes":[{"path":"/mnt/c/Users/barlo/projects/drydock/uat/jq/runs/20260822.044627/build/jq/jq_interpreter/cli.py","kind":"update"},{"path":"/mnt/c/Users/barlo/projects/drydock/uat/jq/runs/20260822.044627/build/jq/jq_interpreter/evaluator.py","kind":"update"}],"status":"in_progress"}}
{"type":"item.completed","item":{"id":"item_13","type":"file_change","changes":[{"path":"/mnt/c/Users/barlo/projects/drydock/uat/jq/runs/20260822.044627/build/jq/jq_interpreter/cli.py","kind":"update"},{"path":"/mnt/c/Users/barlo/projects/drydock/uat/jq/runs/20260822.044627/build/jq/jq_interpreter/evaluator.py","kind":"update"}],"status":"completed"}}
{"type":"item.started","item":{"id":"item_14","type":"command_execution","command":"/bin/bash -lc \"python3 - <<'PY'\nimport subprocess,os\nfor p in ['{','try (reduce range(10001) as \"'$_ ({}; {a: .}) as $x | $x * $x) catch .'\"','[range(-52;52;1)] as \"'$powers | [$powers[]|pow(2;.)|log2|round] == $powers'\"']:\n r=subprocess.run(['./jq','-c',p],input='null\\\\n',text=True,capture_output=True,env={**os.environ}); print(p, r.returncode, r.stdout.strip(), r.stderr[-100:] if r.stderr else '')\nPY\npython3 - <<'PY'\nimport json,os,subprocess,sys\nfor sel in [r'\\\\.\\\\|\\\\[|\\\\{|\\\\+|\\\\-|\\\\*|/|%', r'%%FAIL|if |try |reduce |foreach |def | as |label |module|include']:\n r=subprocess.run([sys.executable,'sources/run_conformance.py','--select',sel,'--json'],capture_output=True,text=True,env={**os.environ,'JQ':os.path.abspath('jq')},timeout=180)\n print(json.loads(r.stdout)['summary'])\nPY\"","aggregated_output":"","exit_code":null,"status":"in_progress"}}
{"type":"item.completed","item":{"id":"item_14","type":"command_execution","command":"/bin/bash -lc \"python3 - <<'PY'\nimport subprocess,os\nfor p in ['{','try (reduce range(10001) as \"'$_ ({}; {a: .}) as $x | $x * $x) catch .'\"','[range(-52;52;1)] as \"'$powers | [$powers[]|pow(2;.)|log2|round] == $powers'\"']:\n r=subprocess.run(['./jq','-c',p],input='null\\\\n',text=True,capture_output=True,env={**os.environ}); print(p, r.returncode, r.stdout.strip(), r.stderr[-100:] if r.stderr else '')\nPY\npython3 - <<'PY'\nimport json,os,subprocess,sys\nfor sel in [r'\\\\.\\\\|\\\\[|\\\\{|\\\\+|\\\\-|\\\\*|/|%', r'%%FAIL|if |try |reduce |foreach |def | as |label |module|include']:\n r=subprocess.run([sys.executable,'sources/run_conformance.py','--select',sel,'--json'],capture_output=True,text=True,env={**os.environ,'JQ':os.path.abspath('jq')},timeout=180)\n print(json.loads(r.stdout)['summary'])\nPY\"","aggregated_output":"{ 3  jq: compile error: syntax error\n\ntry (reduce range(10001) as $_ ({}; {a: .}) as $x | $x * $x) catch . 0 \"Object merge too deep\" \n[range(-52;52;1)] as $powers | [$powers[]|pow(2;.)|log2|round] == $powers 0 true \n{'pass': 110, 'fail': 99, 'error': 0, 'skip': 1}\n{'pass': 100, 'fail': 110, 'error': 1, 'skip': 13}\n","exit_code":0,"status":"completed"}}
{"type":"item.started","item":{"id":"item_15","type":"command_execution","command":"/bin/bash -lc \"printf 'null\\\\n' | ./jq -c '{a:1}' ; printf 'null\\\\n' | ./jq -c '[1,2]' ; printf 'null\\\\n' | ./jq -c '1+1'; python3 - <<'PY'\nimport json,os,subprocess,sys\nsel=r'\\\\.\\\\|\\\\[|\\\\{|\\\\+|\\\\-|\\\\*|/|%'\nr=subprocess.run([sys.executable,'sources/run_conformance.py','--select',sel,'--json'],capture_output=True,text=True,env={**os.environ,'JQ':os.path.abspath('jq')},timeout=180)\na=json.loads(r.stdout)\nfor c in a['cases']:\n if c['status'] in ('fail','error'):\n  print(c['line'],c['program'],c['detail'],c.get('actual')); \n  if c['line']>130: break\nPY\"","aggregated_output":"","exit_code":null,"status":"in_progress"}}
{"type":"item.completed","item":{"id":"item_15","type":"command_execution","command":"/bin/bash -lc \"printf 'null\\\\n' | ./jq -c '{a:1}' ; printf 'null\\\\n' | ./jq -c '[1,2]' ; printf 'null\\\\n' | ./jq -c '1+1'; python3 - <<'PY'\nimport json,os,subprocess,sys\nsel=r'\\\\.\\\\|\\\\[|\\\\{|\\\\+|\\\\-|\\\\*|/|%'\nr=subprocess.run([sys.executable,'sources/run_conformance.py','--select',sel,'--json'],capture_output=True,text=True,env={**os.environ,'JQ':os.path.abspath('jq')},timeout=180)\na=json.loads(r.stdout)\nfor c in a['cases']:\n if c['status'] in ('fail','error'):\n  print(c['line'],c['program'],c['detail'],c.get('actual')); \n  if c['line']>130: break\nPY\"","aggregated_output":"[12,]\n2\n122 {\"a\",b,\"a$\\(1+1)\"} output mismatch ['{\"a\":null,\"b\":2,\"a$2\":null}']\n221 .[-1] = 5 output mismatch ['[01,5,]']\n","exit_code":0,"status":"completed"}}
{"type":"item.started","item":{"id":"item_16","type":"command_execution","command":"/bin/bash -lc \"sed -n '338,375p' jq_interpreter/evaluator.py\"","aggregated_output":"","exit_code":null,"status":"in_progress"}}
{"type":"item.completed","item":{"id":"item_16","type":"command_execution","command":"/bin/bash -lc \"sed -n '338,375p' jq_interpreter/evaluator.py\"","aggregated_output":"            if isinstance(first, (int, float)) and not isinstance(first, bool) and isinstance(second, (int, float)) and not isinstance(second, bool):\n                if first != second:\n                    return False\n                continue\n            return False\n        if isinstance(first, (dict, list)):\n            if isinstance(first, list):\n                if len(first) != len(second):\n                    return False\n                pending.extend((a, b, depth + 1) for a, b in zip(first, second))\n            else:\n                if first.keys() != second.keys():\n                    return False\n                pending.extend((first[key], second[key], depth + 1) for key in first)\n            continue\n        if isinstance(first, float) and math.isnan(first) and math.isnan(second):\n            continue\n        if first != second:\n            return False\n    return True\n\n\ndef _deep_json_dumps(value: object) -> str:\n    \"\"\"Encode deeply nested values without json.encoder's C recursion limit.\"\"\"\n    depth = 0\n    probe = value\n    while isinstance(probe, list) and len(probe) == 1:\n        depth += 1\n        probe = probe[0]\n    if depth >= 10000:\n        return json.dumps('<skipped: too deep>')\n    pieces: list[str] = []\n    stack: list[object] = [value]\n    while stack:\n        item = stack.pop()\n        if isinstance(item, list):\n            pieces.append('[')\n            if item:\n","exit_code":0,"status":"completed"}}
{"type":"item.started","item":{"id":"item_17","type":"command_execution","command":"/bin/bash -lc \"sed -n '375,410p' jq_interpreter/evaluator.py\"","aggregated_output":"","exit_code":null,"status":"in_progress"}}
{"type":"item.completed","item":{"id":"item_17","type":"command_execution","command":"/bin/bash -lc \"sed -n '375,410p' jq_interpreter/evaluator.py\"","aggregated_output":"            if item:\n                stack.append(('close', ']'))\n                for index in range(len(item) - 1, -1, -1):\n                    if index:\n                        stack.append(('raw', ','))\n                    stack.append(item[index])\n            else:\n                pieces.append(']')\n        elif isinstance(item, dict):\n            pieces.append('{')\n            entries = list(item.items())\n            if entries:\n                stack.append(('close', '}'))\n                for index in range(len(entries) - 1, -1, -1):\n                    key, child = entries[index]\n                    stack.append(child)\n                    stack.append(('raw', ':'))\n                    stack.append(('raw', json.dumps(str(key), ensure_ascii=False)))\n                    if index:\n                        stack.append(('raw', ','))\n            else:\n                pieces.append('}')\n        elif isinstance(item, tuple) and item[0] == 'raw':\n            pieces.append(item[1])\n        elif isinstance(item, tuple) and item[0] == 'close':\n            pieces.append(item[1])\n        else:\n            if isinstance(item, float) and not math.isfinite(item):\n                pieces.append('null')\n            else:\n                pieces.append(json.dumps(item, separators=(',', ':'), ensure_ascii=False))\n    return ''.join(pieces)\n\n\ndef _deep_json_loads(text: str) -> object:\n    try:\n","exit_code":0,"status":"completed"}}
{"type":"item.started","item":{"id":"item_18","type":"file_change","changes":[{"path":"/mnt/c/Users/barlo/projects/drydock/uat/jq/runs/20260822.044627/build/jq/jq_interpreter/evaluator.py","kind":"update"}],"status":"in_progress"}}
{"type":"item.completed","item":{"id":"item_18","type":"file_change","changes":[{"path":"/mnt/c/Users/barlo/projects/drydock/uat/jq/runs/20260822.044627/build/jq/jq_interpreter/evaluator.py","kind":"update"}],"status":"completed"}}
{"type":"item.started","item":{"id":"item_19","type":"command_execution","command":"/bin/bash -lc \"printf 'null\\\\n' | ./jq -c '[1,2]' ; printf 'null\\\\n' | ./jq -c '{a:1,b:2}' ; python3 - <<'PY'\nimport json,os,subprocess,sys\nfor sel in [r'\\\\.\\\\|\\\\[|\\\\{|\\\\+|\\\\-|\\\\*|/|%',r'%%FAIL|if |try |reduce |foreach |def | as |label |module|include']:\n r=subprocess.run([sys.executable,'sources/run_conformance.py','--select',sel,'--json'],capture_output=True,text=True,env={**os.environ,'JQ':os.path.abspath('jq')},timeout=180)\n print(json.loads(r.stdout)['summary'])\nPY\"","aggregated_output":"","exit_code":null,"status":"in_progress"}}
{"type":"item.started","item":{"id":"item_20","type":"file_change","changes":[{"path":"/mnt/c/Users/barlo/projects/drydock/uat/jq/runs/20260822.044627/build/jq/jq_interpreter/evaluator.py","kind":"update"}],"status":"in_progress"}}
{"type":"item.completed","item":{"id":"item_20","type":"file_change","changes":[{"path":"/mnt/c/Users/barlo/projects/drydock/uat/jq/runs/20260822.044627/build/jq/jq_interpreter/evaluator.py","kind":"update"}],"status":"completed"}}
{"type":"item.started","item":{"id":"item_21","type":"command_execution","command":"/bin/bash -lc \"printf 'null\\\\n' | ./jq -c '{a:1,b:2}'; python3 - <<'PY'\nimport json,os,subprocess,sys\nfor sel in [r'\\\\.\\\\|\\\\[|\\\\{|\\\\+|\\\\-|\\\\*|/|%',r'%%FAIL|if |try |reduce |foreach |def | as |label |module|include']:\n r=subprocess.run([sys.executable,'sources/run_conformance.py','--select',sel,'--json'],capture_output=True,text=True,env={**os.environ,'JQ':os.path.abspath('jq')},timeout=180)\n print('rc',r.returncode,json.loads(r.stdout)['summary'])\nPY\"","aggregated_output":"","exit_code":null,"status":"in_progress"}}
{"type":"item.completed","item":{"id":"item_19","type":"command_execution","command":"/bin/bash -lc \"printf 'null\\\\n' | ./jq -c '[1,2]' ; printf 'null\\\\n' | ./jq -c '{a:1,b:2}' ; python3 - <<'PY'\nimport json,os,subprocess,sys\nfor sel in [r'\\\\.\\\\|\\\\[|\\\\{|\\\\+|\\\\-|\\\\*|/|%',r'%%FAIL|if |try |reduce |foreach |def | as |label |module|include']:\n r=subprocess.run([sys.executable,'sources/run_conformance.py','--select',sel,'--json'],capture_output=True,text=True,env={**os.environ,'JQ':os.path.abspath('jq')},timeout=180)\n print(json.loads(r.stdout)['summary'])\nPY\"","aggregated_output":"{,\"a\":1\"b\":2}\n{'pass': 136, 'fail': 73, 'error': 0, 'skip': 1}\n{'pass': 133, 'fail': 77, 'error': 1, 'skip': 13}\n","exit_code":0,"status":"completed"}}
{"type":"item.completed","item":{"id":"item_21","type":"command_execution","command":"/bin/bash -lc \"printf 'null\\\\n' | ./jq -c '{a:1,b:2}'; python3 - <<'PY'\nimport json,os,subprocess,sys\nfor sel in [r'\\\\.\\\\|\\\\[|\\\\{|\\\\+|\\\\-|\\\\*|/|%',r'%%FAIL|if |try |reduce |foreach |def | as |label |module|include']:\n r=subprocess.run([sys.executable,'sources/run_conformance.py','--select',sel,'--json'],capture_output=True,text=True,env={**os.environ,'JQ':os.path.abspath('jq')},timeout=180)\n print('rc',r.returncode,json.loads(r.stdout)['summary'])\nPY\"","aggregated_output":"rc 1 {'pass': 147, 'fail': 62, 'error': 0, 'skip': 1}\nrc 1 {'pass': 133, 'fail': 77, 'error': 1, 'skip': 13}\n","exit_code":0,"status":"completed"}}
{"type":"item.completed","item":{"id":"item_22","type":"agent_message","text":"RESULT: FAILED\n\nFILES CHANGED:\n- jq_interpreter/evaluator.py\n- jq_interpreter/parser.py\n- jq_interpreter/cli.py\n\nSUMMARY:\n- Fixed iterative deep equality and deep object-merge runtime handling.\n- Fixed malformed syntax classification and `round`.\n- Corrected iterative JSON output ordering and deep-value serialization.\n- Acceptance checks still fail with broader pre-existing parser/evaluator gaps.\n\nBLOCKERS:\n- parse-003-conformance: 147 passed, 62 failed.\n- parse-004-conformance: 133 passed, 77 failed, 1 errored.\n\nFAILURE_SUMMARY: Declared conformance slices remain substantially incomplete.\n\nFAILURE_DETAIL: The targeted deep-equality and deep-merge failures are fixed, but both acceptance criteria still report numerous unrelated expression, builtin, binding, and control-flow failures requiring further implementation."}}
{"type":"turn.completed","usage":{"input_tokens":1938720,"cached_input_tokens":1847040,"cache_write_input_tokens":0,"output_tokens":7053,"reasoning_output_tokens":1539}}