{"type":"thread.started","thread_id":"01a02bbf-5d34-7ef3-a6ab-a160f7c7ffe1"}
{"type":"turn.started"}
{"type":"item.completed","item":{"id":"item_0","type":"agent_message","text":"I’ll inspect the existing parser/evaluator, rerun both authoritative scoped checks, then fix the highest-leverage general failures and repeat the exact criteria."}}
{"type":"item.started","item":{"id":"item_1","type":"command_execution","command":"/bin/bash -lc \"ls -la && find jq_interpreter -maxdepth 2 -type f -print && sed -n '1,240p' jq_interpreter/parser.py && sed -n '1,220p' jq_interpreter/evaluator.py\"","aggregated_output":"","exit_code":null,"status":"in_progress"}}
{"type":"item.completed","item":{"id":"item_1","type":"command_execution","command":"/bin/bash -lc \"ls -la && find jq_interpreter -maxdepth 2 -type f -print && sed -n '1,240p' jq_interpreter/parser.py && sed -n '1,220p' jq_interpreter/evaluator.py\"","aggregated_output":"total 0\ndrwxrwxrwx 1 barlo barlo 512 Aug 22 17:18 .\ndrwxrwxrwx 1 barlo barlo 512 Aug 22 00:46 ..\n-rwxrwxrwx 1 barlo barlo 493 Aug 22 15:49 jq\ndrwxrwxrwx 1 barlo barlo 512 Aug 22 18:03 jq_interpreter\ndrwxrwxrwx 1 barlo barlo 512 Aug 22 18:14 sources\ndrwxrwxrwx 1 barlo barlo 512 Aug 22 18:14 tests\njq_interpreter/architecture.py\njq_interpreter/ast.py\njq_interpreter/builtins.py\njq_interpreter/cli.py\njq_interpreter/diagnostics.py\njq_interpreter/errors.py\njq_interpreter/evaluator.py\njq_interpreter/interpreter.py\njq_interpreter/lexer.py\njq_interpreter/parser.py\njq_interpreter/paths.py\njq_interpreter/runtime.py\njq_interpreter/__init__.py\njq_interpreter/__pycache__/architecture.cpython-310.pyc\njq_interpreter/__pycache__/architecture.cpython-312.pyc\njq_interpreter/__pycache__/ast.cpython-310.pyc\njq_interpreter/__pycache__/ast.cpython-312.pyc\njq_interpreter/__pycache__/builtins.cpython-312.pyc\njq_interpreter/__pycache__/cli.cpython-310.pyc\njq_interpreter/__pycache__/cli.cpython-312.pyc\njq_interpreter/__pycache__/diagnostics.cpython-310.pyc\njq_interpreter/__pycache__/diagnostics.cpython-312.pyc\njq_interpreter/__pycache__/errors.cpython-310.pyc\njq_interpreter/__pycache__/errors.cpython-312.pyc\njq_interpreter/__pycache__/evaluator.cpython-310.pyc\njq_interpreter/__pycache__/evaluator.cpython-312.pyc\njq_interpreter/__pycache__/interpreter.cpython-310.pyc\njq_interpreter/__pycache__/interpreter.cpython-312.pyc\njq_interpreter/__pycache__/lexer.cpython-310.pyc\njq_interpreter/__pycache__/lexer.cpython-312.pyc\njq_interpreter/__pycache__/parser.cpython-310.pyc\njq_interpreter/__pycache__/parser.cpython-312.pyc\njq_interpreter/__pycache__/paths.cpython-310.pyc\njq_interpreter/__pycache__/paths.cpython-312.pyc\njq_interpreter/__pycache__/runtime.cpython-310.pyc\njq_interpreter/__pycache__/runtime.cpython-312.pyc\njq_interpreter/__pycache__/__init__.cpython-310.pyc\njq_interpreter/__pycache__/__init__.cpython-312.pyc\n\"\"\"Precedence-aware jq expression parser.\"\"\"\nimport json\nimport re\nfrom dataclasses import dataclass\nfrom .ast import Filter, Node, StringTemplate, Format\nfrom .errors import CompileError\nfrom .lexer import tokenize\n\n@dataclass(frozen=True)\nclass T: text: str\nOPS=(\"//=\",\"?//\",\"!=\",\"==\",\"|=\",\"+=\",\"-=\",\"*=\",\"/=\",\"%=\",\"<=\",\">=\",\"..\",\"//\")\n# jq's query grammar gives the pipe lower precedence than comma. This is\n# significant for ``a | b, c``: it means ``a | (b, c)`` and keeps the input\n# stream attached to both branches. The parser's numeric levels increase\n# with binding strength.\nPREC={\"|\":1,\",\":2,\"=\":3,\"|=\":3,\"+=\":3,\"-=\":3,\"*=\":3,\"/=\":3,\"%=\":3,\"//=\":3,\"//\":4,\"or\":5,\"and\":6,\"==\":7,\"!=\":7,\"<\":7,\">\":7,\"<=\":7,\">=\":7,\"+\":8,\"-\":8,\"*\":9,\"/\":9,\"%\":9}\n\ndef lex(s: str) -> list[T]:\n s=re.sub(r\"#[^\\n]*\",\"\",s); out=[]; i=0\n while i<len(s):\n if s[i].isspace(): i+=1; continue\n if s[i]=='\"':\n a=i; i+=1; esc=False\n while i<len(s):\n c=s[i]; i+=1\n if esc: esc=False\n elif c=='\\\\': esc=True\n elif c=='\"': break\n else: raise CompileError(\"unterminated string\")\n out.append(T(s[a:i])); continue\n op=next((x for x in OPS if s.startswith(x,i)),None)\n if op: out.append(T(op)); i+=len(op); continue\n m=re.match(r\"(?:[0-9]+(?:\\.[0-9]*)?|\\.[0-9]+)(?:[eE][+-]?[0-9]+)?\",s[i:])\n if m: out.append(T(m.group())); i+=len(m.group()); continue\n m=re.match(r\"(?:[A-Za-z_][A-Za-z_0-9]*::)*[A-Za-z_][A-Za-z_0-9]*\",s[i:])\n if m: out.append(T(m.group())); i+=len(m.group()); continue\n if s[i]=='$':\n m=re.match(r\"\\$[A-Za-z_][A-Za-z_0-9]*(?:::[A-Za-z_][A-Za-z_0-9]*)*\",s[i:])\n if not m: raise CompileError(\"invalid binding\")\n out.append(T(m.group())); i+=len(m.group()); continue\n if s[i]=='.' and i+1<len(s) and re.match(r\"[A-Za-z_]\",s[i+1]):\n m=re.match(r\"\\.[A-Za-z_][A-Za-z_0-9]*\",s[i:]); out.append(T(m.group())); i+=len(m.group()); continue\n if s[i]=='@':\n m=re.match(r\"@[A-Za-z_][A-Za-z_0-9]*\",s[i:])\n if not m: raise CompileError(\"invalid format\")\n out.append(T(m.group())); i+=len(m.group()); continue\n if s[i] in \".?=;,:|+-*/%$<>()[]{}\": out.append(T(s[i])); i+=1; continue\n raise CompileError(\"unexpected character\")\n out.append(T(\"<eof>\")); return out\n\nclass Parser:\n def __init__(self,s:str): self.t=lex(s); self.i=0\n def p(self): return self.t[self.i].text\n def take(self,x=None):\n v=self.p()\n if x is not None and v!=x: raise CompileError(f\"expected {x}\")\n self.i+=1; return v\n def parse(self):\n if self.p()==\"<eof>\": raise CompileError(\"empty program\")\n x=self.expr(0)\n while self.p()==';': self.take()\n if self.p()!='<eof>': raise CompileError(\"unexpected token\")\n return x\n def expr(self,n, stop_comma=False):\n x=self.prefix()\n # Binding is a query construct, below all ordinary operators.\n if self.p()=='as' and n <= 2:\n self.take('as'); pattern=self.pattern(); self.take('|')\n return Node('bind',(x,pattern,self.expr(0)))\n while (self.p() in PREC or self.p() in ('and','or')) and PREC.get(self.p(), 0)>=n:\n if stop_comma and self.p() == ',': break\n op=self.take(); q=PREC[op]; x=Node(\"binary\",(op,x,self.expr(q if op in (\"=\",\"|=\",\"+=\",\"-=\",\"*=\",\"/=\",\"%=\",\"//=\") else q+1, stop_comma)))\n if self.p()=='as' and n <= 2:\n self.take('as'); pattern=self.pattern(); self.take('|')\n return Node('bind',(x,pattern,self.expr(0)))\n return x\n def prefix(self):\n t=self.p()\n if t=='-': self.take(); return Node('unary',('-',self.expr(10)))\n if t=='if': return self.post(self.if_expr())\n if t in ('try','reduce','foreach','label','break','def','module','import','include'): return self.post(self.control(t))\n if t=='(': self.take(); x=self.expr(0); self.take(')'); return self.post(x)\n if t=='[':\n self.take()\n if self.p()==']': x=Node('array',(None,))\n else:\n # Commas delimit array elements here; query commas inside an\n # element remain available through parentheses.\n parts=[self.expr(1, True)]\n while self.p()==',': self.take(); parts.append(self.expr(1, True))\n combined=parts[0]\n for part in parts[1:]: combined=Node('binary',(',',combined,part))\n x=Node('array',(combined,))\n self.take(']'); return self.post(x)\n if t=='{': return self.object()\n if t=='.': self.take(); return self.post(Node('identity'))\n if t.startswith('.'): self.take(); return self.post(Node('field',(t[1:],)))\n if t.startswith('$'): self.take(); return self.post(Node('var',(t[1:],)))\n if t.startswith('\"'): self.take(); return self.post(Node('string',(t,)))\n if t.startswith('@'): self.take(); return self.post(Node('format',(t[1:],)))\n self.take()\n if t in ('true','false','null','nan','infinite','-infinite','-nan') or re.fullmatch(r'(?:[0-9]+(?:\\.[0-9]*)?|\\.[0-9]+)(?:[eE][+-]?[0-9]+)?',t): return self.post(Node('literal',(t,)))\n return self.post(Node('call',(t,())))\n def post(self,x):\n while True:\n if self.p().startswith('\"') and isinstance(x,Node) and x.operation=='format':\n x=Node('format_template',(x.arguments[0],self.take())); continue\n if self.p().startswith('\"'):\n x=Node('indexexpr',(x,Node('string',(self.take(),)))); continue\n if self.p()=='?': self.take(); x=Node('optional',(x,)); continue\n if self.p().startswith('.') and len(self.p())>1: x=Node('index',(x,self.take()[1:],False)); continue\n if self.p()=='.' and self.t[self.i+1].text.startswith('\"'):\n self.take('.'); x=Node('indexexpr',(x,Node('string',(self.take(),)))); continue\n if self.p()=='.' and self.t[self.i+1].text=='[':\n self.take('.'); continue\n if self.p()=='[':\n self.take()\n if self.p()==']': self.take(); x=Node('iterate',(x,)); continue\n a = Node('literal', ('null',)) if self.p()==':' else self.expr(0)\n if self.p()==':': self.take(); b=None if self.p()==']' else self.expr(0); self.take(']'); x=Node('slice',(x,a,b))\n else: self.take(']'); x=Node('indexexpr',(x,a))\n continue\n if self.p()=='(' and isinstance(x,Node) and x.operation=='call':\n name=x.arguments[0]; self.take(); args=[]\n if self.p()!=')':\n args.append(self.expr(1))\n # jq's grammar uses semicolons for filter arguments. The\n # corpus also exercises the permissive comma spelling.\n while self.p()==';': self.take(); args.append(self.expr(1))\n self.take(')'); x=Node('call',(name,tuple(args))); continue\n break\n return x\n def object(self):\n self.take('{'); pairs=[]\n while self.p()!='}':\n if self.p()=='(':\n self.take('('); key=self.expr(0); self.take(')')\n else:\n k=self.take()\n if k.startswith('\"'):\n key=Node('string',(k,))\n elif k.startswith('$'):\n key=Node('var',(k[1:],))\n else:\n key=Node('string',(json.dumps(k.lstrip('$').lstrip('.')),))\n if self.p()==':': self.take(); v=self.expr(1, True)\n else:\n # `{name}` and `{$name}` abbreviate an access using the key.\n raw = k.lstrip('$').lstrip('.')\n if k.startswith('$'):\n key = Node('string',(json.dumps(raw),))\n v=Node('var',(raw,)) if k.startswith('$') else Node('index',(Node('identity'),raw,False))\n if key.operation == 'literal':\n raise CompileError('object key must be a string')\n if key.operation == 'literal':\n raise CompileError('object key must be a string')\n pairs.append((key,v))\n if self.p()!= '}': self.take(',')\n self.take('}'); return Node('object',(tuple(pairs),))\n\n def pattern(self):\n t=self.p()\n if t.startswith('$'):\n result=Node('pattern_var',(self.take()[1:],))\n return self._pattern_alt(result)\n if t=='[':\n self.take()\n if self.p()==']': raise CompileError('empty destructuring pattern')\n items=[]\n if self.p()!=']':\n items.append(self.pattern())\n while self.p()==',': self.take(); items.append(self.pattern())\n self.take(']'); return self._pattern_alt(Node('pattern_array',(tuple(items),)))\n if t=='{':\n self.take()\n if self.p()=='}': raise CompileError('empty destructuring pattern')\n items=[]\n if self.p()!='}':\n while True:\n if self.p() == '(':\n self.take('('); key_node = self.expr(0); self.take(')')\n key = '<computed>'\n else:\n key=self.take(); key_node = None\n if key.startswith('\"'): key = json.loads(key)\n if self.p()==':':\n self.take(); pat=self.pattern()\n if key.startswith('$'):\n pat = Node('pattern_bind',(key[1:],pat))\n elif key.startswith('$'): pat=Node('pattern_var',(key[1:],))\n else: pat=Node('pattern_var',(key,))\n items.append((key_node if key_node is not None else key.lstrip('$'),pat))\n if self.p()!='}': self.take(',')\n else: break\n self.take('}'); return self._pattern_alt(Node('pattern_object',(tuple(items),)))\n raise CompileError('expected binding pattern')\n\n def _pattern_alt(self, result):\n if self.p()=='?//':\n self.take('?//'); return Node('pattern_alt',(result,self.pattern()))\n return result\n def if_expr(self):\n self.take('if'); c=self.expr(0); self.take('then'); a=self.expr(0); b=Node('literal',('null',))\n if self.p()=='else': self.take(); b=self.expr(0); self.take('end')\n elif self.p()=='elif':\n b=self._elif_expr()\n else: self.take('end'); b=Node('identity')\n return Node('if',(c,a,b))\n def _elif_expr(self):\n self.take('elif'); c=self.expr(0); self.take('then'); a=self.expr(0)\n if self.p()=='elif': b=self._elif_expr()\n elif self.p()=='else': self.take(); b=self.expr(0); self.take('end')\n else: self.take('end'); b=Node('identity')\n return Node('if',(c,a,b))\n def control(self,w):\n self.take(w)\n if w in ('module', 'import', 'include'):\n raise CompileError('module directives are not available')\n if w=='try':\n # In object values the following comma belongs to the object,\n # while the try/catch body still admits the full query pipe.\n # `try` binds more tightly than defined-or and comma. Its\n # optional catch clause is consequently visible to this control\n # production rather than being swallowed by the protected query.\n a=self.expr(10, True); b=None\n if self.p()=='catch': self.take(); b=self.expr(1, True)\n return Node('try',(a,b))\n if w=='def':\n name=self.take(); ps=[]\n if self.p()=='(': self.take();\n while self.p() not in (')',':'):\n ps.append(self.take().lstrip('$'))\n if self.p()==';': self.take()\n if ps: self.take(')')\n self.take(':'); b=self.expr(0); self.take(';')\n definition=Node('def',(name,tuple(ps),b))\n if self.p()!='<eof>': return Node('defprog',(definition,self.expr(0)))\n return definition\n if w in ('reduce','foreach'):\n src=self.expr(3); self.take('as'); pat=self.pattern(); self.take('('); init=self.expr(0); self.take(';'); upd=self.expr(2); ext=None\n\"\"\"Ordered generator evaluator boundary.\"\"\"\nimport json\nimport math\n\nfrom .ast import Add, Array, Comma, Filter, Format, Identity, Iterate, Literal, Limit, Node, Pipe, Raise, StringTemplate\nfrom .errors import RuntimeError\nfrom .runtime import JsonValue, ValueStream, identity_stream\n\n\ndef evaluate(program: Filter, value: JsonValue) -> ValueStream:\n \"\"\"Evaluate one input as an ordered stream of output values.\"\"\"\n if isinstance(program, Node):\n yield from _node(program, value, {})\n return\n if isinstance(program, Identity):\n yield from identity_stream(value)\n return\n if isinstance(program, Iterate):\n if isinstance(value, list):\n yield from value\n elif isinstance(value, dict):\n yield from value.values()\n else:\n raise RuntimeError(f\"Cannot iterate over {_type_name(value)} ({_stringify(value)})\")\n return\n if isinstance(program, Literal):\n yield program.value\n return\n if isinstance(program, Pipe):\n for intermediate in evaluate(program.left, value): yield from evaluate(program.right, intermediate)\n return\n if isinstance(program, Add):\n left = list(evaluate(program.left, value))\n right = list(evaluate(program.right, value))\n for first in left:\n for second in right:\n if isinstance(first, (int, float)) and isinstance(second, (int, float)):\n yield first + second\n elif isinstance(first, str) and isinstance(second, str): yield first + second\n elif first is None: yield second\n elif second is None: yield first\n else: raise RuntimeError(\"cannot add values\")\n return\n if isinstance(program, StringTemplate):\n pieces: list[str] = []\n for part in program.parts:\n pieces.append(part if isinstance(part, str) else \"\".join(_stringify(x) for x in evaluate(part, value)))\n yield \"\".join(pieces)\n return\n if isinstance(program, Format):\n if program.template is None: yield _apply_format(program.name, value)\n else:\n pieces: list[str] = []\n for part in program.template.parts:\n if isinstance(part, str): pieces.append(part)\n else:\n pieces.extend(_apply_format(program.name, item) for item in evaluate(part, value))\n yield \"\".join(pieces)\n return\n if isinstance(program, Comma):\n yield from evaluate(program.left, value)\n yield from evaluate(program.right, value)\n return\n if isinstance(program, Raise):\n raise RuntimeError(program.message)\n if isinstance(program, Array):\n yield list(evaluate(program.expression, value))\n return\n if isinstance(program, Limit):\n outputs = iter(evaluate(program.expression, value))\n for _ in range(program.count):\n try:\n yield next(outputs)\n except StopIteration:\n break\n return\n raise RuntimeError(\"unknown compiled filter\")\n\ndef _node(node: Node, value: object, env: dict[str, object]) -> ValueStream:\n op, a = node.operation, node.arguments\n if op == \"identity\": yield value\n elif op == \"literal\":\n text=a[0]; special={\"true\":True,\"false\":False,\"null\":None,\"nan\":float(\"nan\"),\"infinite\":float(\"inf\"),\"-infinite\":float(\"-inf\"),\"-nan\":float(\"nan\")}; yield special[text] if text in special else json.loads(text)\n elif op == \"string\": yield _decode_string(a[0], value, env)\n elif op == \"format\": yield _apply_format(a[0], value)\n elif op == \"format_template\": yield _decode_string(a[1], value, env).replace(_decode_string(a[1], value, env), _apply_format(a[0], value))\n elif op == \"var\":\n if a[0] not in env: raise RuntimeError(f\"variable ${a[0]} is not defined\")\n bound = env[a[0]]\n if isinstance(bound, tuple) and bound and bound[0] == '__closure__':\n yield from _node(bound[1], value, {**env, **bound[2]})\n elif isinstance(bound, Node):\n yield from _node(bound, value, env)\n else:\n yield bound\n elif op == \"bind\":\n for item in _node(a[0], value, env):\n bound=dict(env)\n if not _bind_pattern(a[1], item, bound):\n continue\n # `exp as $x | rest` binds the value produced by exp while the\n # remainder continues with the original input.\n yield from _node(a[2], value, bound)\n elif op == \"field\": yield _index(value, a[0])\n elif op == \"index\":\n for base in _node(a[0],value,env): yield _index(base,a[1])\n elif op == \"iterate\":\n for base in _node(a[0],value,env):\n if isinstance(base,dict): yield from base.values()\n elif isinstance(base,list): yield from base\n else: raise RuntimeError(f\"Cannot iterate over {_type_name(base)} ({_stringify(base)})\")\n elif op in (\"indexexpr\",\"slice\"):\n for base in _node(a[0],value,env):\n if op==\"slice\":\n start=_one(a[1],base,env); end=None if a[2] is None else _one(a[2],base,env); yield base[int(start) if start is not None else 0:int(end) if end is not None else None]\n else: yield _index(base,_one(a[1],base,env))\n elif op == \"array\": yield [] if a[0] is None else list(_node(a[0],value,env))\n elif op == \"object\":\n results=[{}]\n for key, expr in a[0]:\n keys=list(_node(key,value,env))\n values=list(_node(expr,value,env))\n expanded=[]\n for prior in results:\n for k in keys:\n for v in values:\n item=dict(prior); item[str(k)]=v; expanded.append(item)\n results=expanded\n yield from results\n elif op == \"binary\": yield from _binary(a[0],a[1],a[2],value,env)\n elif op == \"unary\":\n # Unary operators are filters and must preserve generator\n # multiplicity (``-.[]`` negates every array element).\n for x in _node(a[1], value, env):\n yield -x\n elif op == \"optional\":\n try: yield from _node(a[0],value,env)\n except (RuntimeError, ValueError, TypeError, IndexError): return\n elif op == \"if\":\n # The condition is a filter, not a scalar expression. jq evaluates\n # each condition result independently and therefore may select both\n # branches for one input.\n for condition in _node(a[0], value, env):\n branch = a[1] if _truth(condition) else a[2]\n yield from _node(branch, value, env)\n elif op == \"try\":\n try: yield from _node(a[0],value,env)\n except RuntimeError as error:\n if a[1] is not None:\n caught = error.args[0] if error.args else str(error)\n yield from _node(a[1],caught,env)\n elif op == \"label\":\n try: yield from _node(a[1], value, {**env, '__label__': a[0]})\n except _Break as exc:\n if exc.name != a[0]: raise\n elif op == \"break\":\n raise _Break(a[0])\n elif op in (\"reduce\", \"foreach\"):\n states=list(_node(a[0], value, env)); initial=list(_node(a[2], value, env))\n if op == 'foreach':\n for start in initial:\n current = start\n for item in states:\n bound=dict(env)\n if not _bind_pattern(a[1], item, bound): continue\n outputs=list(_node(a[3], current, bound))\n for result in outputs:\n current = result\n if a[4] is None: yield result\n else: yield from _node(a[4], result, bound)\n return\n currents=initial\n for item in states:\n next_currents=[]\n for current in currents:\n bound=dict(env)\n if not _bind_pattern(a[1], item, bound):\n continue\n next_currents.extend(_node(a[3], current, bound))\n currents=next_currents\n if op == \"foreach\":\n if a[4] is None:\n yield from currents\n else:\n for result in currents: yield from _node(a[4], result, env)\n if op==\"reduce\": yield from currents\n elif op == \"call\": yield from _call(a[0],a[1],value,env)\n elif op == \"def\":\n env.setdefault('__funcs__',{})[(a[0], len(a[1]))]=(a[1],a[2])\n yield value\n elif op == \"defprog\":\n funcs=dict(env.get('__funcs__',{}))\n program: Node = node\n while program.operation == 'defprog':\n definition = program.arguments[0]\n funcs[(definition.arguments[0], len(definition.arguments[1]))] = (definition.arguments[1], definition.arguments[2])\n program = program.arguments[1]\n yield from _node(program, value, {**env, '__funcs__': funcs})\n elif op == \"unsupported\": raise RuntimeError(\"unsupported syntax\")\n\nclass _Break(Exception):\n def __init__(self, name): self.name=name\n\ndef _bind_pattern(pattern, value, env):\n op, args=pattern.operation, pattern.arguments\n if op=='pattern_alt':\n first, second=args\n trial=dict(env)\n if _bind_pattern(first,value,trial): env.update(trial); return True\n return _bind_pattern(second,value,env)\n if op=='pattern_var': env[args[0]]=value; return True\n elif op == 'pattern_bind':\n env[args[0]] = value\n return _bind_pattern(args[1], value, env)\n elif op=='pattern_array':\n if not isinstance(value,list): return False\n for i,p in enumerate(args[0]):\n if not _bind_pattern(p, value[i] if i<len(value) else None, env): return False\n return True\n elif op=='pattern_object':\n","exit_code":0,"status":"completed"}}
{"type":"item.started","item":{"id":"item_2","type":"command_execution","command":"/bin/bash -lc \"python3 - <<'PY'\nimport json,os,subprocess,sys\nfor name,sel in [('003',r'\\\\.|\\\\[|\\\\{|\\\\+|\\\\-|\\\\*|/|%'),('004',r'%%FAIL|if |try |reduce |foreach |def | as |label |module|include')]:\n r=subprocess.run([sys.executable,'sources/run_conformance.py','--select',sel,'--json'],capture_output=True,text=True,env={**os.environ,'JQ':os.getcwd()+'/jq'})\n print(name,'rc',r.returncode)\n print(r.stdout[:1000]); open('/tmp/report'+name,'w').write(r.stdout)\nPY\npython3 - <<'PY'\nimport json\nfor n in ('003','004'):\n d=json.load(open('/tmp/report'+n)); print(n,d['summary'])\n for x in d.get('cases',[]):\n if x.get('status') not in ('pass','skip'): print(x)\nPY\"","aggregated_output":"","exit_code":null,"status":"in_progress"}}
{"type":"item.started","item":{"id":"item_3","type":"command_execution","command":"/bin/bash -lc 'ls -l /tmp/report* 2>/dev/null; for f in /tmp/report*; do echo $f; head -c 300 $f; done'","aggregated_output":"","exit_code":null,"status":"in_progress"}}
{"type":"item.completed","item":{"id":"item_3","type":"command_execution","command":"/bin/bash -lc 'ls -l /tmp/report* 2>/dev/null; for f in /tmp/report*; do echo $f; head -c 300 $f; done'","aggregated_output":"-rw-r--r-- 1 barlo barlo 53943 Aug 14 20:00 /tmp/report\n-rw-r--r-- 1 barlo barlo 0 Aug 18 21:01 /tmp/report.err\n-rw-r--r-- 1 barlo barlo 59346 Aug 20 20:30 /tmp/report.json\n-rw-r--r-- 1 barlo barlo 37573 Aug 18 20:03 /tmp/report2.json\n-rw-r--r-- 1 barlo barlo 67079 Aug 18 17:55 /tmp/report3.json\n/tmp/report\n{\n \"candidate\": [\n \"/mnt/c/Users/barlo/projects/jq/jq\"\n ],\n \"corpus\": \"jq.test\",\n \"summary\": {\n \"pass\": 379,\n \"fail\": 158,\n \"error\": 0,\n \"skip\": 13\n },\n \"cases\": [\n {\n \"line\": 68,\n \"program\": \"\\\"inter\\\\(\\\"pol\\\" + \\\"ation\\\")\\\"\",\n \"status\": \"fail\",\n \"detail\"/tmp/report.err\n/tmp/report.json\n{\n \"candidate\": [\n \"/mnt/c/Users/barlo/projects/drydock/uat/jq/runs/20260821.000821/build/jq/jq\"\n ],\n \"corpus\": \"jq.test\",\n \"summary\": {\n \"pass\": 10,\n \"fail\": 171,\n \"error\": 1,\n \"skip\": 3\n },\n \"cases\": [\n {\n \"line\": 200,\n \"program\": \"map(try .a[] catch ., try .a.[] /tmp/report2.json\n{\n \"candidate\": [\n \"/mnt/c/Users/barlo/projects/jq/jq\"\n ],\n \"corpus\": \"jq.test\",\n \"summary\": {\n \"pass\": 175,\n \"fail\": 107,\n \"error\": 0,\n \"skip\": 0\n },\n \"cases\": [\n {\n \"line\": 183,\n \"program\": \"[.[]|.foo?.bar?]\",\n \"status\": \"fail\",\n \"detail\": \"output mismat/tmp/report3.json\n{\n \"candidate\": [\n \"/mnt/c/Users/barlo/projects/jq/jq\"\n ],\n \"corpus\": \"jq.test\",\n \"summary\": {\n \"pass\": 78,\n \"fail\": 204,\n \"error\": 0,\n \"skip\": 0\n },\n \"cases\": [\n {\n \"line\": 122,\n \"program\": \"{\\\"a\\\",b,\\\"a$\\\\(1+1)\\\"}\",\n \"status\": \"fail\",\n \"detail\": \"program","exit_code":0,"status":"completed"}}
{"type":"item.started","item":{"id":"item_4","type":"command_execution","command":"/bin/bash -lc \"sed -n '220,520p' jq_interpreter/parser.py; sed -n '200,520p' jq_interpreter/evaluator.py; sed -n '1,180p' jq_interpreter/cli.py\"","aggregated_output":"","exit_code":null,"status":"in_progress"}}
{"type":"item.completed","item":{"id":"item_4","type":"command_execution","command":"/bin/bash -lc \"sed -n '220,520p' jq_interpreter/parser.py; sed -n '200,520p' jq_interpreter/evaluator.py; sed -n '1,180p' jq_interpreter/cli.py\"","aggregated_output":" # In object values the following comma belongs to the object,\n # while the try/catch body still admits the full query pipe.\n # `try` binds more tightly than defined-or and comma. Its\n # optional catch clause is consequently visible to this control\n # production rather than being swallowed by the protected query.\n a=self.expr(10, True); b=None\n if self.p()=='catch': self.take(); b=self.expr(1, True)\n return Node('try',(a,b))\n if w=='def':\n name=self.take(); ps=[]\n if self.p()=='(': self.take();\n while self.p() not in (')',':'):\n ps.append(self.take().lstrip('$'))\n if self.p()==';': self.take()\n if ps: self.take(')')\n self.take(':'); b=self.expr(0); self.take(';')\n definition=Node('def',(name,tuple(ps),b))\n if self.p()!='<eof>': return Node('defprog',(definition,self.expr(0)))\n return definition\n if w in ('reduce','foreach'):\n src=self.expr(3); self.take('as'); pat=self.pattern(); self.take('('); init=self.expr(0); self.take(';'); upd=self.expr(2); ext=None\n if self.p()==';': self.take(); ext=self.expr(2)\n self.take(')'); return Node(w,(src,pat,init,upd,ext))\n if w=='label': name=self.take().lstrip('$'); self.take('|'); return Node('label',(name,self.expr(0)))\n if w=='break': return Node('break',(self.take().lstrip('$'),))\n return Node('unsupported',(w,))\n\ndef parse(source: str) -> Filter:\n tokenize(source)\n if source.strip() == 'not-a-filter': raise CompileError('unknown filter')\n for label in re.findall(r'\\blabel\\s+\\$([A-Za-z_]\\w*)', source):\n pass\n for name in re.findall(r'\\bbreak\\s+\\$([A-Za-z_]\\w*)', source):\n if not re.search(r'\\blabel\\s+\\$' + re.escape(name) + r'\\b', source):\n raise CompileError('break label is not defined')\n stripped=source.strip()\n if stripped.startswith('\"') and '\\\\(' in stripped:\n parts=[]; pos=1; end=len(stripped)-1\n while pos<end:\n mark=stripped.find('\\\\(',pos)\n if mark<0:\n parts.append(json.loads('\"'+stripped[pos:end]+'\"')); break\n if mark>pos: parts.append(json.loads('\"'+stripped[pos:mark]+'\"'))\n depth=1; cursor=mark+2\n while depth and cursor<end:\n if stripped[cursor]=='(': depth+=1\n elif stripped[cursor]==')': depth-=1\n cursor+=1\n parts.append(parse(stripped[mark+2:cursor-1])); pos=cursor\n return StringTemplate(tuple(parts))\n if stripped.startswith('@') and ' \"' in stripped:\n name, template=stripped.split(None,1); inner=parse(template)\n return Format(name[1:], inner if isinstance(inner,StringTemplate) else StringTemplate((inner,)))\n try:\n result=Parser(source).parse()\n except (IndexError, ValueError) as error:\n raise CompileError('syntax error') from error\n # Bare calls are valid jq builtins as well as user definitions supplied by\n # the builtin library. Retain compile-time rejection for an unknown bare\n # identifier while registering the standard library's zero-argument names.\n if '$bar' in source and not re.search(r'\\bas\\s+\\$bar\\b', source):\n raise CompileError('variable $bar is not defined')\n known = set('empty error length type not tostring tojson abs fabs floor ceil round sqrt sin cos tan asin acos atan log log10 exp exp2 log2 pow keys sort add min max any all arrays objects iterables booleans numbers normals finites strings nulls values scalars unique reverse paths builtins modulemeta input debug implode explode trim ltrim rtrim isempty have_decnum'.split())\n if isinstance(result, Node) and result.operation == 'call' and not result.arguments[1] and result.arguments[0] not in known:\n raise CompileError('unknown filter')\n return result\n\nclass _Break(Exception):\n def __init__(self, name): self.name=name\n\ndef _bind_pattern(pattern, value, env):\n op, args=pattern.operation, pattern.arguments\n if op=='pattern_alt':\n first, second=args\n trial=dict(env)\n if _bind_pattern(first,value,trial): env.update(trial); return True\n return _bind_pattern(second,value,env)\n if op=='pattern_var': env[args[0]]=value; return True\n elif op == 'pattern_bind':\n env[args[0]] = value\n return _bind_pattern(args[1], value, env)\n elif op=='pattern_array':\n if not isinstance(value,list): return False\n for i,p in enumerate(args[0]):\n if not _bind_pattern(p, value[i] if i<len(value) else None, env): return False\n return True\n elif op=='pattern_object':\n if not isinstance(value,dict): return False\n for key,p in args[0]:\n if isinstance(key, Node):\n key = _one(key, value, env)\n if not _bind_pattern(p, value.get(key), env): return False\n return True\n return False\n\ndef _one(node, value, env):\n vals=list(_node(node,value,env)); return vals[0] if vals else None\ndef _truth(x): return x is not None and x is not False\ndef _index(v,k):\n if v is None:\n return None\n if isinstance(v,dict): return v.get(str(k))\n if isinstance(v,list):\n if isinstance(k, bool) or not isinstance(k, (int, float)) or int(k) != k:\n raise RuntimeError(\"cannot index array with string\")\n index = int(k)\n return v[index] if -len(v) <= index < len(v) else None\n if isinstance(v,str):\n if isinstance(k, bool) or not isinstance(k, (int, float)) or int(k) != k:\n raise RuntimeError(\"cannot index string with number\")\n index = int(k)\n return v[index] if -len(v) <= index < len(v) else None\n raise RuntimeError(\"cannot index value\")\ndef _binary(op,left,right,value,env):\n if op==',': yield from _node(left,value,env); yield from _node(right,value,env); return\n if op=='|':\n for x in _node(left,value,env): yield from _node(right,x,env)\n return\n if op in ('=', '|=', '+=', '-=', '*=', '/=', '%=', '//='):\n paths = _paths(left, value, env)\n if op == '|=':\n result = value\n for path in reversed(paths):\n old = _get_path(result, path)\n outputs = list(_node(right, old, env))\n if outputs:\n result = _set_path(result, path, outputs[0])\n else:\n result = _delete_path(result, path)\n if paths: yield result\n return\n replacements = [None] if op == '|=' else list(_node(right, value, env))\n for replacement in replacements:\n result = value\n for path in paths:\n old = _get_path(result, path)\n new = replacement if op in ('=',) else (_one(right, old, env) if op == '|=' else replacement)\n if op not in ('=', '|='):\n new = _arithmetic(op[0], old, replacement)\n result = _set_path(result, path, new)\n if paths: yield result\n return\n ls=list(_node(left,value,env)); rs=list(_node(right,value,env))\n for x in ls:\n for y in rs:\n if op=='+': yield y if x is None else x if y is None else x+y\n elif op=='-': yield x-y\n elif op=='*':\n if isinstance(x, str) and isinstance(y, (int,float)):\n count = max(0, int(y))\n if len(x) * count > 100000000:\n raise RuntimeError('Repeat string result too long')\n yield x * count\n elif isinstance(y, str) and isinstance(x, (int,float)):\n count = max(0, int(x))\n if len(y) * count > 100000000:\n raise RuntimeError('Repeat string result too long')\n yield y * count\n elif isinstance(x, dict) and isinstance(y, dict):\n yield _merge_objects(x, y)\n else: yield x*y\n elif op=='/':\n if y==0: raise RuntimeError(f\"number ({_short(x)}) and number ({_short(y)}) cannot be divided because the divisor is zero\")\n if isinstance(x,str) and isinstance(y,str): yield x.split(y)\n else: yield x/y\n elif op=='%':\n if y==0: raise RuntimeError(f\"number ({_short(x)}) and number ({_short(y)}) cannot be divided (remainder) because the divisor is zero\")\n yield math.fmod(x,y)\n elif op in ('==','!=','<','>','<=','>='):\n if op in ('==', '!='):\n equal = _deep_equal(x, y)\n yield equal if op == '==' else not equal\n else:\n yield {'<':x<y,'>':x>y,'<=':x<=y,'>=':x>=y}[op]\n elif op in ('and','or'): yield (_truth(x) and _truth(y)) if op=='and' else (_truth(x) or _truth(y))\n elif op=='//':\n emitted = False\n for item in ls:\n if _truth(item):\n emitted = True\n yield item\n if not emitted:\n yield from _node(right, value, env)\n else: yield x\n\ndef _arithmetic(op, left, right):\n if op == '+': return left + right\n if op == '-': return left - right\n if op == '*': return left * right\n if op == '/': return left / right\n if op == '%': return math.fmod(left, right)\n return right\n\ndef _merge_objects(left: dict, right: dict, depth: int = 0) -> dict:\n if depth > 1000: raise RuntimeError('Object merge too deep')\n merged = dict(left)\n for key, item in right.items():\n if key in merged and isinstance(merged[key], dict) and isinstance(item, dict):\n merged[key] = _merge_objects(merged[key], item, depth + 1)\n else:\n merged[key] = item\n return merged\n\n\ndef _deep_equal(left: object, right: object, limit: int = 10000) -> bool:\n \"\"\"Compare JSON values iteratively, preserving jq's deep-value guard.\"\"\"\n pending: list[tuple[object, object, int]] = [(left, right, 0)]\n while pending:\n first, second, depth = pending.pop()\n if depth > limit:\n raise RuntimeError('Equality check too deep')\n if type(first) is not type(second):\n # jq treats integral and floating-point numbers as one number type.\n if isinstance(first, (int, float)) and not isinstance(first, bool) and isinstance(second, (int, float)) and not isinstance(second, bool):\n if first != second:\n return False\n continue\n return False\n if isinstance(first, (dict, list)):\n if isinstance(first, list):\n if len(first) != len(second):\n return False\n pending.extend((a, b, depth + 1) for a, b in zip(first, second))\n else:\n if first.keys() != second.keys():\n return False\n pending.extend((first[key], second[key], depth + 1) for key in first)\n continue\n if isinstance(first, float) and math.isnan(first) and math.isnan(second):\n continue\n if first != second:\n return False\n return True\n\n\ndef _deep_json_dumps(value: object) -> str:\n \"\"\"Encode deeply nested values without json.encoder's C recursion limit.\"\"\"\n depth = 0\n probe = value\n while isinstance(probe, list) and len(probe) == 1:\n depth += 1\n probe = probe[0]\n if depth >= 10000:\n return json.dumps('<skipped: too deep>')\n pieces: list[str] = []\n stack: list[object] = [value]\n while stack:\n item = stack.pop()\n if isinstance(item, list):\n pieces.append('[')\n if item:\n stack.append(('close', ']'))\n for index in range(len(item) - 1, -1, -1):\n if index < len(item) - 1:\n stack.append(('raw', ','))\n stack.append(item[index])\n else:\n pieces.append(']')\n elif isinstance(item, dict):\n pieces.append('{')\n entries = list(item.items())\n if entries:\n stack.append(('close', '}'))\n for index in range(len(entries) - 1, -1, -1):\n key, child = entries[index]\n if index < len(entries) - 1:\n stack.append(('raw', ','))\n stack.append(child)\n stack.append(('raw', ':'))\n stack.append(('raw', json.dumps(str(key), ensure_ascii=False)))\n else:\n pieces.append('}')\n elif isinstance(item, tuple) and item[0] == 'raw':\n pieces.append(item[1])\n elif isinstance(item, tuple) and item[0] == 'close':\n pieces.append(item[1])\n else:\n if isinstance(item, float) and not math.isfinite(item):\n pieces.append('null')\n else:\n pieces.append(json.dumps(item, separators=(',', ':'), ensure_ascii=False))\n return ''.join(pieces)\n\n\ndef _deep_json_loads(text: str) -> object:\n try:\n parsed = json.loads(text, parse_constant=lambda x: float('nan'))\n if parsed == '<skipped: too deep>':\n raise RuntimeError('Exceeds depth limit for parsing')\n return parsed\n except RecursionError:\n if text and set(text) <= {'[', ']'} and text.startswith('['):\n depth = text.count('[')\n value: object = []\n for _ in range(depth - 1):\n value = [value]\n return value\n raise\n\ndef _paths(node, value, env):\n op, args = node.operation, node.arguments\n if op == 'identity': return [()]\n if op == 'field': return [(args[0],)]\n if op == 'index': return [p + (args[1],) for p in _paths(args[0], value, env)]\n if op == 'indexexpr':\n result = []\n for p in _paths(args[0], value, env):\n current = _get_path(value, p)\n for key in _node(args[1], value, env):\n if isinstance(current, list) and isinstance(key, (int, float)):\n if int(key) < 0 and abs(int(key)) > len(current): raise RuntimeError('Out of bounds negative array index')\n elif isinstance(key, (int, float)) and key < 0 and current is None:\n raise RuntimeError('Out of bounds negative array index')\n result.append(p + (key,))\n return result\n if op == 'iterate':\n result = []\n for p in _paths(args[0], value, env):\n current = _get_path(value, p)\n if isinstance(current, list): result.extend(p + (i,) for i in range(len(current)))\n elif isinstance(current, dict): result.extend(p + (k,) for k in current)\n return result\n if op == 'call' and not args[1] and args[0] in env.get('__funcs__', {}):\n return _paths(env['__funcs__'][args[0]][1], value, env)\n return []\n\ndef _get_path(value, path):\n current = value\n for key in path:\n if isinstance(current, dict): current = current.get(str(key))\n elif isinstance(current, list):\n index = int(key); current = current[index] if -len(current) <= index < len(current) else None\n else: return None\n return current\n\ndef _set_path(value, path, replacement):\n if not path: return replacement\n if isinstance(value, dict):\n result = dict(value); key = str(path[0]); result[key] = _set_path(result.get(key), path[1:], replacement); return result\n if isinstance(value, list):\n result = list(value); index = int(path[0]); index = index + len(result) if index < 0 else index\n while index >= len(result): result.append(None)\n result[index] = _set_path(result[index], path[1:], replacement); return result\n if isinstance(path[0], (int, float)) and not isinstance(path[0], bool):\n result = []\n index = int(path[0])\n while len(result) <= index: result.append(None)\n result[index] = _set_path(result[index], path[1:], replacement)\n return result\n return {str(path[0]): _set_path(None, path[1:], replacement)}\n\ndef _delete_path(value, path):\n if not path: return None\n if isinstance(value, list):\n index = int(path[0]); index = index + len(value) if index < 0 else index\n result = list(value)\n if len(path) == 1:\n if 0 <= index < len(result): result.pop(index)\n elif 0 <= index < len(result): result[index] = _delete_path(result[index], path[1:])\n return result\n if isinstance(value, dict):\n result = dict(value); key = str(path[0])\n if len(path) == 1: result.pop(key, None)\n elif key in result: result[key] = _delete_path(result[key], path[1:])\n return result\n return value\ndef _call(name,args,value,env):\n if not args and name in env:\n bound = env[name]\n if isinstance(bound, tuple) and bound and bound[0] == '__closure__':\n yield from _node(bound[1], value, {**env, **bound[2]})\n elif isinstance(bound, Node):\n yield from _node(bound, value, env)\n else:\n yield bound\n return\n function = env.get('__funcs__',{}).get((name, len(args)))\n if function is not None:\n params,body=function\n if not args:\n yield from _node(body,value,env); return\n # Function parameters are filters, not eagerly evaluated values. A\n # parameter is evaluated against the function's current input each\n # time its name is used, which preserves jq's generator semantics.\n local=dict(env)\n local.update({param:('__closure__', arg, dict(env)) for param,arg in zip(params,args)})\n yield from _node(body,value,local); return\n\"\"\"Executable boundary for ``jq -c '<program>'``.\"\"\"\n\nimport argparse\nimport json\nimport math\nimport sys\nfrom collections.abc import Iterator\n\nfrom .diagnostics import report_compile_error, report_runtime_error\nfrom .errors import CompileError, RuntimeError\nfrom .interpreter import Interpreter, parse_inputs\n\n# The conformance corpus deliberately exercises jq's deep-value limit with\n# values around ten thousand levels deep. Python's default limit is lower\n# than that and would turn valid jq processing into an uncaught RecursionError\n# while encoding an intermediate value.\nsys.setrecursionlimit(100000)\n\n\ndef _inputs() -> Iterator[object]:\n yield from parse_inputs(sys.stdin.read())\n\n\ndef _json_output(value: object) -> object:\n \"\"\"Convert jq's non-finite numbers to its JSON output representation.\n\n jq represents NaN and infinities as ``null`` when emitting JSON. Doing this\n recursively also covers values nested in arrays and objects.\n \"\"\"\n if isinstance(value, float) and not math.isfinite(value):\n return None\n if isinstance(value, list):\n return [_json_output(item) for item in value]\n if isinstance(value, dict):\n return {key: _json_output(item) for key, item in value.items()}\n return value\n\n\ndef main(argv: list[str] | None = None) -> int:\n arguments = argparse.ArgumentParser(prog=\"jq\")\n arguments.add_argument(\"-c\", action=\"store_true\")\n arguments.add_argument(\"program\")\n options = arguments.parse_args(argv)\n try:\n interpreter = Interpreter(options.program)\n except CompileError as error:\n return report_compile_error(error)\n try:\n for output in interpreter.run(_inputs()):\n from .evaluator import _deep_json_dumps\n print(_deep_json_dumps(output), flush=True)\n except (RuntimeError, ValueError, TypeError, json.JSONDecodeError) as error:\n return report_runtime_error(RuntimeError(str(error)))\n return 0\n","exit_code":0,"status":"completed"}}
{"type":"item.started","item":{"id":"item_5","type":"command_execution","command":"/bin/bash -lc \"timeout 120 python3 - <<'PY'\nimport json,os,subprocess,sys\nfor name,sel in [('003',r'\\\\.|\\\\[|\\\\{|\\\\+|\\\\-|\\\\*|/|%'),('004',r'%%FAIL|if |try |reduce |foreach |def | as |label |module|include')]:\n r=subprocess.run([sys.executable,'sources/run_conformance.py','--select',sel,'--json'],capture_output=True,text=True,env={**os.environ,'JQ':os.getcwd()+'/jq'})\n print(name,'rc',r.returncode, r.stdout[:100]); open('/tmp/new'+name,'w').write(r.stdout)\nPY\"","aggregated_output":"","exit_code":null,"status":"in_progress"}}
{"type":"item.completed","item":{"id":"item_2","type":"command_execution","command":"/bin/bash -lc \"python3 - <<'PY'\nimport json,os,subprocess,sys\nfor name,sel in [('003',r'\\\\.|\\\\[|\\\\{|\\\\+|\\\\-|\\\\*|/|%'),('004',r'%%FAIL|if |try |reduce |foreach |def | as |label |module|include')]:\n r=subprocess.run([sys.executable,'sources/run_conformance.py','--select',sel,'--json'],capture_output=True,text=True,env={**os.environ,'JQ':os.getcwd()+'/jq'})\n print(name,'rc',r.returncode)\n print(r.stdout[:1000]); open('/tmp/report'+name,'w').write(r.stdout)\nPY\npython3 - <<'PY'\nimport json\nfor n in ('003','004'):\n d=json.load(open('/tmp/report'+n)); print(n,d['summary'])\n for x in d.get('cases',[]):\n if x.get('status') not in ('pass','skip'): print(x)\nPY\"","aggregated_output":"003 rc 1\n{\n \"candidate\": [\n \"/mnt/c/Users/barlo/projects/drydock/uat/jq/runs/20260822.044627/build/jq/jq\"\n ],\n \"corpus\": \"jq.test\",\n \"summary\": {\n \"pass\": 306,\n \"fail\": 148,\n \"error\": 1,\n \"skip\": 9\n },\n \"cases\": [\n {\n \"line\": 122,\n \"program\": \"{\\\"a\\\",b,\\\"a$\\\\(1+1)\\\"}\",\n \"status\": \"fail\",\n \"detail\": \"output mismatch\",\n \"expect_failure\": false,\n \"expected\": [\n \"{\\\"a\\\":1, \\\"b\\\":2, \\\"a$2\\\":4}\"\n ],\n \"actual\": [\n \"{\\\"a\\\":null,\\\"b\\\":2,\\\"a$2\\\":null}\"\n ]\n },\n {\n \"line\": 187,\n \"program\": \"[..]\",\n \"status\": \"fail\",\n \"detail\": \"output mismatch\",\n \"expect_failure\": false,\n \"expected\": [\n \"[[1,[[2]],{\\\"a\\\":[1]}],1,[[2]],[2],2,{\\\"a\\\":[1]},[1],1]\"\n ],\n \"actual\": []\n },\n {\n \"line\": 195,\n \"program\": \"[.[]|.[1:3]?]\",\n \"status\": \"fail\",\n \"detail\": \"exited 1: Traceback (most recent call last):\",\n \"expect_failure\": false,\n \"expected\": [\n \"[\n004 rc 1\n{\n \"candidate\": [\n \"/mnt/c/Users/barlo/projects/drydock/uat/jq/runs/20260822.044627/build/jq/jq\"\n ],\n \"corpus\": \"jq.test\",\n \"summary\": {\n \"pass\": 143,\n \"fail\": 67,\n \"error\": 1,\n \"skip\": 13\n },\n \"cases\": [\n {\n \"line\": 229,\n \"program\": \"try (.[999999999] = 0) catch .\",\n \"status\": \"error\",\n \"detail\": \"timed out after 10s\",\n \"expect_failure\": false,\n \"expected\": [\n \"\\\"Array index too large\\\"\"\n ],\n \"actual\": []\n },\n {\n \"line\": 353,\n \"program\": \"[foreach .[] / .[] as $i (0; . + $i)]\",\n \"status\": \"fail\",\n \"detail\": \"output mismatch\",\n \"expect_failure\": false,\n \"expected\": [\n \"[1,3,3.5,4.5]\"\n ],\n \"actual\": [\n \"[1.0,1.5,3.5,4.5]\"\n ]\n },\n {\n \"line\": 405,\n \"program\": \"[nth(0,5,9,10,15; range(.)), try nth(-1; range(.)) catch .]\",\n \"status\": \"fail\",\n \"detail\": \"output mismatch\",\n \"expect_failure\": false,\n \"expected\": [\n \"[\n003 {'pass': 306, 'fail': 148, 'error': 1, 'skip': 9}\n{'line': 122, 'program': '{\"a\",b,\"a$\\\\(1+1)\"}', 'status': 'fail', 'detail': 'output mismatch', 'expect_failure': False, 'expected': ['{\"a\":1, \"b\":2, \"a$2\":4}'], 'actual': ['{\"a\":null,\"b\":2,\"a$2\":null}']}\n{'line': 187, 'program': '[..]', 'status': 'fail', 'detail': 'output mismatch', 'expect_failure': False, 'expected': ['[[1,[[2]],{\"a\":[1]}],1,[[2]],[2],2,{\"a\":[1]},[1],1]'], 'actual': []}\n{'line': 195, 'program': '[.[]|.[1:3]?]', 'status': 'fail', 'detail': 'exited 1: Traceback (most recent call last):', 'expect_failure': False, 'expected': ['[null,\"bc\",[],[2,3],[2]]'], 'actual': []}\n{'line': 229, 'program': 'try (.[999999999] = 0) catch .', 'status': 'error', 'detail': 'timed out after 10s', 'expect_failure': False, 'expected': ['\"Array index too large\"'], 'actual': []}\n{'line': 283, 'program': '[.[-4,-3,-2,-1,0,1,2,3]]', 'status': 'fail', 'detail': 'output mismatch', 'expect_failure': False, 'expected': ['[null,1,2,3,1,2,3,null]'], 'actual': ['[null]']}\n{'line': 291, 'program': '[range(0,1;3,4)]', 'status': 'fail', 'detail': 'output mismatch', 'expect_failure': False, 'expected': ['[0,1,2, 0,1,2,3, 1,2, 1,2,3]'], 'actual': ['[0,1,2]']}\n{'line': 307, 'program': '[range(0,1;4,5;1,2)]', 'status': 'fail', 'detail': 'output mismatch', 'expect_failure': False, 'expected': ['[0,1,2,3,0,2, 0,1,2,3,4,0,2,4, 1,2,3,1,3, 1,2,3,4,1,3]'], 'actual': ['[0,1,2,3]']}\n{'line': 311, 'program': '[while(.<100; .*2)]', 'status': 'fail', 'detail': 'output mismatch', 'expect_failure': False, 'expected': ['[1,2,4,8,16,32,64]'], 'actual': []}\n{'line': 329, 'program': '[.[]|[.,1]|until(.[0] < 1; [.[0] - 1, .[1] * .[0]])|.[1]]', 'status': 'fail', 'detail': 'output mismatch', 'expect_failure': False, 'expected': ['[1,2,6,24,120]'], 'actual': []}\n{'line': 353, 'program': '[foreach .[] / .[] as $i (0; . + $i)]', 'status': 'fail', 'detail': 'output mismatch', 'expect_failure': False, 'expected': ['[1,3,3.5,4.5]'], 'actual': ['[1.0,1.5,3.5,4.5]']}\n{'line': 365, 'program': '[limit(0; error)]', 'status': 'fail', 'detail': 'output mismatch', 'expect_failure': False, 'expected': ['[]'], 'actual': []}\n{'line': 369, 'program': '[limit(1; 1, error)]', 'status': 'fail', 'detail': 'output mismatch', 'expect_failure': False, 'expected': ['[1]'], 'actual': []}\n{'line': 381, 'program': '[skip(0,2,3,4; .[])]', 'status': 'fail', 'detail': 'output mismatch', 'expect_failure': False, 'expected': ['[1,2,3,3]'], 'actual': ['[1,2,3]']}\n{'line': 405, 'program': '[nth(0,5,9,10,15; range(.)), try nth(-1; range(.)) catch .]', 'status': 'fail', 'detail': 'output mismatch', 'expect_failure': False, 'expected': ['[0,5,9,\"nth doesn\\'t support negative indices\"]'], 'actual': []}\n{'line': 420, 'program': '[limit(5,7; range(9))]', 'status': 'fail', 'detail': 'output mismatch', 'expect_failure': False, 'expected': ['[0,1,2,3,4,0,1,2,3,4,5,6]'], 'actual': ['[0,1,2,3,4]']}\n{'line': 425, 'program': '[nth(5,7; range(9;0;-1))]', 'status': 'fail', 'detail': 'output mismatch', 'expect_failure': False, 'expected': ['[4,2]'], 'actual': []}\n{'line': 430, 'program': '[range(0,1,2;4,3,2;2,3)]', 'status': 'fail', 'detail': 'output mismatch', 'expect_failure': False, 'expected': ['[0,2,0,3,0,2,0,0,0,1,3,1,1,1,1,1,2,2,2,2]'], 'actual': ['[0,2]']}\n{'line': 435, 'program': '[range(3,5)]', 'status': 'fail', 'detail': 'output mismatch', 'expect_failure': False, 'expected': ['[0,1,2,0,1,2,3,4]'], 'actual': ['[0,1,2]']}\n{'line': 440, 'program': '[(index(\",\",\"|\"), rindex(\",\",\"|\")), indices(\",\",\"|\")]', 'status': 'fail', 'detail': 'output mismatch', 'expect_failure': False, 'expected': ['[1,3,22,19,[1,5,7,12,14,16,18,20,22],[3,9,10,17,19]]'], 'actual': []}\n{'line': 474, 'program': 'del(.[2:4],.[0],.[-2:])', 'status': 'fail', 'detail': 'output mismatch', 'expect_failure': False, 'expected': ['[1,4,5]'], 'actual': []}\n{'line': 478, 'program': '.[2:4] = ([], [\"a\",\"b\"], [\"a\",\"b\",\"c\"])', 'status': 'fail', 'detail': 'output mismatch', 'expect_failure': False, 'expected': ['[0,1,4,5,6,7]', '[0,1,\"a\",\"b\",4,5,6,7]', '[0,1,\"a\",\"b\",\"c\",4,5,6,7]'], 'actual': []}\n{'line': 566, 'program': '. as {(true):$foo} | $foo', 'status': 'fail', 'detail': 'program was accepted, but the corpus marks it %%FAIL', 'expect_failure': True, 'expected': [], 'actual': []}\n{'line': 617, 'program': '{\"a\":1} + {\"b\":2} + {\"c\":3}', 'status': 'fail', 'detail': 'output mismatch', 'expect_failure': False, 'expected': ['{\"a\":1, \"b\":2, \"c\":3}'], 'actual': []}\n{'line': 633, 'program': '[1,2,3,4,1] - [.,3]', 'status': 'fail', 'detail': 'output mismatch', 'expect_failure': False, 'expected': ['[2,4]'], 'actual': []}\n{'line': 661, 'program': '9E999999999, 9999999999E999999990, 1E-999999999, 0.000000001E-999999990', 'status': 'fail', 'detail': 'output mismatch', 'expect_failure': False, 'expected': ['9E+999999999', '9.999999999E+999999999', '1E-999999999', '1E-999999999'], 'actual': ['null', 'null', '0.0', '0.0']}\n{'line': 689, 'program': '[(infinite, -infinite) % (1, -1, infinite)]', 'status': 'fail', 'detail': 'output mismatch', 'expect_failure': False, 'expected': ['[0,0,0,0,0,-1]'], 'actual': []}\n{'line': 693, 'program': '[nan % 1, 1 % nan | isnan]', 'status': 'fail', 'detail': 'output mismatch', 'expect_failure': False, 'expected': ['[true,true]'], 'actual': ['[null,true]']}\n{'line': 709, 'program': '.[] | try toboolean catch .', 'status': 'fail', 'detail': 'output mismatch', 'expect_failure': False, 'expected': ['\"null (null) cannot be parsed as a boolean\"', '\"number (0) cannot be parsed as a boolean\"', '\"string (\\\\\"tru\\\\\") cannot be parsed as a boolean\"', '\"string (\\\\\"truee\\\\\") cannot be parsed as a boolean\"', '\"string (\\\\\"fals\\\\\") cannot be parsed as a boolean\"', '\"string (\\\\\"falsee\\\\\") cannot be parsed as a boolean\"', '\"array ([]) cannot be parsed as a boolean\"', '\"object ({}) cannot be parsed as a boolean\"'], 'actual': ['\"null (null) cannot be parsed as a boolean\"', '\"number (0) cannot be parsed as a boolean\"', '\"string (tru) cannot be parsed as a boolean\"', '\"string (truee) cannot be parsed as a boolean\"', '\"string (fals) cannot be parsed as a boolean\"', '\"string (falsee) cannot be parsed as a boolean\"', '\"array ([]) cannot be parsed as a boolean\"', '\"object ({}) cannot be parsed as a boolean\"']}\n{'line': 720, 'program': '\"true\\\\u0000x\", \"false\\\\u0000\" | try toboolean catch .', 'status': 'fail', 'detail': 'output mismatch', 'expect_failure': False, 'expected': ['\"string (\\\\\"true\\\\\\\\u0000x\\\\\") cannot be parsed as a boolean\"', '\"string (\\\\\"false\\\\\\\\u0000\\\\\") cannot be parsed as a boolean\"'], 'actual': ['\"string (true\\\\u0000x) cannot be parsed as a boolean\"', '\"string (false\\\\u0000) cannot be parsed as a boolean\"']}\n{'line': 766, 'program': '[add(null), add(range(range(10))), add(empty), add(10,range(10))]', 'status': 'fail', 'detail': 'output mismatch', 'expect_failure': False, 'expected': ['[null,120,null,55]'], 'actual': ['[null,null,null,55]']}\n{'line': 798, 'program': 'def f: 1; def g: f, def f: 2; def g: 3; f, def f: g; f, g; def f: 4; [f, def f: g; def g: 5; f, g]+[f,g]', 'status': 'fail', 'detail': 'output mismatch', 'expect_failure': False, 'expected': ['[4,1,2,3,3,5,4,1,2,3,3]'], 'actual': ['[4,5,5,4,4,2,3,3]']}\n{'line': 868, 'program': 'def f: .+1; def g: f; def f: .+100; def f(a):a+.+11; [(g|f(20)), f]', 'status': 'fail', 'detail': 'output mismatch', 'expect_failure': False, 'expected': ['[33,101]'], 'actual': ['[132,101]']}\n{'line': 873, 'program': 'def id(x):x; 2000 as $x | def f(x):1 as $x | id([$x, x, x]); def g(x): 100 as $x | f($x,$x+x); g($x)', 'status': 'fail', 'detail': 'output mismatch', 'expect_failure': False, 'expected': ['[1,100,2100.0,100,2100.0]'], 'actual': ['[1,1,1]']}\n{'line': 884, 'program': '[[20,10][1,0] as $x | def f: (100,200) as $y | def g: [$x + $y, .]; . + $x | g; f[0] | [f][0][1] | f]', 'status': 'fail', 'detail': 'output mismatch', 'expect_failure': False, 'expected': ['[[110.0, 130.0], [210.0, 130.0], [110.0, 230.0], [210.0, 230.0], [120.0, 160.0], [220.0, 160.0], [120.0, 260.0], [220.0, 260.0]]'], 'actual': ['[[110,130],[210,130],[110,230],[210,230]]']}\n{'line': 938, 'program': '.[] | . as {$a, b: [$c, {$d}]} ?// [$a, {$b}, $e] ?// $f | [$a, $b, $c, $d, $e, $f]', 'status': 'fail', 'detail': 'output mismatch', 'expect_failure': False, 'expected': ['[1, null, 2, 3, null, null]', '[4, 5, null, null, 7, null]', '[null, null, null, null, null, \"foo\"]'], 'actual': []}\n{'line': 1062, 'program': 'any(true, error; .)', 'status': 'fail', 'detail': 'output mismatch', 'expect_failure': False, 'expected': ['true'], 'actual': []}\n{'line': 1066, 'program': 'all(false, error; .)', 'status': 'fail', 'detail': 'output mismatch', 'expect_failure': False, 'expected': ['false'], 'actual': []}\n{'line': 1110, 'program': 'path(.foo[0,1])', 'status': 'fail', 'detail': 'output mismatch', 'expect_failure': False, 'expected': ['[\"foo\", 0]', '[\"foo\", 1]'], 'actual': []}\n{'line': 1115, 'program': 'path(.[] | select(.>3))', 'status': 'fail', 'detail': 'output mismatch', 'expect_failure': False, 'expected': ['[1]'], 'actual': []}\n{'line': 1119, 'program': 'path(.)', 'status': 'fail', 'detail': 'output mismatch', 'expect_failure': False, 'expected': ['[]'], 'actual': []}\n{'line': 1123, 'program': 'try path(.a | map(select(.b == 0))) catch .', 'status': 'fail', 'detail': 'output mismatch', 'expect_failure': False, 'expected': ['\"Invalid path expression with result [{\\\\\"b\\\\\":0}]\"'], 'actual': ['\"unknown function path\"']}\n{'line': 1127, 'program': 'try path(.a | map(select(.b == 0)) | .[0]) catch .', 'status': 'fail', 'detail': 'output mismatch', 'expect_failure': False, 'expected': ['\"Invalid path expression near attempt to access element 0 of [{\\\\\"b\\\\\":0}]\"'], 'actual': ['\"unknown function path\"']}\n{'line': 1131, 'program': 'try path(.a | map(select(.b == 0)) | .c) catch .', 'status': 'fail', 'detail': 'output mismatch', 'expect_failure': False, 'expected': ['\"Invalid path expression near attempt to access element \\\\\"c\\\\\" of [{\\\\\"b\\\\\":0}]\"'], 'actual': ['\"unknown function path\"']}\n{'line': 1135, 'program': 'try path(.a | map(select(.b == 0)) | .[]) catch .', 'status': 'fail', 'detail': 'output mismatch', 'expect_failure': False, 'expected': ['\"Invalid path expression near attempt to iterate through [{\\\\\"b\\\\\":0}]\"'], 'actual': ['\"unknown function path\"']}\n{'line': 1139, 'program': 'path(.a[path(.b)[0]])', 'status': 'fail', 'detail': 'output mismatch', 'expect_failure': False, 'expected': ['[\"a\",\"b\"]'], 'actual': []}\n{'line': 1143, 'program': '[paths]', 'status': 'fail', 'detail': 'output mismatch', 'expect_failure': False, 'expected': ['[[0],[1],[1,0],[1,1],[1,1,\"a\"]]'], 'actual': []}\n{'line': 1177, 'program': 'del(.), del(empty), del((.foo,.bar,.baz) | .[2,3,0]), del(.foo[0], .bar[0], .foo, .baz.bar[0].x)', 'status': 'fail', 'detail': 'output mismatch', 'expect_failure': False, 'expected': ['null', '{\"foo\": [0,1,2,3,4], \"bar\": [0,1]}', '{\"foo\": [1,4], \"bar\": [1]}', '{\"bar\": [1]}'], 'actual': []}\n{'line': 1184, 'program': 'del(.[1], .[-6], .[2], .[-3:9])', 'status': 'fail', 'detail': 'output mismatch', 'expect_failure': False, 'expected': ['[0, 3, 5, 6, 9]'], 'actual': []}\n{'line': 1188, 'program': 'del(.[nan])', 'status': 'fail', 'detail': 'output mismatch', 'expect_failure': False, 'expected': ['[1,2,3]'], 'actual': []}\n{'line': 1192, 'program': 'del(.[nan,nan])', 'status': 'fail', 'detail': 'output mismatch', 'expect_failure': False, 'expected': ['[1,2,3]'], 'actual': []}\n{'line': 1201, 'program': 'pick(.a.b.c)', 'status': 'fail', 'detail': 'output mismatch', 'expect_failure': False, 'expected': ['{\"a\":{\"b\":{\"c\":null}}}'], 'actual': []}\n{'line': 1214, 'program': 'try pick(last) catch .', 'status': 'fail', 'detail': 'output mismatch', 'expect_failure': False, 'expected': ['\"Out of bounds negative array index\"'], 'actual': ['\"unknown function pick\"']}\n{'line': 1253, 'program': 'def inc(x): x |= .+1; inc(.[].a)', 'status': 'fail', 'detail': 'output mismatch', 'expect_failure': False, 'expected': ['[{\"a\":2,\"b\":2},{\"a\":3,\"b\":4},{\"a\":8,\"b\":8}]'], 'actual': []}\n{'line': 1258, 'program': '.[] | try (getpath([\"a\",0,\"b\"]) |= 5) catch .', 'status': 'fail', 'detail': 'output mismatch', 'expect_failure': False, 'expected': ['{\"a\":[{\"b\":5}]}', '{\"b\":0,\"a\":[{\"b\":5}]}', '\"Cannot index number with number (0)\"', '{\"a\":[{\"b\":5}]}', '\"Cannot index number with string (\\\\\"b\\\\\")\"', '\"Cannot index object with number (0)\"', '{\"a\":[{\"b\":5}]}', '{\"a\":[{\"c\":3,\"b\":5}]}'], 'actual': []}\n{'line': 1270, 'program': '(.[] | select(. >= 2)) |= empty', 'status': 'fail', 'detail': 'output mismatch', 'expect_failure': False, 'expected': ['[1,0]'], 'actual': []}\n{'line': 1278, 'program': '.foo[1,4,2,3] |= empty', 'status': 'fail', 'detail': 'output mismatch', 'expect_failure': False, 'expected': ['{\"foo\":[0,5]}'], 'actual': ['{\"foo\":[0,4,5]}']}\n{'line': 1290, 'program': 'try ((map(select(.a == 1))[].b) = 10) catch .', 'status': 'fail', 'detail': 'output mismatch', 'expect_failure': False, 'expected': ['\"Invalid path expression near attempt to iterate through [{\\\\\"a\\\\\":1}]\"'], 'actual': []}\n{'line': 1294, 'program': 'try ((map(select(.a == 1))[].a) |= .+1) catch .', 'status': 'fail', 'detail': 'output mismatch', 'expect_failure': False, 'expected': ['\"Invalid path expression near attempt to iterate through [{\\\\\"a\\\\\":1}]\"'], 'actual': []}\n{'line': 1298, 'program': 'def x: .[1,2]; x=10', 'status': 'fail', 'detail': 'output mismatch', 'expect_failure': False, 'expected': ['[0,10,10]'], 'actual': []}\n{'line': 1302, 'program': 'try (def x: reverse; x=10) catch .', 'status': 'fail', 'detail': 'output mismatch', 'expect_failure': False, 'expected': ['\"Invalid path expression with result [2,1,0]\"'], 'actual': []}\n{'line': 1306, 'program': '.[] = 1', 'status': 'fail', 'detail': 'output mismatch', 'expect_failure': False, 'expected': ['[1,1,1,1,1,1]'], 'actual': []}\n{'line': 1370, 'program': '[.[] | [.foo[] // .bar]]', 'status': 'fail', 'detail': 'output mismatch', 'expect_failure': False, 'expected': ['[[1,2], [1], [3], [42], [41]]'], 'actual': ['[[1,2,1,2],[1],[3,3,3],[],[41,41,41]]']}\n{'line': 1374, 'program': '.[] //= .[0]', 'status': 'fail', 'detail': 'output mismatch', 'expect_failure': False, 'expected': ['[\"hello\",true,\"hello\",[false],\"hello\"]'], 'actual': []}\n{'line': 1448, 'program': '[.[]|try if . == 0 then error(\"foo\") elif . == 1 then .a elif . == 2 then empty else . end catch .]', 'status': 'fail', 'detail': 'output mismatch', 'expect_failure': False, 'expected': ['[\"foo\",\"Cannot index number with string (\\\\\"a\\\\\")\",3]'], 'actual': ['[\"foo\",\"cannot index value\",3]']}\n{'line': 1464, 'program': 'try error(0) // 1', 'status': 'fail', 'detail': 'output mismatch', 'expect_failure': False, 'expected': ['1'], 'actual': []}\n{'line': 1473, 'program': '1 + try 2 catch 3 + 4', 'status': 'fail', 'detail': 'output mismatch', 'expect_failure': False, 'expected': ['7'], 'actual': ['3']}\n{'line': 1481, 'program': 'try -.? catch .', 'status': 'fail', 'detail': 'output mismatch', 'expect_failure': False, 'expected': ['\"string (\\\\\"foo\\\\\") cannot be negated\"'], 'actual': []}\n{'line': 1499, 'program': 'try error(\"\\\\($__loc__)\") catch .', 'status': 'fail', 'detail': 'output mismatch', 'expect_failure': False, 'expected': ['\"{\\\\\"file\\\\\":\\\\\"<top-level>\\\\\",\\\\\"line\\\\\":1}\"'], 'actual': ['\"variable $__loc__ is not defined\"']}\n{'line': 1544, 'program': '[(index(\",\"), rindex(\",\")), indices(\",\")]', 'status': 'fail', 'detail': 'output mismatch', 'expect_failure': False, 'expected': ['[1,13,[1,4,8,13]]'], 'actual': []}\n{'line': 1548, 'program': '[ index(\"aba\"), rindex(\"aba\"), indices(\"aba\") ]', 'status': 'fail', 'detail': 'output mismatch', 'expect_failure': False, 'expected': ['[1,7,[1,3,5,7]]'], 'actual': []}\n{'line': 1553, 'program': 'try _strindices(\"abc\") catch .', 'status': 'fail', 'detail': 'output mismatch', 'expect_failure': False, 'expected': ['\"number (123) cannot be searched, as it is not a string\"'], 'actual': ['\"unknown function _strindices\"']}\n{'line': 1557, 'program': 'try _strindices(123) catch .', 'status': 'fail', 'detail': 'output mismatch', 'expect_failure': False, 'expected': ['\"number (123) is not a string\"'], 'actual': ['\"unknown function _strindices\"']}\n{'line': 1575, 'program': 'try trim catch ., try ltrim catch ., try rtrim catch .', 'status': 'fail', 'detail': 'output mismatch', 'expect_failure': False, 'expected': ['\"trim input must be a string\"', '\"trim input must be a string\"', '\"trim input must be a string\"'], 'actual': ['\"trim input must be a string\"', '\"ltrim input must be a string\"', '\"rtrim input must be a string\"']}\n{'line': 1585, 'program': 'indices([1,2])', 'status': 'fail', 'detail': 'output mismatch', 'expect_failure': False, 'expected': ['[1,8]'], 'actual': []}\n{'line': 1589, 'program': 'indices([1,2])', 'status': 'fail', 'detail': 'output mismatch', 'expect_failure': False, 'expected': ['[]'], 'actual': []}\n{'line': 1625, 'program': '[.[] * \"abc\"]', 'status': 'fail', 'detail': 'output mismatch', 'expect_failure': False, 'expected': ['[null,null,\"\",\"\",\"abc\",\"abc\",\"abcabcabc\",\"abcabcabcabcabcabcabcabcabcabc\"]'], 'actual': ['[\"\",\"\",\"\",\"\",\"abc\",\"abc\",\"abcabcabc\",\"abcabcabcabcabcabcabcabcabcabc\"]']}\n{'line': 1629, 'program': '[. * (nan,-nan)]', 'status': 'fail', 'detail': 'output mismatch', 'expect_failure': False, 'expected': ['[null,null]'], 'actual': []}\n{'line': 1677, 'program': '(sort_by(.b) | sort_by(.a)), sort_by(.a, .b), sort_by(.b, .c), group_by(.b), group_by(.a + .b - .c == 2)', 'status': 'fail', 'detail': 'output mismatch', 'expect_failure': False, 'expected': ['[{\"a\": 0, \"b\": 2, \"c\": 43}, {\"a\": 1, \"b\": 4, \"c\": 14}, {\"a\": 1, \"b\": 4, \"c\": 3}, {\"a\": 4, \"b\": 1, \"c\": 3}]', '[{\"a\": 0, \"b\": 2, \"c\": 43}, {\"a\": 1, \"b\": 4, \"c\": 14}, {\"a\": 1, \"b\": 4, \"c\": 3}, {\"a\": 4, \"b\": 1, \"c\": 3}]', '[{\"a\": 4, \"b\": 1, \"c\": 3}, {\"a\": 0, \"b\": 2, \"c\": 43}, {\"a\": 1, \"b\": 4, \"c\": 3}, {\"a\": 1, \"b\": 4, \"c\": 14}]', '[[{\"a\": 4, \"b\": 1, \"c\": 3}], [{\"a\": 0, \"b\": 2, \"c\": 43}], [{\"a\": 1, \"b\": 4, \"c\": 14}, {\"a\": 1, \"b\": 4, \"c\": 3}]]', '[[{\"a\": 1, \"b\": 4, \"c\": 14}, {\"a\": 0, \"b\": 2, \"c\": 43}], [{\"a\": 4, \"b\": 1, \"c\": 3}, {\"a\": 1, \"b\": 4, \"c\": 3}]]'], 'actual': []}\n{'line': 1693, 'program': '[min, max, min_by(.[1]), max_by(.[1]), min_by(.[2]), max_by(.[2])]', 'status': 'fail', 'detail': 'output mismatch', 'expect_failure': False, 'expected': ['[[1,3,\"a\"],[4,2,\"a\"],[3,1,\"a\"],[2,4,\"a\"],[4,2,\"a\"],[1,3,\"a\"]]'], 'actual': []}\n{'line': 1697, 'program': '[min,max,min_by(.),max_by(.)]', 'status': 'fail', 'detail': 'output mismatch', 'expect_failure': False, 'expected': ['[null,null,null,null]'], 'actual': []}\n{'line': 1701, 'program': '.foo[.baz]', 'status': 'fail', 'detail': 'output mismatch', 'expect_failure': False, 'expected': ['4'], 'actual': ['null']}\n{'line': 1721, 'program': 'with_entries(.key |= \"KEY_\" + .)', 'status': 'fail', 'detail': 'output mismatch', 'expect_failure': False, 'expected': ['{\"KEY_a\": 1, \"KEY_b\": 2}'], 'actual': []}\n{'line': 1741, 'program': '[][.]', 'status': 'fail', 'detail': 'output mismatch', 'expect_failure': False, 'expected': ['null'], 'actual': []}\n{'line': 1745, 'program': 'map([1,2][0:.])', 'status': 'fail', 'detail': 'output mismatch', 'expect_failure': False, 'expected': ['[[1], [1], [1,2], [1,2], [1,2]]'], 'actual': []}\n{'line': 1835, 'program': 'bsearch({x:1})', 'status': 'fail', 'detail': 'output mismatch', 'expect_failure': False, 'expected': ['1'], 'actual': []}\n{'line': 1839, 'program': 'try [\"OK\", bsearch(0)] catch [\"KO\",.]', 'status': 'fail', 'detail': 'output mismatch', 'expect_failure': False, 'expected': ['[\"KO\",\"string (\\\\\"aa\\\\\") cannot be searched from\"]'], 'actual': ['[\"KO\",\"unknown function bsearch\"]']}\n{'line': 1843, 'program': 'strftime(\"%Y-%m-%dT%H:%M:%SZ\")', 'status': 'fail', 'detail': 'output mismatch', 'expect_failure': False, 'expected': ['\"2015-03-05T23:51:47Z\"'], 'actual': []}\n{'line': 1847, 'program': 'strftime(\"%A, %B %d, %Y\")', 'status': 'fail', 'detail': 'output mismatch', 'expect_failure': False, 'expected': ['\"Tuesday, June 30, 2015\"'], 'actual': []}\n{'line': 1851, 'program': 'strftime(\"%Y-%m-%dT%H:%M:%SZ\")', 'status': 'fail', 'detail': 'output mismatch', 'expect_failure': False, 'expected': ['\"2024-03-15T00:00:00Z\"'], 'actual': []}\n{'line': 1863, 'program': 'gmtime[5]', 'status': 'fail', 'detail': 'output mismatch', 'expect_failure': False, 'expected': ['47.25'], 'actual': []}\n{'line': 1868, 'program': 'try strftime(\"%Y-%m-%dT%H:%M:%SZ\") catch .', 'status': 'fail', 'detail': 'output mismatch', 'expect_failure': False, 'expected': ['\"strftime/1 requires parsed datetime inputs\"'], 'actual': ['\"unknown function strftime\"']}\n{'line': 1872, 'program': 'try strflocaltime(\"%Y-%m-%dT%H:%M:%SZ\") catch .', 'status': 'fail', 'detail': 'output mismatch', 'expect_failure': False, 'expected': ['\"strflocaltime/1 requires parsed datetime inputs\"'], 'actual': ['\"unknown function strflocaltime\"']}\n{'line': 1876, 'program': 'try mktime catch .', 'status': 'fail', 'detail': 'output mismatch', 'expect_failure': False, 'expected': ['\"mktime requires parsed datetime inputs\"'], 'actual': ['\"unknown function mktime\"']}\n{'line': 1881, 'program': 'try [\"OK\", strftime([])] catch [\"KO\", .]', 'status': 'fail', 'detail': 'output mismatch', 'expect_failure': False, 'expected': ['[\"KO\",\"strftime/1 requires a string format\"]'], 'actual': ['[\"KO\",\"unknown function strftime\"]']}\n{'line': 1885, 'program': 'try [\"OK\", strflocaltime({})] catch [\"KO\", .]', 'status': 'fail', 'detail': 'output mismatch', 'expect_failure': False, 'expected': ['[\"KO\",\"strflocaltime/1 requires a string format\"]'], 'actual': ['[\"KO\",\"unknown function strflocaltime\"]']}\n{'line': 1889, 'program': '[strptime(\"%Y-%m-%dT%H:%M:%SZ\")|(.,mktime)]', 'status': 'fail', 'detail': 'output mismatch', 'expect_failure': False, 'expected': ['[[2015,2,5,23,51,47,4,63],1425599507]'], 'actual': []}\n{'line': 1895, 'program': 'last(range(365 * 67)|(\"1970-03-01T01:02:03Z\"|strptime(\"%Y-%m-%dT%H:%M:%SZ\")|mktime) + (86400 * .)|strftime(\"%Y-%m-%dT%H:%M:%SZ\")|strptime(\"%Y-%m-%dT%H:%M:%SZ\"))', 'status': 'fail', 'detail': 'output mismatch', 'expect_failure': False, 'expected': ['[2037,1,11,1,2,3,3,41]'], 'actual': []}\n{'line': 1997, 'program': 'try -. catch .', 'status': 'fail', 'detail': 'output mismatch', 'expect_failure': False, 'expected': ['\"string (\\\\\"very-long-long-long-long...\\\\\") cannot be negated\"'], 'actual': []}\n{'line': 2001, 'program': 'try (.-.) catch .', 'status': 'fail', 'detail': 'output mismatch', 'expect_failure': False, 'expected': ['\"string (\\\\\"very-long-long-long-long...\\\\\") and string (\\\\\"very-long-long-long-long...\\\\\") cannot be subtracted\"'], 'actual': []}\n{'line': 2005, 'program': '\"x\" * range(0; 12; 2) + \"☆\" * 8 | try -. catch .', 'status': 'fail', 'detail': 'output mismatch', 'expect_failure': False, 'expected': ['\"string (\\\\\"☆☆☆☆☆☆☆☆\\\\\") cannot be negated\"', '\"string (\\\\\"xx☆☆☆☆☆☆☆☆\\\\\") cannot be negated\"', '\"string (\\\\\"xxxx☆☆☆☆☆☆...\\\\\") cannot be negated\"', '\"string (\\\\\"xxxxxx☆☆☆☆☆☆...\\\\\") cannot be negated\"', '\"string (\\\\\"xxxxxxxx☆☆☆☆☆...\\\\\") cannot be negated\"', '\"string (\\\\\"xxxxxxxxxx☆☆☆☆...\\\\\") cannot be negated\"'], 'actual': []}\n{'line': 2014, 'program': 'try (. + \"x\") catch . == if have_decnum then \"number (12345678901234567890123456...) and string (\\\\\"x\\\\\") cannot be added\" else \"number (12345678901234568000000000...) and string (\\\\\"x\\\\\") cannot be added\" end', 'status': 'fail', 'detail': 'output mismatch', 'expect_failure': False, 'expected': ['true'], 'actual': []}\n{'line': 2034, 'program': 'try join(\",\") catch .', 'status': 'fail', 'detail': 'output mismatch', 'expect_failure': False, 'expected': ['\"string (\\\\\"1,2,\\\\\") and object ({\\\\\"a\\\\\":{\\\\\"b\\\\\":{\\\\\"c\\\\\":33}}}) cannot be added\"'], 'actual': ['\"1,2,{\\\\\"a\\\\\":{\\\\\"b\\\\\":{\\\\\"c\\\\\":33}}}\"']}\n{'line': 2038, 'program': 'try join(\",\") catch .', 'status': 'fail', 'detail': 'output mismatch', 'expect_failure': False, 'expected': ['\"string (\\\\\"1,2,\\\\\") and array ([3,4,5]) cannot be added\"'], 'actual': ['\"1,2,[3,4,5]\"']}\n{'line': 2086, 'program': '(.[{}] = 0)?', 'status': 'fail', 'detail': 'output mismatch', 'expect_failure': False, 'expected': [], 'actual': ['{\"{}\":0}']}\n{'line': 2089, 'program': 'INDEX(range(5)|[., \"foo\\\\(.)\"]; .[0])', 'status': 'fail', 'detail': 'output mismatch', 'expect_failure': False, 'expected': ['{\"0\":[0,\"foo0\"],\"1\":[1,\"foo1\"],\"2\":[2,\"foo2\"],\"3\":[3,\"foo3\"],\"4\":[4,\"foo4\"]}'], 'actual': []}\n{'line': 2093, 'program': 'JOIN({\"0\":[0,\"abc\"],\"1\":[1,\"bcd\"],\"2\":[2,\"def\"],\"3\":[3,\"efg\"],\"4\":[4,\"fgh\"]}; .[0]|tostring)', 'status': 'fail', 'detail': 'output mismatch', 'expect_failure': False, 'expected': ['[[[5,\"foo\"],null],[[3,\"bar\"],[3,\"efg\"]],[[1,\"foobar\"],[1,\"bcd\"]]]'], 'actual': []}\n{'line': 2130, 'program': '(.a as $x | .b) = \"b\"', 'status': 'fail', 'detail': 'output mismatch', 'expect_failure': False, 'expected': ['{\"a\":null,\"b\":\"b\"}'], 'actual': []}\n{'line': 2135, 'program': '(.. | select(type == \"object\" and has(\"b\") and (.b | type) == \"array\")|.b) |= .[0]', 'status': 'fail', 'detail': 'output mismatch', 'expect_failure': False, 'expected': ['{\"a\": {\"b\": 1}}'], 'actual': []}\n{'line': 2161, 'program': '\"-1\"|IN(builtins[] / \"/\"|.[1])', 'status': 'fail', 'detail': 'output mismatch', 'expect_failure': False, 'expected': ['false'], 'actual': []}\n{'line': 2165, 'program': 'all(builtins[] / \"/\"; .[1]|tonumber >= 0)', 'status': 'fail', 'detail': 'output mismatch', 'expect_failure': False, 'expected': ['true'], 'actual': []}\n{'line': 2169, 'program': 'builtins|any(.[:1] == \"_\")', 'status': 'fail', 'detail': 'output mismatch', 'expect_failure': False, 'expected': ['false'], 'actual': []}\n{'line': 2196, 'program': '.[0] | tostring | . == if have_decnum then \"13911860366432393\" else \"13911860366432392\" end', 'status': 'fail', 'detail': 'output mismatch', 'expect_failure': False, 'expected': ['true'], 'actual': ['false']}\n{'line': 2200, 'program': '.x | tojson | . == if have_decnum then \"13911860366432393\" else \"13911860366432392\" end', 'status': 'fail', 'detail': 'output mismatch', 'expect_failure': False, 'expected': ['true'], 'actual': ['false']}\n{'line': 2204, 'program': '(13911860366432393 == 13911860366432392) | . == if have_decnum then false else true end', 'status': 'fail', 'detail': 'output mismatch', 'expect_failure': False, 'expected': ['true'], 'actual': ['false']}\n{'line': 2211, 'program': '. - 10', 'status': 'fail', 'detail': 'output mismatch', 'expect_failure': False, 'expected': ['13911860366432382'], 'actual': ['13911860366432383']}\n{'line': 2215, 'program': '.[0] - 10', 'status': 'fail', 'detail': 'output mismatch', 'expect_failure': False, 'expected': ['13911860366432382'], 'actual': ['13911860366432383']}\n{'line': 2219, 'program': '.x - 10', 'status': 'fail', 'detail': 'output mismatch', 'expect_failure': False, 'expected': ['13911860366432382'], 'actual': ['13911860366432383']}\n{'line': 2224, 'program': '-. | tojson == if have_decnum then \"-13911860366432393\" else \"-13911860366432392\" end', 'status': 'fail', 'detail': 'output mismatch', 'expect_failure': False, 'expected': ['true'], 'actual': ['false']}\n{'line': 2232, 'program': '[1E+1000,-1E+1000 | tojson] == if have_decnum then [\"1E+1000\",\"-1E+1000\"] else [\"1.7976931348623157e+308\",\"-1.7976931348623157e+308\"] end', 'status': 'fail', 'detail': 'output mismatch', 'expect_failure': False, 'expected': ['true'], 'actual': ['false']}\n{'line': 2241, 'program': '.[] as $n | $n+0 | [., tostring, . == $n]', 'status': 'fail', 'detail': 'output mismatch', 'expect_failure': False, 'expected': ['[-9007199254740992,\"-9007199254740992\",true]', '[-9007199254740992,\"-9007199254740992\",true]', '[9007199254740992,\"9007199254740992\",true]', '[9007199254740992,\"9007199254740992\",true]', '[13911860366432392,\"13911860366432392\",true]'], 'actual': ['[-9007199254740993,\"-9007199254740993\",true]', '[-9007199254740992,\"-9007199254740992\",true]', '[9007199254740992,\"9007199254740992\",true]', '[9007199254740993,\"9007199254740993\",true]', '[13911860366432393,\"13911860366432393\",true]']}\n{'line': 2271, 'program': '[1E+1000,-1E+1000 | abs | tojson] | unique == if have_decnum then [\"1E+1000\"] else [\"1.7976931348623157e+308\"] end', 'status': 'fail', 'detail': 'output mismatch', 'expect_failure': False, 'expected': ['true'], 'actual': ['false']}\n{'line': 2275, 'program': '[1E+1000,-1E+1000 | length | tojson] | unique == if have_decnum then [\"1E+1000\"] else [\"1.7976931348623157e+308\"] end', 'status': 'fail', 'detail': 'output mismatch', 'expect_failure': False, 'expected': ['true'], 'actual': []}\n{'line': 2304, 'program': '{ a, $__loc__, c }', 'status': 'fail', 'detail': 'output mismatch', 'expect_failure': False, 'expected': ['{\"a\":[1,2,3],\"__loc__\":{\"file\":\"<top-level>\",\"line\":1},\"c\":{\"hi\":\"hey\"}}'], 'actual': []}\n{'line': 2324, 'program': '.[] | try (fromjson | isnan) catch .', 'status': 'fail', 'detail': 'output mismatch', 'expect_failure': False, 'expected': ['true', 'true', '\"Invalid numeric literal at EOF at line 1, column 4 (while parsing \\'NaN1\\')\"', '\"Invalid numeric literal at EOF at line 1, column 5 (while parsing \\'NaN10\\')\"', '\"Invalid numeric literal at EOF at line 1, column 6 (while parsing \\'NaN100\\')\"', '\"Invalid numeric literal at EOF at line 1, column 7 (while parsing \\'NaN1000\\')\"', '\"Invalid numeric literal at EOF at line 1, column 8 (while parsing \\'NaN10000\\')\"', '\"Invalid numeric literal at EOF at line 1, column 9 (while parsing \\'NaN100000\\')\"'], 'actual': ['true', '\"invalid JSON\"', '\"invalid JSON\"', '\"invalid JSON\"', '\"invalid JSON\"', '\"invalid JSON\"', '\"invalid JSON\"', '\"invalid JSON\"']}\n{'line': 2337, 'program': 'try input catch .', 'status': 'fail', 'detail': 'output mismatch', 'expect_failure': False, 'expected': ['\"break\"'], 'actual': ['\"unknown function input\"']}\n{'line': 2390, 'program': '.[] |= try tonumber', 'status': 'fail', 'detail': 'output mismatch', 'expect_failure': False, 'expected': ['[1, 3, 6.7, 0.89, -876, 5.43, 21]'], 'actual': ['[1,3,4,5,6.7,-876,21]']}\n{'line': 2407, 'program': 'map(try implode catch .)', 'status': 'fail', 'detail': 'output mismatch', 'expect_failure': False, 'expected': ['[\"implode input must be an array\",\"string (\\\\\"a\\\\\") can\\'t be imploded, unicode codepoint needs to be numeric\",\"number (null) can\\'t be imploded, unicode codepoint needs to be numeric\"]'], 'actual': []}\n{'line': 2411, 'program': 'try 0[implode] catch .', 'status': 'fail', 'detail': 'output mismatch', 'expect_failure': False, 'expected': ['\"Cannot index number with string (\\\\\"\\\\\")\"'], 'actual': ['\"implode input must be an array\"']}\n{'line': 2416, 'program': 'walk(.)', 'status': 'fail', 'detail': 'output mismatch', 'expect_failure': False, 'expected': ['{\"x\":0}'], 'actual': []}\n{'line': 2425, 'program': '[walk(.,1)]', 'status': 'fail', 'detail': 'output mismatch', 'expect_failure': False, 'expected': ['[{\"x\":0},1]'], 'actual': []}\n{'line': 2430, 'program': 'walk(select(IN({}, []) | not))', 'status': 'fail', 'detail': 'output mismatch', 'expect_failure': False, 'expected': ['{\"a\":1}'], 'actual': []}\n{'line': 2435, 'program': '[range(10)] | .[1.2:3.5]', 'status': 'fail', 'detail': 'output mismatch', 'expect_failure': False, 'expected': ['[1,2,3]'], 'actual': ['[1,2]']}\n{'line': 2439, 'program': '[range(10)] | .[1.5:3.5]', 'status': 'fail', 'detail': 'output mismatch', 'expect_failure': False, 'expected': ['[1,2,3]'], 'actual': ['[1,2]']}\n{'line': 2443, 'program': '[range(10)] | .[1.7:3.5]', 'status': 'fail', 'detail': 'output mismatch', 'expect_failure': False, 'expected': ['[1,2,3]'], 'actual': ['[1,2]']}\n{'line': 2455, 'program': '[[range(10)] | .[1.1,1.5,1.7]]', 'status': 'fail', 'detail': 'output mismatch', 'expect_failure': False, 'expected': ['[1,1,1]'], 'actual': []}\n{'line': 2463, 'program': '[range(3)] | .[nan:1]', 'status': 'fail', 'detail': 'output mismatch', 'expect_failure': False, 'expected': ['[0]'], 'actual': []}\n{'line': 2467, 'program': '[range(3)] | .[1:nan]', 'status': 'fail', 'detail': 'output mismatch', 'expect_failure': False, 'expected': ['[1,2]'], 'actual': []}\n{'line': 2471, 'program': '[range(3)] | .[nan]', 'status': 'fail', 'detail': 'output mismatch', 'expect_failure': False, 'expected': ['null'], 'actual': []}\n{'line': 2475, 'program': 'try ([range(3)] | .[nan] = 9) catch .', 'status': 'fail', 'detail': 'output mismatch', 'expect_failure': False, 'expected': ['\"Cannot set array element at NaN index\"'], 'actual': []}\n{'line': 2479, 'program': 'try (\"foobar\" | .[1.5:3.5] = \"xyz\") catch .', 'status': 'fail', 'detail': 'output mismatch', 'expect_failure': False, 'expected': ['\"Cannot update string slices\"'], 'actual': []}\n{'line': 2483, 'program': 'try ([range(10)] | .[1.5:3.5] = [\"xyz\"]) catch .', 'status': 'fail', 'detail': 'output mismatch', 'expect_failure': False, 'expected': ['[0,\"xyz\",4,5,6,7,8,9]'], 'actual': []}\n{'line': 2487, 'program': 'try (\"foobar\" | .[1.5]) catch .', 'status': 'fail', 'detail': 'output mismatch', 'expect_failure': False, 'expected': ['\"Cannot index string with number (1.5)\"'], 'actual': ['\"cannot index string with number\"']}\n{'line': 2494, 'program': 'try [\"ok\", setpath([1]; 1)] catch [\"ko\", .]', 'status': 'fail', 'detail': 'output mismatch', 'expect_failure': False, 'expected': ['[\"ko\",\"Cannot index object with number (1)\"]'], 'actual': ['[\"ok\",{\"hi\":\"hello\",\"1\":1}]']}\n{'line': 2498, 'program': 'try fromjson catch .', 'status': 'fail', 'detail': 'output mismatch', 'expect_failure': False, 'expected': ['\"Invalid string literal; expected \\\\\", but got \\' at line 1, column 5 (while parsing \\'{\\'a\\': 123}\\')\"'], 'actual': ['\"invalid JSON\"']}\n{'line': 2533, 'program': 'try [\"OK\", setpath([[1]]; 1)] catch [\"KO\", .]', 'status': 'fail', 'detail': 'output mismatch', 'expect_failure': False, 'expected': ['[\"KO\",\"Cannot update field at array index of array\"]'], 'actual': []}\n{'line': 2548, 'program': 'strflocaltime(\"\" | ., @uri)', 'status': 'fail', 'detail': 'output mismatch', 'expect_failure': False, 'expected': ['\"\"', '\"\"'], 'actual': []}\n{'line': 2593, 'program': 'try delpaths([[range(10001) | 0]]) catch .', 'status': 'fail', 'detail': 'output mismatch', 'expect_failure': False, 'expected': ['\"Path too deep\"'], 'actual': ['null']}\n{'line': 2602, 'program': 'try (reduce range(10001) as $_ ([]; [.]) as $x | $x | contains($x)) catch .', 'status': 'fail', 'detail': 'exited 1: Traceback (most recent call last):', 'expect_failure': False, 'expected': ['\"Containment check too deep\"'], 'actual': []}\n{'line': 2607, 'program': 'reduce range(10000) as $_ ({}; {a: .}) as $x | $x * $x | length', 'status': 'fail', 'detail': 'output mismatch', 'expect_failure': False, 'expected': ['1'], 'actual': []}\n004 {'pass': 143, 'fail': 67, 'error': 1, 'skip': 13}\n{'line': 229, 'program': 'try (.[999999999] = 0) catch .', 'status': 'error', 'detail': 'timed out after 10s', 'expect_failure': False, 'expected': ['\"Array index too large\"'], 'actual': []}\n{'line': 353, 'program': '[foreach .[] / .[] as $i (0; . + $i)]', 'status': 'fail', 'detail': 'output mismatch', 'expect_failure': False, 'expected': ['[1,3,3.5,4.5]'], 'actual': ['[1.0,1.5,3.5,4.5]']}\n{'line': 405, 'program': '[nth(0,5,9,10,15; range(.)), try nth(-1; range(.)) catch .]', 'status': 'fail', 'detail': 'output mismatch', 'expect_failure': False, 'expected': ['[0,5,9,\"nth doesn\\'t support negative indices\"]'], 'actual': []}\n{'line': 566, 'program': '. as {(true):$foo} | $foo', 'status': 'fail', 'detail': 'program was accepted, but the corpus marks it %%FAIL', 'expect_failure': True, 'expected': [], 'actual': []}\n{'line': 709, 'program': '.[] | try toboolean catch .', 'status': 'fail', 'detail': 'output mismatch', 'expect_failure': False, 'expected': ['\"null (null) cannot be parsed as a boolean\"', '\"number (0) cannot be parsed as a boolean\"', '\"string (\\\\\"tru\\\\\") cannot be parsed as a boolean\"', '\"string (\\\\\"truee\\\\\") cannot be parsed as a boolean\"', '\"string (\\\\\"fals\\\\\") cannot be parsed as a boolean\"', '\"string (\\\\\"falsee\\\\\") cannot be parsed as a boolean\"', '\"array ([]) cannot be parsed as a boolean\"', '\"object ({}) cannot be parsed as a boolean\"'], 'actual': ['\"null (null) cannot be parsed as a boolean\"', '\"number (0) cannot be parsed as a boolean\"', '\"string (tru) cannot be parsed as a boolean\"', '\"string (truee) cannot be parsed as a boolean\"', '\"string (fals) cannot be parsed as a boolean\"', '\"string (falsee) cannot be parsed as a boolean\"', '\"array ([]) cannot be parsed as a boolean\"', '\"object ({}) cannot be parsed as a boolean\"']}\n{'line': 720, 'program': '\"true\\\\u0000x\", \"false\\\\u0000\" | try toboolean catch .', 'status': 'fail', 'detail': 'output mismatch', 'expect_failure': False, 'expected': ['\"string (\\\\\"true\\\\\\\\u0000x\\\\\") cannot be parsed as a boolean\"', '\"string (\\\\\"false\\\\\\\\u0000\\\\\") cannot be parsed as a boolean\"'], 'actual': ['\"string (true\\\\u0000x) cannot be parsed as a boolean\"', '\"string (false\\\\u0000) cannot be parsed as a boolean\"']}\n{'line': 798, 'program': 'def f: 1; def g: f, def f: 2; def g: 3; f, def f: g; f, g; def f: 4; [f, def f: g; def g: 5; f, g]+[f,g]', 'status': 'fail', 'detail': 'output mismatch', 'expect_failure': False, 'expected': ['[4,1,2,3,3,5,4,1,2,3,3]'], 'actual': ['[4,5,5,4,4,2,3,3]']}\n{'line': 868, 'program': 'def f: .+1; def g: f; def f: .+100; def f(a):a+.+11; [(g|f(20)), f]', 'status': 'fail', 'detail': 'output mismatch', 'expect_failure': False, 'expected': ['[33,101]'], 'actual': ['[132,101]']}\n{'line': 873, 'program': 'def id(x):x; 2000 as $x | def f(x):1 as $x | id([$x, x, x]); def g(x): 100 as $x | f($x,$x+x); g($x)', 'status': 'fail', 'detail': 'output mismatch', 'expect_failure': False, 'expected': ['[1,100,2100.0,100,2100.0]'], 'actual': ['[1,1,1]']}\n{'line': 884, 'program': '[[20,10][1,0] as $x | def f: (100,200) as $y | def g: [$x + $y, .]; . + $x | g; f[0] | [f][0][1] | f]', 'status': 'fail', 'detail': 'output mismatch', 'expect_failure': False, 'expected': ['[[110.0, 130.0], [210.0, 130.0], [110.0, 230.0], [210.0, 230.0], [120.0, 160.0], [220.0, 160.0], [120.0, 260.0], [220.0, 260.0]]'], 'actual': ['[[110,130],[210,130],[110,230],[210,230]]']}\n{'line': 938, 'program': '.[] | . as {$a, b: [$c, {$d}]} ?// [$a, {$b}, $e] ?// $f | [$a, $b, $c, $d, $e, $f]', 'status': 'fail', 'detail': 'output mismatch', 'expect_failure': False, 'expected': ['[1, null, 2, 3, null, null]', '[4, 5, null, null, 7, null]', '[null, null, null, null, null, \"foo\"]'], 'actual': []}\n{'line': 1123, 'program': 'try path(.a | map(select(.b == 0))) catch .', 'status': 'fail', 'detail': 'output mismatch', 'expect_failure': False, 'expected': ['\"Invalid path expression with result [{\\\\\"b\\\\\":0}]\"'], 'actual': ['\"unknown function path\"']}\n{'line': 1127, 'program': 'try path(.a | map(select(.b == 0)) | .[0]) catch .', 'status': 'fail', 'detail': 'output mismatch', 'expect_failure': False, 'expected': ['\"Invalid path expression near attempt to access element 0 of [{\\\\\"b\\\\\":0}]\"'], 'actual': ['\"unknown function path\"']}\n{'line': 1131, 'program': 'try path(.a | map(select(.b == 0)) | .c) catch .', 'status': 'fail', 'detail': 'output mismatch', 'expect_failure': False, 'expected': ['\"Invalid path expression near attempt to access element \\\\\"c\\\\\" of [{\\\\\"b\\\\\":0}]\"'], 'actual': ['\"unknown function path\"']}\n{'line': 1135, 'program': 'try path(.a | map(select(.b == 0)) | .[]) catch .', 'status': 'fail', 'detail': 'output mismatch', 'expect_failure': False, 'expected': ['\"Invalid path expression near attempt to iterate through [{\\\\\"b\\\\\":0}]\"'], 'actual': ['\"unknown function path\"']}\n{'line': 1214, 'program': 'try pick(last) catch .', 'status': 'fail', 'detail': 'output mismatch', 'expect_failure': False, 'expected': ['\"Out of bounds negative array index\"'], 'actual': ['\"unknown function pick\"']}\n{'line': 1253, 'program': 'def inc(x): x |= .+1; inc(.[].a)', 'status': 'fail', 'detail': 'output mismatch', 'expect_failure': False, 'expected': ['[{\"a\":2,\"b\":2},{\"a\":3,\"b\":4},{\"a\":8,\"b\":8}]'], 'actual': []}\n{'line': 1258, 'program': '.[] | try (getpath([\"a\",0,\"b\"]) |= 5) catch .', 'status': 'fail', 'detail': 'output mismatch', 'expect_failure': False, 'expected': ['{\"a\":[{\"b\":5}]}', '{\"b\":0,\"a\":[{\"b\":5}]}', '\"Cannot index number with number (0)\"', '{\"a\":[{\"b\":5}]}', '\"Cannot index number with string (\\\\\"b\\\\\")\"', '\"Cannot index object with number (0)\"', '{\"a\":[{\"b\":5}]}', '{\"a\":[{\"c\":3,\"b\":5}]}'], 'actual': []}\n{'line': 1290, 'program': 'try ((map(select(.a == 1))[].b) = 10) catch .', 'status': 'fail', 'detail': 'output mismatch', 'expect_failure': False, 'expected': ['\"Invalid path expression near attempt to iterate through [{\\\\\"a\\\\\":1}]\"'], 'actual': []}\n{'line': 1294, 'program': 'try ((map(select(.a == 1))[].a) |= .+1) catch .', 'status': 'fail', 'detail': 'output mismatch', 'expect_failure': False, 'expected': ['\"Invalid path expression near attempt to iterate through [{\\\\\"a\\\\\":1}]\"'], 'actual': []}\n{'line': 1298, 'program': 'def x: .[1,2]; x=10', 'status': 'fail', 'detail': 'output mismatch', 'expect_failure': False, 'expected': ['[0,10,10]'], 'actual': []}\n{'line': 1302, 'program': 'try (def x: reverse; x=10) catch .', 'status': 'fail', 'detail': 'output mismatch', 'expect_failure': False, 'expected': ['\"Invalid path expression with result [2,1,0]\"'], 'actual': []}\n{'line': 1448, 'program': '[.[]|try if . == 0 then error(\"foo\") elif . == 1 then .a elif . == 2 then empty else . end catch .]', 'status': 'fail', 'detail': 'output mismatch', 'expect_failure': False, 'expected': ['[\"foo\",\"Cannot index number with string (\\\\\"a\\\\\")\",3]'], 'actual': ['[\"foo\",\"cannot index value\",3]']}\n{'line': 1464, 'program': 'try error(0) // 1', 'status': 'fail', 'detail': 'output mismatch', 'expect_failure': False, 'expected': ['1'], 'actual': []}\n{'line': 1473, 'program': '1 + try 2 catch 3 + 4', 'status': 'fail', 'detail': 'output mismatch', 'expect_failure': False, 'expected': ['7'], 'actual': ['3']}\n{'line': 1481, 'program': 'try -.? catch .', 'status': 'fail', 'detail': 'output mismatch', 'expect_failure': False, 'expected': ['\"string (\\\\\"foo\\\\\") cannot be negated\"'], 'actual': []}\n{'line': 1499, 'program': 'try error(\"\\\\($__loc__)\") catch .', 'status': 'fail', 'detail': 'output mismatch', 'expect_failure': False, 'expected': ['\"{\\\\\"file\\\\\":\\\\\"<top-level>\\\\\",\\\\\"line\\\\\":1}\"'], 'actual': ['\"variable $__loc__ is not defined\"']}\n{'line': 1553, 'program': 'try _strindices(\"abc\") catch .', 'status': 'fail', 'detail': 'output mismatch', 'expect_failure': False, 'expected': ['\"number (123) cannot be searched, as it is not a string\"'], 'actual': ['\"unknown function _strindices\"']}\n{'line': 1557, 'program': 'try _strindices(123) catch .', 'status': 'fail', 'detail': 'output mismatch', 'expect_failure': False, 'expected': ['\"number (123) is not a string\"'], 'actual': ['\"unknown function _strindices\"']}\n{'line': 1575, 'program': 'try trim catch ., try ltrim catch ., try rtrim catch .', 'status': 'fail', 'detail': 'output mismatch', 'expect_failure': False, 'expected': ['\"trim input must be a string\"', '\"trim input must be a string\"', '\"trim input must be a string\"'], 'actual': ['\"trim input must be a string\"', '\"ltrim input must be a string\"', '\"rtrim input must be a string\"']}\n{'line': 1839, 'program': 'try [\"OK\", bsearch(0)] catch [\"KO\",.]', 'status': 'fail', 'detail': 'output mismatch', 'expect_failure': False, 'expected': ['[\"KO\",\"string (\\\\\"aa\\\\\") cannot be searched from\"]'], 'actual': ['[\"KO\",\"unknown function bsearch\"]']}\n{'line': 1868, 'program': 'try strftime(\"%Y-%m-%dT%H:%M:%SZ\") catch .', 'status': 'fail', 'detail': 'output mismatch', 'expect_failure': False, 'expected': ['\"strftime/1 requires parsed datetime inputs\"'], 'actual': ['\"unknown function strftime\"']}\n{'line': 1872, 'program': 'try strflocaltime(\"%Y-%m-%dT%H:%M:%SZ\") catch .', 'status': 'fail', 'detail': 'output mismatch', 'expect_failure': False, 'expected': ['\"strflocaltime/1 requires parsed datetime inputs\"'], 'actual': ['\"unknown function strflocaltime\"']}\n{'line': 1876, 'program': 'try mktime catch .', 'status': 'fail', 'detail': 'output mismatch', 'expect_failure': False, 'expected': ['\"mktime requires parsed datetime inputs\"'], 'actual': ['\"unknown function mktime\"']}\n{'line': 1881, 'program': 'try [\"OK\", strftime([])] catch [\"KO\", .]', 'status': 'fail', 'detail': 'output mismatch', 'expect_failure': False, 'expected': ['[\"KO\",\"strftime/1 requires a string format\"]'], 'actual': ['[\"KO\",\"unknown function strftime\"]']}\n{'line': 1885, 'program': 'try [\"OK\", strflocaltime({})] catch [\"KO\", .]', 'status': 'fail', 'detail': 'output mismatch', 'expect_failure': False, 'expected': ['[\"KO\",\"strflocaltime/1 requires a string format\"]'], 'actual': ['[\"KO\",\"unknown function strflocaltime\"]']}\n{'line': 1997, 'program': 'try -. catch .', 'status': 'fail', 'detail': 'output mismatch', 'expect_failure': False, 'expected': ['\"string (\\\\\"very-long-long-long-long...\\\\\") cannot be negated\"'], 'actual': []}\n{'line': 2001, 'program': 'try (.-.) catch .', 'status': 'fail', 'detail': 'output mismatch', 'expect_failure': False, 'expected': ['\"string (\\\\\"very-long-long-long-long...\\\\\") and string (\\\\\"very-long-long-long-long...\\\\\") cannot be subtracted\"'], 'actual': []}\n{'line': 2005, 'program': '\"x\" * range(0; 12; 2) + \"☆\" * 8 | try -. catch .', 'status': 'fail', 'detail': 'output mismatch', 'expect_failure': False, 'expected': ['\"string (\\\\\"☆☆☆☆☆☆☆☆\\\\\") cannot be negated\"', '\"string (\\\\\"xx☆☆☆☆☆☆☆☆\\\\\") cannot be negated\"', '\"string (\\\\\"xxxx☆☆☆☆☆☆...\\\\\") cannot be negated\"', '\"string (\\\\\"xxxxxx☆☆☆☆☆☆...\\\\\") cannot be negated\"', '\"string (\\\\\"xxxxxxxx☆☆☆☆☆...\\\\\") cannot be negated\"', '\"string (\\\\\"xxxxxxxxxx☆☆☆☆...\\\\\") cannot be negated\"'], 'actual': []}\n{'line': 2014, 'program': 'try (. + \"x\") catch . == if have_decnum then \"number (12345678901234567890123456...) and string (\\\\\"x\\\\\") cannot be added\" else \"number (12345678901234568000000000...) and string (\\\\\"x\\\\\") cannot be added\" end', 'status': 'fail', 'detail': 'output mismatch', 'expect_failure': False, 'expected': ['true'], 'actual': []}\n{'line': 2034, 'program': 'try join(\",\") catch .', 'status': 'fail', 'detail': 'output mismatch', 'expect_failure': False, 'expected': ['\"string (\\\\\"1,2,\\\\\") and object ({\\\\\"a\\\\\":{\\\\\"b\\\\\":{\\\\\"c\\\\\":33}}}) cannot be added\"'], 'actual': ['\"1,2,{\\\\\"a\\\\\":{\\\\\"b\\\\\":{\\\\\"c\\\\\":33}}}\"']}\n{'line': 2038, 'program': 'try join(\",\") catch .', 'status': 'fail', 'detail': 'output mismatch', 'expect_failure': False, 'expected': ['\"string (\\\\\"1,2,\\\\\") and array ([3,4,5]) cannot be added\"'], 'actual': ['\"1,2,[3,4,5]\"']}\n{'line': 2130, 'program': '(.a as $x | .b) = \"b\"', 'status': 'fail', 'detail': 'output mismatch', 'expect_failure': False, 'expected': ['{\"a\":null,\"b\":\"b\"}'], 'actual': []}\n{'line': 2196, 'program': '.[0] | tostring | . == if have_decnum then \"13911860366432393\" else \"13911860366432392\" end', 'status': 'fail', 'detail': 'output mismatch', 'expect_failure': False, 'expected': ['true'], 'actual': ['false']}\n{'line': 2200, 'program': '.x | tojson | . == if have_decnum then \"13911860366432393\" else \"13911860366432392\" end', 'status': 'fail', 'detail': 'output mismatch', 'expect_failure': False, 'expected': ['true'], 'actual': ['false']}\n{'line': 2204, 'program': '(13911860366432393 == 13911860366432392) | . == if have_decnum then false else true end', 'status': 'fail', 'detail': 'output mismatch', 'expect_failure': False, 'expected': ['true'], 'actual': ['false']}\n{'line': 2224, 'program': '-. | tojson == if have_decnum then \"-13911860366432393\" else \"-13911860366432392\" end', 'status': 'fail', 'detail': 'output mismatch', 'expect_failure': False, 'expected': ['true'], 'actual': ['false']}\n{'line': 2232, 'program': '[1E+1000,-1E+1000 | tojson] == if have_decnum then [\"1E+1000\",\"-1E+1000\"] else [\"1.7976931348623157e+308\",\"-1.7976931348623157e+308\"] end', 'status': 'fail', 'detail': 'output mismatch', 'expect_failure': False, 'expected': ['true'], 'actual': ['false']}\n{'line': 2241, 'program': '.[] as $n | $n+0 | [., tostring, . == $n]', 'status': 'fail', 'detail': 'output mismatch', 'expect_failure': False, 'expected': ['[-9007199254740992,\"-9007199254740992\",true]', '[-9007199254740992,\"-9007199254740992\",true]', '[9007199254740992,\"9007199254740992\",true]', '[9007199254740992,\"9007199254740992\",true]', '[13911860366432392,\"13911860366432392\",true]'], 'actual': ['[-9007199254740993,\"-9007199254740993\",true]', '[-9007199254740992,\"-9007199254740992\",true]', '[9007199254740992,\"9007199254740992\",true]', '[9007199254740993,\"9007199254740993\",true]', '[13911860366432393,\"13911860366432393\",true]']}\n{'line': 2271, 'program': '[1E+1000,-1E+1000 | abs | tojson] | unique == if have_decnum then [\"1E+1000\"] else [\"1.7976931348623157e+308\"] end', 'status': 'fail', 'detail': 'output mismatch', 'expect_failure': False, 'expected': ['true'], 'actual': ['false']}\n{'line': 2275, 'program': '[1E+1000,-1E+1000 | length | tojson] | unique == if have_decnum then [\"1E+1000\"] else [\"1.7976931348623157e+308\"] end', 'status': 'fail', 'detail': 'output mismatch', 'expect_failure': False, 'expected': ['true'], 'actual': []}\n{'line': 2324, 'program': '.[] | try (fromjson | isnan) catch .', 'status': 'fail', 'detail': 'output mismatch', 'expect_failure': False, 'expected': ['true', 'true', '\"Invalid numeric literal at EOF at line 1, column 4 (while parsing \\'NaN1\\')\"', '\"Invalid numeric literal at EOF at line 1, column 5 (while parsing \\'NaN10\\')\"', '\"Invalid numeric literal at EOF at line 1, column 6 (while parsing \\'NaN100\\')\"', '\"Invalid numeric literal at EOF at line 1, column 7 (while parsing \\'NaN1000\\')\"', '\"Invalid numeric literal at EOF at line 1, column 8 (while parsing \\'NaN10000\\')\"', '\"Invalid numeric literal at EOF at line 1, column 9 (while parsing \\'NaN100000\\')\"'], 'actual': ['true', '\"invalid JSON\"', '\"invalid JSON\"', '\"invalid JSON\"', '\"invalid JSON\"', '\"invalid JSON\"', '\"invalid JSON\"', '\"invalid JSON\"']}\n{'line': 2337, 'program': 'try input catch .', 'status': 'fail', 'detail': 'output mismatch', 'expect_failure': False, 'expected': ['\"break\"'], 'actual': ['\"unknown function input\"']}\n{'line': 2390, 'program': '.[] |= try tonumber', 'status': 'fail', 'detail': 'output mismatch', 'expect_failure': False, 'expected': ['[1, 3, 6.7, 0.89, -876, 5.43, 21]'], 'actual': ['[1,3,4,5,6.7,-876,21]']}\n{'line': 2407, 'program': 'map(try implode catch .)', 'status': 'fail', 'detail': 'output mismatch', 'expect_failure': False, 'expected': ['[\"implode input must be an array\",\"string (\\\\\"a\\\\\") can\\'t be imploded, unicode codepoint needs to be numeric\",\"number (null) can\\'t be imploded, unicode codepoint needs to be numeric\"]'], 'actual': []}\n{'line': 2411, 'program': 'try 0[implode] catch .', 'status': 'fail', 'detail': 'output mismatch', 'expect_failure': False, 'expected': ['\"Cannot index number with string (\\\\\"\\\\\")\"'], 'actual': ['\"implode input must be an array\"']}\n{'line': 2475, 'program': 'try ([range(3)] | .[nan] = 9) catch .', 'status': 'fail', 'detail': 'output mismatch', 'expect_failure': False, 'expected': ['\"Cannot set array element at NaN index\"'], 'actual': []}\n{'line': 2479, 'program': 'try (\"foobar\" | .[1.5:3.5] = \"xyz\") catch .', 'status': 'fail', 'detail': 'output mismatch', 'expect_failure': False, 'expected': ['\"Cannot update string slices\"'], 'actual': []}\n{'line': 2483, 'program': 'try ([range(10)] | .[1.5:3.5] = [\"xyz\"]) catch .', 'status': 'fail', 'detail': 'output mismatch', 'expect_failure': False, 'expected': ['[0,\"xyz\",4,5,6,7,8,9]'], 'actual': []}\n{'line': 2487, 'program': 'try (\"foobar\" | .[1.5]) catch .', 'status': 'fail', 'detail': 'output mismatch', 'expect_failure': False, 'expected': ['\"Cannot index string with number (1.5)\"'], 'actual': ['\"cannot index string with number\"']}\n{'line': 2494, 'program': 'try [\"ok\", setpath([1]; 1)] catch [\"ko\", .]', 'status': 'fail', 'detail': 'output mismatch', 'expect_failure': False, 'expected': ['[\"ko\",\"Cannot index object with number (1)\"]'], 'actual': ['[\"ok\",{\"hi\":\"hello\",\"1\":1}]']}\n{'line': 2498, 'program': 'try fromjson catch .', 'status': 'fail', 'detail': 'output mismatch', 'expect_failure': False, 'expected': ['\"Invalid string literal; expected \\\\\", but got \\' at line 1, column 5 (while parsing \\'{\\'a\\': 123}\\')\"'], 'actual': ['\"invalid JSON\"']}\n{'line': 2504, 'program': 'try ltrimstr(1) catch \"x\", try rtrimstr(1) catch \"x\" | \"ok\"', 'status': 'fail', 'detail': 'output mismatch', 'expect_failure': False, 'expected': ['\"ok\"', '\"ok\"'], 'actual': ['\"x\"', '\"ok\"']}\n{'line': 2509, 'program': 'try ltrimstr(\"x\") catch \"x\", try rtrimstr(\"x\") catch \"x\" | \"ok\"', 'status': 'fail', 'detail': 'output mismatch', 'expect_failure': False, 'expected': ['\"ok\"', '\"ok\"'], 'actual': ['\"x\"', '\"ok\"']}\n{'line': 2533, 'program': 'try [\"OK\", setpath([[1]]; 1)] catch [\"KO\", .]', 'status': 'fail', 'detail': 'output mismatch', 'expect_failure': False, 'expected': ['[\"KO\",\"Cannot update field at array index of array\"]'], 'actual': []}\n{'line': 2593, 'program': 'try delpaths([[range(10001) | 0]]) catch .', 'status': 'fail', 'detail': 'output mismatch', 'expect_failure': False, 'expected': ['\"Path too deep\"'], 'actual': ['null']}\n{'line': 2602, 'program': 'try (reduce range(10001) as $_ ([]; [.]) as $x | $x | contains($x)) catch .', 'status': 'fail', 'detail': 'exited 1: Traceback (most recent call last):', 'expect_failure': False, 'expected': ['\"Containment check too deep\"'], 'actual': []}\n{'line': 2607, 'program': 'reduce range(10000) as $_ ({}; {a: .}) as $x | $x * $x | length', 'status': 'fail', 'detail': 'output mismatch', 'expect_failure': False, 'expected': ['1'], 'actual': []}\n","exit_code":0,"status":"completed"}}
{"type":"item.completed","item":{"id":"item_5","type":"command_execution","command":"/bin/bash -lc \"timeout 120 python3 - <<'PY'\nimport json,os,subprocess,sys\nfor name,sel in [('003',r'\\\\.|\\\\[|\\\\{|\\\\+|\\\\-|\\\\*|/|%'),('004',r'%%FAIL|if |try |reduce |foreach |def | as |label |module|include')]:\n r=subprocess.run([sys.executable,'sources/run_conformance.py','--select',sel,'--json'],capture_output=True,text=True,env={**os.environ,'JQ':os.getcwd()+'/jq'})\n print(name,'rc',r.returncode, r.stdout[:100]); open('/tmp/new'+name,'w').write(r.stdout)\nPY\"","aggregated_output":"003 rc 1 {\n \"candidate\": [\n \"/mnt/c/Users/barlo/projects/drydock/uat/jq/runs/20260822.044627/build/jq/jq\"\n004 rc 1 {\n \"candidate\": [\n \"/mnt/c/Users/barlo/projects/drydock/uat/jq/runs/20260822.044627/build/jq/jq\"\n","exit_code":0,"status":"completed"}}
{"type":"item.started","item":{"id":"item_6","type":"command_execution","command":"/bin/bash -lc \"python3 - <<'PY'\nimport json\nfor n in ('003','004'):\n d=json.load(open('/tmp/new'+n)); print('\\\\n',n,d['summary'])\n for x in d['cases']:\n if x['status']\"'!='\"'pass': print(x['line'],repr(x['program']),x['status'],x.get('detail','')[:180])\nPY\"","aggregated_output":"","exit_code":null,"status":"in_progress"}}
{"type":"item.completed","item":{"id":"item_6","type":"command_execution","command":"/bin/bash -lc \"python3 - <<'PY'\nimport json\nfor n in ('003','004'):\n d=json.load(open('/tmp/new'+n)); print('\\\\n',n,d['summary'])\n for x in d['cases']:\n if x['status']\"'!='\"'pass': print(x['line'],repr(x['program']),x['status'],x.get('detail','')[:180])\nPY\"","aggregated_output":"\n 003 {'pass': 306, 'fail': 148, 'error': 1, 'skip': 9}\n122 '{\"a\",b,\"a$\\\\(1+1)\"}' fail output mismatch\n187 '[..]' fail output mismatch\n195 '[.[]|.[1:3]?]' fail exited 1: Traceback (most recent call last):\n229 'try (.[999999999] = 0) catch .' error timed out after 10s\n283 '[.[-4,-3,-2,-1,0,1,2,3]]' fail output mismatch\n291 '[range(0,1;3,4)]' fail output mismatch\n307 '[range(0,1;4,5;1,2)]' fail output mismatch\n311 '[while(.<100; .*2)]' fail output mismatch\n329 '[.[]|[.,1]|until(.[0] < 1; [.[0] - 1, .[1] * .[0]])|.[1]]' fail output mismatch\n353 '[foreach .[] / .[] as $i (0; . + $i)]' fail output mismatch\n365 '[limit(0; error)]' fail output mismatch\n369 '[limit(1; 1, error)]' fail output mismatch\n381 '[skip(0,2,3,4; .[])]' fail output mismatch\n405 '[nth(0,5,9,10,15; range(.)), try nth(-1; range(.)) catch .]' fail output mismatch\n420 '[limit(5,7; range(9))]' fail output mismatch\n425 '[nth(5,7; range(9;0;-1))]' fail output mismatch\n430 '[range(0,1,2;4,3,2;2,3)]' fail output mismatch\n435 '[range(3,5)]' fail output mismatch\n440 '[(index(\",\",\"|\"), rindex(\",\",\"|\")), indices(\",\",\"|\")]' fail output mismatch\n474 'del(.[2:4],.[0],.[-2:])' fail output mismatch\n478 '.[2:4] = ([], [\"a\",\"b\"], [\"a\",\"b\",\"c\"])' fail output mismatch\n566 '. as {(true):$foo} | $foo' fail program was accepted, but the corpus marks it %%FAIL\n617 '{\"a\":1} + {\"b\":2} + {\"c\":3}' fail output mismatch\n633 '[1,2,3,4,1] - [.,3]' fail output mismatch\n661 '9E999999999, 9999999999E999999990, 1E-999999999, 0.000000001E-999999990' fail output mismatch\n689 '[(infinite, -infinite) % (1, -1, infinite)]' fail output mismatch\n693 '[nan % 1, 1 % nan | isnan]' fail output mismatch\n709 '.[] | try toboolean catch .' fail output mismatch\n720 '\"true\\\\u0000x\", \"false\\\\u0000\" | try toboolean catch .' fail output mismatch\n766 '[add(null), add(range(range(10))), add(empty), add(10,range(10))]' fail output mismatch\n798 'def f: 1; def g: f, def f: 2; def g: 3; f, def f: g; f, g; def f: 4; [f, def f: g; def g: 5; f, g]+[f,g]' fail output mismatch\n868 'def f: .+1; def g: f; def f: .+100; def f(a):a+.+11; [(g|f(20)), f]' fail output mismatch\n873 'def id(x):x; 2000 as $x | def f(x):1 as $x | id([$x, x, x]); def g(x): 100 as $x | f($x,$x+x); g($x)' fail output mismatch\n884 '[[20,10][1,0] as $x | def f: (100,200) as $y | def g: [$x + $y, .]; . + $x | g; f[0] | [f][0][1] | f]' fail output mismatch\n938 '.[] | . as {$a, b: [$c, {$d}]} ?// [$a, {$b}, $e] ?// $f | [$a, $b, $c, $d, $e, $f]' fail output mismatch\n1062 'any(true, error; .)' fail output mismatch\n1066 'all(false, error; .)' fail output mismatch\n1110 'path(.foo[0,1])' fail output mismatch\n1115 'path(.[] | select(.>3))' fail output mismatch\n1119 'path(.)' fail output mismatch\n1123 'try path(.a | map(select(.b == 0))) catch .' fail output mismatch\n1127 'try path(.a | map(select(.b == 0)) | .[0]) catch .' fail output mismatch\n1131 'try path(.a | map(select(.b == 0)) | .c) catch .' fail output mismatch\n1135 'try path(.a | map(select(.b == 0)) | .[]) catch .' fail output mismatch\n1139 'path(.a[path(.b)[0]])' fail output mismatch\n1143 '[paths]' fail output mismatch\n1177 'del(.), del(empty), del((.foo,.bar,.baz) | .[2,3,0]), del(.foo[0], .bar[0], .foo, .baz.bar[0].x)' fail output mismatch\n1184 'del(.[1], .[-6], .[2], .[-3:9])' fail output mismatch\n1188 'del(.[nan])' fail output mismatch\n1192 'del(.[nan,nan])' fail output mismatch\n1201 'pick(.a.b.c)' fail output mismatch\n1214 'try pick(last) catch .' fail output mismatch\n1253 'def inc(x): x |= .+1; inc(.[].a)' fail output mismatch\n1258 '.[] | try (getpath([\"a\",0,\"b\"]) |= 5) catch .' fail output mismatch\n1270 '(.[] | select(. >= 2)) |= empty' fail output mismatch\n1278 '.foo[1,4,2,3] |= empty' fail output mismatch\n1290 'try ((map(select(.a == 1))[].b) = 10) catch .' fail output mismatch\n1294 'try ((map(select(.a == 1))[].a) |= .+1) catch .' fail output mismatch\n1298 'def x: .[1,2]; x=10' fail output mismatch\n1302 'try (def x: reverse; x=10) catch .' fail output mismatch\n1306 '.[] = 1' fail output mismatch\n1370 '[.[] | [.foo[] // .bar]]' fail output mismatch\n1374 '.[] //= .[0]' fail output mismatch\n1448 '[.[]|try if . == 0 then error(\"foo\") elif . == 1 then .a elif . == 2 then empty else . end catch .]' fail output mismatch\n1464 'try error(0) // 1' fail output mismatch\n1473 '1 + try 2 catch 3 + 4' fail output mismatch\n1481 'try -.? catch .' fail output mismatch\n1499 'try error(\"\\\\($__loc__)\") catch .' fail output mismatch\n1544 '[(index(\",\"), rindex(\",\")), indices(\",\")]' fail output mismatch\n1548 '[ index(\"aba\"), rindex(\"aba\"), indices(\"aba\") ]' fail output mismatch\n1553 'try _strindices(\"abc\") catch .' fail output mismatch\n1557 'try _strindices(123) catch .' fail output mismatch\n1575 'try trim catch ., try ltrim catch ., try rtrim catch .' fail output mismatch\n1585 'indices([1,2])' fail output mismatch\n1589 'indices([1,2])' fail output mismatch\n1625 '[.[] * \"abc\"]' fail output mismatch\n1629 '[. * (nan,-nan)]' fail output mismatch\n1677 '(sort_by(.b) | sort_by(.a)), sort_by(.a, .b), sort_by(.b, .c), group_by(.b), group_by(.a + .b - .c == 2)' fail output mismatch\n1693 '[min, max, min_by(.[1]), max_by(.[1]), min_by(.[2]), max_by(.[2])]' fail output mismatch\n1697 '[min,max,min_by(.),max_by(.)]' fail output mismatch\n1701 '.foo[.baz]' fail output mismatch\n1721 'with_entries(.key |= \"KEY_\" + .)' fail output mismatch\n1741 '[][.]' fail output mismatch\n1745 'map([1,2][0:.])' fail output mismatch\n1835 'bsearch({x:1})' fail output mismatch\n1839 'try [\"OK\", bsearch(0)] catch [\"KO\",.]' fail output mismatch\n1843 'strftime(\"%Y-%m-%dT%H:%M:%SZ\")' fail output mismatch\n1847 'strftime(\"%A, %B %d, %Y\")' fail output mismatch\n1851 'strftime(\"%Y-%m-%dT%H:%M:%SZ\")' fail output mismatch\n1863 'gmtime[5]' fail output mismatch\n1868 'try strftime(\"%Y-%m-%dT%H:%M:%SZ\") catch .' fail output mismatch\n1872 'try strflocaltime(\"%Y-%m-%dT%H:%M:%SZ\") catch .' fail output mismatch\n1876 'try mktime catch .' fail output mismatch\n1881 'try [\"OK\", strftime([])] catch [\"KO\", .]' fail output mismatch\n1885 'try [\"OK\", strflocaltime({})] catch [\"KO\", .]' fail output mismatch\n1889 '[strptime(\"%Y-%m-%dT%H:%M:%SZ\")|(.,mktime)]' fail output mismatch\n1895 'last(range(365 * 67)|(\"1970-03-01T01:02:03Z\"|strptime(\"%Y-%m-%dT%H:%M:%SZ\")|mktime) + (86400 * .)|strftime(\"%Y-%m-%dT%H:%M:%SZ\")|strptime(\"%Y-%m-%dT%H:%M:%SZ\"))' fail output mismatch\n1900 'import \"a\" as foo; import \"b\" as bar; def fooa: foo::a; [fooa, bar::a, bar::b, foo::a]' skip declared in exclusions.txt\n1904 'import \"c\" as foo; [foo::a, foo::c]' skip declared in exclusions.txt\n1908 'include \"c\"; [a, c]' skip declared in exclusions.txt\n1912 'import \"data\" as $e; import \"data\" as $d; [$d[].this,$e[].that,$d::d[].this,$e::e[].that]|join(\";\")' skip declared in exclusions.txt\n1917 'import \"data\" as $a; import \"data\" as $b; def f: {$a, $b}; f' skip declared in exclusions.txt\n1929 'import \"shadow1\" as f; import \"shadow2\" as f; import \"shadow1\" as e; [e::e, f::e]' skip declared in exclusions.txt\n1973 'modulemeta | .deps | length' skip declared in exclusions.txt\n1977 'modulemeta | .defs | length' skip declared in exclusions.txt\n1982 'import \"syntaxerror\" as e; .' skip declared in exclusions.txt\n1997 'try -. catch .' fail output mismatch\n2001 'try (.-.) catch .' fail output mismatch\n2005 '\"x\" * range(0; 12; 2) + \"☆\" * 8 | try -. catch .' fail output mismatch\n2014 'try (. + \"x\") catch . == if have_decnum then \"number (12345678901234567890123456...) and string (\\\\\"x\\\\\") cannot be added\" else \"number (12345678901234568000000000...) and string (\\\\\"x\\\\\") cannot be added\" end' fail output mismatch\n2034 'try join(\",\") catch .' fail output mismatch\n2038 'try join(\",\") catch .' fail output mismatch\n2086 '(.[{}] = 0)?' fail output mismatch\n2089 'INDEX(range(5)|[., \"foo\\\\(.)\"]; .[0])' fail output mismatch\n2093 'JOIN({\"0\":[0,\"abc\"],\"1\":[1,\"bcd\"],\"2\":[2,\"def\"],\"3\":[3,\"efg\"],\"4\":[4,\"fgh\"]}; .[0]|tostring)' fail output mismatch\n2130 '(.a as $x | .b) = \"b\"' fail output mismatch\n2135 '(.. | select(type == \"object\" and has(\"b\") and (.b | type) == \"array\")|.b) |= .[0]' fail output mismatch\n2161 '\"-1\"|IN(builtins[] / \"/\"|.[1])' fail output mismatch\n2165 'all(builtins[] / \"/\"; .[1]|tonumber >= 0)' fail output mismatch\n2169 'builtins|any(.[:1] == \"_\")' fail output mismatch\n2196 '.[0] | tostring | . == if have_decnum then \"13911860366432393\" else \"13911860366432392\" end' fail output mismatch\n2200 '.x | tojson | . == if have_decnum then \"13911860366432393\" else \"13911860366432392\" end' fail output mismatch\n2204 '(13911860366432393 == 13911860366432392) | . == if have_decnum then false else true end' fail output mismatch\n2211 '. - 10' fail output mismatch\n2215 '.[0] - 10' fail output mismatch\n2219 '.x - 10' fail output mismatch\n2224 '-. | tojson == if have_decnum then \"-13911860366432393\" else \"-13911860366432392\" end' fail output mismatch\n2232 '[1E+1000,-1E+1000 | tojson] == if have_decnum then [\"1E+1000\",\"-1E+1000\"] else [\"1.7976931348623157e+308\",\"-1.7976931348623157e+308\"] end' fail output mismatch\n2241 '.[] as $n | $n+0 | [., tostring, . == $n]' fail output mismatch\n2271 '[1E+1000,-1E+1000 | abs | tojson] | unique == if have_decnum then [\"1E+1000\"] else [\"1.7976931348623157e+308\"] end' fail output mismatch\n2275 '[1E+1000,-1E+1000 | length | tojson] | unique == if have_decnum then [\"1E+1000\"] else [\"1.7976931348623157e+308\"] end' fail output mismatch\n2304 '{ a, $__loc__, c }' fail output mismatch\n2324 '.[] | try (fromjson | isnan) catch .' fail output mismatch\n2337 'try input catch .' fail output mismatch\n2390 '.[] |= try tonumber' fail output mismatch\n2407 'map(try implode catch .)' fail output mismatch\n2411 'try 0[implode] catch .' fail output mismatch\n2416 'walk(.)' fail output mismatch\n2425 '[walk(.,1)]' fail output mismatch\n2430 'walk(select(IN({}, []) | not))' fail output mismatch\n2435 '[range(10)] | .[1.2:3.5]' fail output mismatch\n2439 '[range(10)] | .[1.5:3.5]' fail output mismatch\n2443 '[range(10)] | .[1.7:3.5]' fail output mismatch\n2455 '[[range(10)] | .[1.1,1.5,1.7]]' fail output mismatch\n2463 '[range(3)] | .[nan:1]' fail output mismatch\n2467 '[range(3)] | .[1:nan]' fail output mismatch\n2471 '[range(3)] | .[nan]' fail output mismatch\n2475 'try ([range(3)] | .[nan] = 9) catch .' fail output mismatch\n2479 'try (\"foobar\" | .[1.5:3.5] = \"xyz\") catch .' fail output mismatch\n2483 'try ([range(10)] | .[1.5:3.5] = [\"xyz\"]) catch .' fail output mismatch\n2487 'try (\"foobar\" | .[1.5]) catch .' fail output mismatch\n2494 'try [\"ok\", setpath([1]; 1)] catch [\"ko\", .]' fail output mismatch\n2498 'try fromjson catch .' fail output mismatch\n2533 'try [\"OK\", setpath([[1]]; 1)] catch [\"KO\", .]' fail output mismatch\n2548 'strflocaltime(\"\" | ., @uri)' fail output mismatch\n2593 'try delpaths([[range(10001) | 0]]) catch .' fail output mismatch\n2602 'try (reduce range(10001) as $_ ([]; [.]) as $x | $x | contains($x)) catch .' fail exited 1: Traceback (most recent call last):\n2607 'reduce range(10000) as $_ ({}; {a: .}) as $x | $x * $x | length' fail output mismatch\n\n 004 {'pass': 143, 'fail': 67, 'error': 1, 'skip': 13}\n229 'try (.[999999999] = 0) catch .' error timed out after 10s\n353 '[foreach .[] / .[] as $i (0; . + $i)]' fail output mismatch\n405 '[nth(0,5,9,10,15; range(.)), try nth(-1; range(.)) catch .]' fail output mismatch\n566 '. as {(true):$foo} | $foo' fail program was accepted, but the corpus marks it %%FAIL\n709 '.[] | try toboolean catch .' fail output mismatch\n720 '\"true\\\\u0000x\", \"false\\\\u0000\" | try toboolean catch .' fail output mismatch\n798 'def f: 1; def g: f, def f: 2; def g: 3; f, def f: g; f, g; def f: 4; [f, def f: g; def g: 5; f, g]+[f,g]' fail output mismatch\n868 'def f: .+1; def g: f; def f: .+100; def f(a):a+.+11; [(g|f(20)), f]' fail output mismatch\n873 'def id(x):x; 2000 as $x | def f(x):1 as $x | id([$x, x, x]); def g(x): 100 as $x | f($x,$x+x); g($x)' fail output mismatch\n884 '[[20,10][1,0] as $x | def f: (100,200) as $y | def g: [$x + $y, .]; . + $x | g; f[0] | [f][0][1] | f]' fail output mismatch\n938 '.[] | . as {$a, b: [$c, {$d}]} ?// [$a, {$b}, $e] ?// $f | [$a, $b, $c, $d, $e, $f]' fail output mismatch\n1123 'try path(.a | map(select(.b == 0))) catch .' fail output mismatch\n1127 'try path(.a | map(select(.b == 0)) | .[0]) catch .' fail output mismatch\n1131 'try path(.a | map(select(.b == 0)) | .c) catch .' fail output mismatch\n1135 'try path(.a | map(select(.b == 0)) | .[]) catch .' fail output mismatch\n1214 'try pick(last) catch .' fail output mismatch\n1253 'def inc(x): x |= .+1; inc(.[].a)' fail output mismatch\n1258 '.[] | try (getpath([\"a\",0,\"b\"]) |= 5) catch .' fail output mismatch\n1290 'try ((map(select(.a == 1))[].b) = 10) catch .' fail output mismatch\n1294 'try ((map(select(.a == 1))[].a) |= .+1) catch .' fail output mismatch\n1298 'def x: .[1,2]; x=10' fail output mismatch\n1302 'try (def x: reverse; x=10) catch .' fail output mismatch\n1448 '[.[]|try if . == 0 then error(\"foo\") elif . == 1 then .a elif . == 2 then empty else . end catch .]' fail output mismatch\n1464 'try error(0) // 1' fail output mismatch\n1473 '1 + try 2 catch 3 + 4' fail output mismatch\n1481 'try -.? catch .' fail output mismatch\n1499 'try error(\"\\\\($__loc__)\") catch .' fail output mismatch\n1553 'try _strindices(\"abc\") catch .' fail output mismatch\n1557 'try _strindices(123) catch .' fail output mismatch\n1575 'try trim catch ., try ltrim catch ., try rtrim catch .' fail output mismatch\n1839 'try [\"OK\", bsearch(0)] catch [\"KO\",.]' fail output mismatch\n1868 'try strftime(\"%Y-%m-%dT%H:%M:%SZ\") catch .' fail output mismatch\n1872 'try strflocaltime(\"%Y-%m-%dT%H:%M:%SZ\") catch .' fail output mismatch\n1876 'try mktime catch .' fail output mismatch\n1881 'try [\"OK\", strftime([])] catch [\"KO\", .]' fail output mismatch\n1885 'try [\"OK\", strflocaltime({})] catch [\"KO\", .]' fail output mismatch\n1900 'import \"a\" as foo; import \"b\" as bar; def fooa: foo::a; [fooa, bar::a, bar::b, foo::a]' skip declared in exclusions.txt\n1904 'import \"c\" as foo; [foo::a, foo::c]' skip declared in exclusions.txt\n1908 'include \"c\"; [a, c]' skip declared in exclusions.txt\n1912 'import \"data\" as $e; import \"data\" as $d; [$d[].this,$e[].that,$d::d[].this,$e::e[].that]|join(\";\")' skip declared in exclusions.txt\n1917 'import \"data\" as $a; import \"data\" as $b; def f: {$a, $b}; f' skip declared in exclusions.txt\n1921 'include \"shadow1\"; e' skip declared in exclusions.txt\n1925 'include \"shadow1\"; include \"shadow2\"; e' skip declared in exclusions.txt\n1929 'import \"shadow1\" as f; import \"shadow2\" as f; import \"shadow1\" as e; [e::e, f::e]' skip declared in exclusions.txt\n1969 'modulemeta' skip declared in exclusions.txt\n1973 'modulemeta | .deps | length' skip declared in exclusions.txt\n1977 'modulemeta | .defs | length' skip declared in exclusions.txt\n1982 'import \"syntaxerror\" as e; .' skip declared in exclusions.txt\n1993 'import \"test_bind_order\" as check; check::check' skip declared in exclusions.txt\n1997 'try -. catch .' fail output mismatch\n2001 'try (.-.) catch .' fail output mismatch\n2005 '\"x\" * range(0; 12; 2) + \"☆\" * 8 | try -. catch .' fail output mismatch\n2014 'try (. + \"x\") catch . == if have_decnum then \"number (12345678901234567890123456...) and string (\\\\\"x\\\\\") cannot be added\" else \"number (12345678901234568000000000...) and string (\\\\\"x\\\\\") cannot be added\" end' fail output mismatch\n2034 'try join(\",\") catch .' fail output mismatch\n2038 'try join(\",\") catch .' fail output mismatch\n2130 '(.a as $x | .b) = \"b\"' fail output mismatch\n2196 '.[0] | tostring | . == if have_decnum then \"13911860366432393\" else \"13911860366432392\" end' fail output mismatch\n2200 '.x | tojson | . == if have_decnum then \"13911860366432393\" else \"13911860366432392\" end' fail output mismatch\n2204 '(13911860366432393 == 13911860366432392) | . == if have_decnum then false else true end' fail output mismatch\n2224 '-. | tojson == if have_decnum then \"-13911860366432393\" else \"-13911860366432392\" end' fail output mismatch\n2232 '[1E+1000,-1E+1000 | tojson] == if have_decnum then [\"1E+1000\",\"-1E+1000\"] else [\"1.7976931348623157e+308\",\"-1.7976931348623157e+308\"] end' fail output mismatch\n2241 '.[] as $n | $n+0 | [., tostring, . == $n]' fail output mismatch\n2271 '[1E+1000,-1E+1000 | abs | tojson] | unique == if have_decnum then [\"1E+1000\"] else [\"1.7976931348623157e+308\"] end' fail output mismatch\n2275 '[1E+1000,-1E+1000 | length | tojson] | unique == if have_decnum then [\"1E+1000\"] else [\"1.7976931348623157e+308\"] end' fail output mismatch\n2324 '.[] | try (fromjson | isnan) catch .' fail output mismatch\n2337 'try input catch .' fail output mismatch\n2390 '.[] |= try tonumber' fail output mismatch\n2407 'map(try implode catch .)' fail output mismatch\n2411 'try 0[implode] catch .' fail output mismatch\n2475 'try ([range(3)] | .[nan] = 9) catch .' fail output mismatch\n2479 'try (\"foobar\" | .[1.5:3.5] = \"xyz\") catch .' fail output mismatch\n2483 'try ([range(10)] | .[1.5:3.5] = [\"xyz\"]) catch .' fail output mismatch\n2487 'try (\"foobar\" | .[1.5]) catch .' fail output mismatch\n2494 'try [\"ok\", setpath([1]; 1)] catch [\"ko\", .]' fail output mismatch\n2498 'try fromjson catch .' fail output mismatch\n2504 'try ltrimstr(1) catch \"x\", try rtrimstr(1) catch \"x\" | \"ok\"' fail output mismatch\n2509 'try ltrimstr(\"x\") catch \"x\", try rtrimstr(\"x\") catch \"x\" | \"ok\"' fail output mismatch\n2533 'try [\"OK\", setpath([[1]]; 1)] catch [\"KO\", .]' fail output mismatch\n2593 'try delpaths([[range(10001) | 0]]) catch .' fail output mismatch\n2602 'try (reduce range(10001) as $_ ([]; [.]) as $x | $x | contains($x)) catch .' fail exited 1: Traceback (most recent call last):\n2607 'reduce range(10000) as $_ ({}; {a: .}) as $x | $x * $x | length' fail output mismatch\n","exit_code":0,"status":"completed"}}
{"type":"item.started","item":{"id":"item_7","type":"command_execution","command":"/bin/bash -lc \"sed -n '1,260p' jq_interpreter/interpreter.py; sed -n '1,260p' jq_interpreter/builtins.py\"","aggregated_output":"","exit_code":null,"status":"in_progress"}}
{"type":"item.completed","item":{"id":"item_7","type":"command_execution","command":"/bin/bash -lc \"sed -n '1,260p' jq_interpreter/interpreter.py; sed -n '1,260p' jq_interpreter/builtins.py\"","aggregated_output":"\"\"\"Application-facing interpreter orchestration.\"\"\"\n\nimport json\nfrom collections.abc import Iterable, Iterator\n\nfrom .evaluator import evaluate\nfrom .parser import parse\nfrom .runtime import JsonValue\n\n\nclass Interpreter:\n \"\"\"Compile once, then evaluate each JSON input in order.\"\"\"\n\n def __init__(self, program: str) -> None:\n self._compiled = parse(program)\n\n def run(self, inputs: Iterable[JsonValue]) -> Iterator[JsonValue]:\n \"\"\"Yield every output, preserving input and generator ordering.\"\"\"\n for value in inputs:\n yield from evaluate(self._compiled, value)\n\n\ndef parse_input(line: str) -> JsonValue:\n \"\"\"Decode one JSON input value.\"\"\"\n return json.loads(line.lstrip(\"\\ufeff\"), parse_constant=_parse_json_constant)\n\n\ndef parse_inputs(text: str) -> Iterator[JsonValue]:\n \"\"\"Decode every whitespace-separated JSON value in an input stream.\n\n ``jq`` accepts JSON values separated by arbitrary whitespace, so a value may\n span multiple physical lines. ``raw_decode`` preserves the boundary\n between successive values without requiring a non-standard JSON parser.\n \"\"\"\n decoder = json.JSONDecoder(parse_constant=_parse_json_constant)\n position = 0\n while True:\n while position < len(text) and text[position].isspace():\n position += 1\n if position >= len(text):\n return\n if position == 0 and text.startswith(\"\\ufeff\"):\n position += 1\n continue\n value, position = decoder.raw_decode(text, position)\n yield value\n\n\ndef _parse_json_constant(value: str) -> float:\n \"\"\"Decode jq's accepted non-standard numeric constants.\"\"\"\n return {\"NaN\": float(\"nan\"), \"Infinity\": float(\"inf\"),\n \"-Infinity\": float(\"-inf\")}[value]\n\"\"\"Builtin filter ownership boundary.\n\nLanguage-specific builtin definitions will be added here; the evaluator depends on\nthis module rather than embedding standard-library filters in process code.\n\"\"\"\n\n","exit_code":0,"status":"completed"}}
{"type":"item.started","item":{"id":"item_8","type":"command_execution","command":"/bin/bash -lc \"sed -n '520,900p' jq_interpreter/evaluator.py; sed -n '1,220p' jq_interpreter/ast.py\"","aggregated_output":"","exit_code":null,"status":"in_progress"}}
{"type":"item.completed","item":{"id":"item_8","type":"command_execution","command":"/bin/bash -lc \"sed -n '520,900p' jq_interpreter/evaluator.py; sed -n '1,220p' jq_interpreter/ast.py\"","aggregated_output":" yield from _node(body,value,local); return\n if name == 'empty': return\n if name == 'error': raise RuntimeError(_one(args[0],value,env) if args else value)\n if name=='length': yield len(value); return\n if name == 'add':\n items = list(_node(args[0], value, env)) if args else list(value)\n if not items: yield None\n else:\n result = items[0]\n for item in items[1:]:\n if result is None: result = item\n elif item is None: continue\n elif isinstance(result, (int,float)) and isinstance(item,(int,float)): result += item\n elif isinstance(result, str) and isinstance(item,str): result += item\n elif isinstance(result,list) and isinstance(item,list): result += item\n elif isinstance(result,dict) and isinstance(item,dict): result = {**result,**item}\n else: raise RuntimeError('cannot add values')\n yield result\n return\n if name=='type': yield 'null' if value is None else 'boolean' if isinstance(value,bool) else 'number' if isinstance(value,(int,float)) else 'string' if isinstance(value,str) else 'array' if isinstance(value,list) else 'object'; return\n if name=='not': yield not _truth(value); return\n if name == 'have_decnum': yield False; return\n if name in ('any', 'all'):\n values = list(_node(args[0], value, env)) if args else (list(value) if isinstance(value, list) else [])\n if len(args) > 1:\n values = [_one(args[1], item, env) for item in values]\n yield (any if name == 'any' else all)(_truth(item) for item in values)\n return\n if name == 'isempty':\n try:\n next(_node(args[0], value, env))\n yield False\n except StopIteration:\n yield True\n return\n if name in ('tostring','tojson'): yield _deep_json_dumps(value) if name=='tojson' else _stringify(value); return\n if name=='abs': yield abs(value); return\n if name=='fabs': yield math.fabs(value); return\n if name=='floor': yield math.floor(value); return\n if name=='ceil': yield math.ceil(value); return\n if name=='map':\n result=[]\n for x in value:\n result.extend(_node(args[0], x, env))\n yield result; return\n if name == 'map_values':\n if isinstance(value, list):\n result=[]\n for item in value: result.extend(_node(args[0], item, env))\n yield result; return\n if isinstance(value, dict):\n result={}\n for key, item in value.items():\n outputs=list(_node(args[0], item, env))\n if outputs: result[key]=outputs[0]\n yield result; return\n raise RuntimeError('map_values requires an array or object')\n if name == 'reverse':\n if isinstance(value, (list, str)): yield value[::-1]\n else: raise RuntimeError('cannot reverse value')\n return\n if name == 'flatten':\n depth = None if not args else int(_one(args[0], value, env))\n if depth is not None and depth < 0: raise RuntimeError('flatten depth must not be negative')\n if not isinstance(value, list): raise RuntimeError('flatten input must be an array')\n result=[]\n stack=[(value, depth)]\n while stack:\n items, remaining = stack.pop()\n for item in reversed(items):\n if isinstance(item, list) and (remaining is None or remaining > 0):\n stack.append((item, None if remaining is None else remaining - 1))\n else:\n result.append(item)\n result.reverse()\n yield result; return\n if name == 'contains':\n needle = _one(args[0], value, env)\n def contained(haystack, wanted):\n if isinstance(haystack, dict) and isinstance(wanted, dict):\n return all(k in haystack and contained(haystack[k], v) for k,v in wanted.items())\n if isinstance(haystack, list) and isinstance(wanted, list):\n return all(any(contained(item, candidate) for item in haystack) for candidate in wanted)\n if isinstance(haystack, str) and isinstance(wanted, str): return wanted in haystack\n return haystack == wanted\n yield contained(value, needle); return\n if name=='range':\n if len(args) == 1:\n start, end, step = 0, _one(args[0], value, env), 1\n else:\n start=_one(args[0],value,env); end=_one(args[1],value,env) if len(args)>1 else start; step=_one(args[2],value,env) if len(args)>2 else 1\n yield from range(int(start),int(end),int(step)); return\n if name == 'tonumber':\n if isinstance(value, (int, float)): yield value\n elif isinstance(value, str):\n try: yield json.loads(value)\n except Exception: raise RuntimeError(f'string ({json.dumps(value)}) cannot be parsed as a number')\n else: raise RuntimeError('cannot parse number')\n return\n if name == 'toboolean':\n if isinstance(value, bool): yield value\n elif isinstance(value, str) and value in ('true', 'false'): yield value == 'true'\n else: raise RuntimeError(f'{_type_name(value)} ({_stringify(value)}) cannot be parsed as a boolean')\n return\n if name == 'utf8bytelength':\n if not isinstance(value, str): raise RuntimeError(f'{_type_name(value)} ({_stringify(value)}) only strings have UTF-8 byte length')\n yield len(value.encode()); return\n if name == 'fromjson':\n if not isinstance(value, str): raise RuntimeError('only strings can be parsed')\n try: yield _deep_json_loads(value)\n except RuntimeError: raise\n except Exception: raise RuntimeError('invalid JSON')\n return\n if name in ('arrays','objects','iterables','booleans','numbers','strings','nulls','values','scalars','normals','finites'):\n ok = {'arrays':isinstance(value,list),'objects':isinstance(value,dict),\n 'iterables':isinstance(value,(list,dict)),'booleans':isinstance(value,bool),\n 'numbers':isinstance(value,(int,float)) and not isinstance(value,bool),\n 'strings':isinstance(value,str),'nulls':value is None,\n 'values':value is not None,'scalars':not isinstance(value,(list,dict))}[name]\n if ok: yield value\n return\n if name == 'keys':\n if isinstance(value, dict): yield sorted(value)\n elif isinstance(value, list): yield list(range(len(value)))\n else: raise RuntimeError('keys requires object or array')\n return\n if name == 'getpath':\n path = _one(args[0], value, env)\n if not isinstance(path, list): raise RuntimeError('Paths must be specified as an array')\n if len(path) > 10000: raise RuntimeError('Path too deep')\n yield _get_path(value, tuple(path)); return\n if name == 'setpath':\n path = _one(args[0], value, env); replacement = _one(args[1], value, env)\n if not isinstance(path, list): raise RuntimeError('Paths must be specified as an array')\n if len(path) > 10000: raise RuntimeError('Path too deep')\n yield _set_path(value, tuple(path), replacement); return\n if name == 'delpaths':\n paths = _one(args[0], value, env)\n if not isinstance(paths, list): raise RuntimeError('Paths must be specified as an array')\n result = value\n for path in paths:\n if isinstance(path, list): result = _delete_path(result, tuple(path))\n yield result; return\n if name == 'rindex':\n needle = _one(args[0], value, env)\n if isinstance(value, str): yield value.rfind(needle) if needle in value else None\n elif isinstance(value, list):\n try: yield len(value) - 1 - value[::-1].index(needle)\n except ValueError: yield None\n else: raise RuntimeError('cannot search value')\n return\n if name == 'first':\n try: yield next(_node(args[0], value, env))\n except StopIteration: return\n return\n if name == 'last':\n vals=list(_node(args[0], value, env));\n if vals: yield vals[-1]\n return\n if name == 'select':\n if _truth(_one(args[0], value, env)): yield value\n return\n if name == 'isnan': yield isinstance(value, float) and math.isnan(value); return\n if name == 'pow': yield math.pow(_one(args[0],value,env), _one(args[1],value,env)); return\n if name == 'implode':\n if not isinstance(value, list): raise RuntimeError('implode input must be an array')\n yield ''.join(chr(int(x)) for x in value); return\n if name == 'explode':\n if not isinstance(value, str): raise RuntimeError('explode input must be a string')\n yield [ord(x) for x in value]; return\n if name == 'limit':\n count=int(_one(args[0], value, env))\n if count < 0: raise RuntimeError(\"limit doesn't support negative count\")\n for item in _node(args[1], value, env):\n if count <= 0: break\n yield item; count -= 1\n return\n if name == 'skip':\n count=int(_one(args[0], value, env))\n if count < 0: raise RuntimeError(\"skip doesn't support negative count\")\n for item in _node(args[1], value, env):\n if count: count -= 1\n else: yield item\n return\n if name == 'join':\n for separator in _node(args[0], value, env):\n if not isinstance(value, list): raise RuntimeError('cannot join value')\n yield str(separator).join('' if item is None else _stringify(item) for item in value)\n return\n if name in ('sin','cos','tan','asin','acos','atan','sqrt','log','log10','exp','exp2','log2'):\n yield getattr(math, name)(value); return\n if name in ('round','ceil','floor','fabs'):\n if name == 'round': yield math.floor(value + 0.5)\n else: yield getattr(math, name)(value)\n return\n if name == 'split':\n separator = _one(args[0], value, env); yield value.split(separator); return\n if name in ('ltrimstr','rtrimstr','trimstr'):\n needle = _one(args[0], value, env)\n if not isinstance(value, str) or not isinstance(needle, str):\n raise RuntimeError(('startswith()' if name == 'ltrimstr' else 'endswith()') + ' requires string inputs')\n if name == 'ltrimstr': yield value[len(needle):] if value.startswith(needle) else value\n elif name == 'rtrimstr': yield value[:-len(needle)] if needle and value.endswith(needle) else value\n else:\n result = value\n if needle and result.startswith(needle): result = result[len(needle):]\n if needle and result.endswith(needle): result = result[:-len(needle)]\n yield result\n return\n if name in ('trim','ltrim','rtrim'):\n if not isinstance(value, str): raise RuntimeError(f'{name} input must be a string')\n yield value.strip() if name == 'trim' else value.lstrip() if name == 'ltrim' else value.rstrip(); return\n if name == 'startswith':\n yield value.startswith(_one(args[0], value, env)); return\n if name == 'endswith':\n yield value.endswith(_one(args[0], value, env)); return\n if name in ('sort', 'unique'):\n if not isinstance(value, list):\n raise RuntimeError('cannot sort value')\n ordered = sorted(value, key=_jq_sort_key)\n if name == 'unique':\n ordered = _dedupe_sorted(ordered)\n yield ordered\n return\n raise RuntimeError(f\"unknown function {name}\")\n\n\ndef _jq_sort_key(value: object, depth: int = 0) -> tuple[object, ...]:\n \"\"\"Return jq's basic total-order key for values used by sort/unique.\"\"\"\n if depth > 1000: raise RuntimeError('Comparison too deep')\n if value is None: return (0,)\n if isinstance(value, bool): return (1, int(value))\n if isinstance(value, (int, float)): return (2, value)\n if isinstance(value, str): return (3, value)\n if isinstance(value, list): return (4, tuple(_jq_sort_key(item, depth + 1) for item in value))\n if isinstance(value, dict):\n return (5, tuple((key, _jq_sort_key(item, depth + 1)) for key, item in sorted(value.items())))\n return (6, repr(value))\n\n\ndef _dedupe_sorted(values: list[object]) -> list[object]:\n result: list[object] = []\n for value in values:\n if not result or value != result[-1]:\n result.append(value)\n return result\ndef _decode_string(text,value,env):\n if \"\\\\(\" not in text: return json.loads(text)\n from .parser import parse\n inner=text[1:-1]; out=''; pos=0\n while pos<len(inner):\n mark=inner.find('\\\\(',pos)\n if mark<0: out+=json.loads('\"'+inner[pos:]+'\"'); break\n out+=json.loads('\"'+inner[pos:mark]+'\"'); depth=1; end=mark+2\n while depth and end<len(inner):\n if inner[end]=='(': depth+=1\n elif inner[end]==')': depth-=1\n end+=1\n expression = inner[mark + 2:end - 1]\n out += _stringify(_one(parse(expression), value, env))\n pos=end\n return out\n\ndef _short(value: object) -> str:\n if isinstance(value, float) and value.is_integer():\n return str(int(value))\n return _stringify(value)\n\ndef _type_name(value: object) -> str:\n if value is None: return 'null'\n if isinstance(value, bool): return 'boolean'\n if isinstance(value, (int, float)): return 'number'\n if isinstance(value, str): return 'string'\n if isinstance(value, list): return 'array'\n if isinstance(value, dict): return 'object'\n return type(value).__name__\n\ndef _stringify(value: object) -> str:\n import json\n return value if isinstance(value, str) else json.dumps(value, separators=(\",\", \":\"), ensure_ascii=False, allow_nan=False)\n\ndef _apply_format(name: str, value: object, template: bool = False) -> str:\n import base64, html, json, urllib.parse\n if name == \"text\": return _stringify(value)\n if name == \"json\": return json.dumps(value, separators=(\",\", \":\"), ensure_ascii=False)\n if name == \"html\": return html.escape(_stringify(value), quote=True).replace(\"'\", \"'\")\n if name == \"uri\": return urllib.parse.quote(_stringify(value), safe=\"-_.~\")\n if name == \"urid\": return urllib.parse.unquote(_stringify(value))\n if name == \"base64\": return base64.b64encode(_stringify(value).encode()).decode()\n if name == \"base64d\": return base64.b64decode(_stringify(value)).decode()\n if name == \"csv\": return \",\".join('\"' + str(x).replace('\"', '\"\"') + '\"' if isinstance(x, str) else _stringify(x) for x in value)\n if name == \"tsv\": return \"\\t\".join(_stringify(x).replace(\"\\\\\", \"\\\\\\\\\").replace(\"\\n\", \"\\\\n\").replace(\"\\r\", \"\\\\r\").replace(\"\\t\", \"\\\\t\") for x in value)\n if name == \"sh\": return \"'\" + _stringify(value).replace(\"'\", \"'\\\\''\") + \"'\"\n raise RuntimeError(f\"unknown format @{name}\")\n\"\"\"Syntax tree types shared by the lexer, parser, and evaluator.\"\"\"\n\nfrom dataclasses import dataclass\n\n\n@dataclass(frozen=True)\nclass Filter:\n \"\"\"Base type for compiled jq filters.\"\"\"\n\n\n@dataclass(frozen=True)\nclass Identity(Filter):\n \"\"\"The ``.`` filter, yielding its input unchanged.\"\"\"\n\n\n@dataclass(frozen=True)\nclass Iterate(Filter):\n \"\"\"The ``.[]`` filter, yielding array or object members in order.\"\"\"\n\n\n@dataclass(frozen=True)\nclass Literal(Filter):\n \"\"\"A JSON literal filter.\"\"\"\n\n value: object\n\n\n@dataclass(frozen=True)\nclass Comma(Filter):\n \"\"\"Concatenate the output streams of two filters.\"\"\"\n\n left: Filter\n right: Filter\n\n\n@dataclass(frozen=True)\nclass Raise(Filter):\n \"\"\"Raise a jq runtime error when evaluated.\"\"\"\n\n message: str = \"error\"\n\n\n@dataclass(frozen=True)\nclass Array(Filter):\n \"\"\"Collect a filter's generated values into an array.\"\"\"\n\n expression: Filter\n\n\n@dataclass(frozen=True)\nclass Limit(Filter):\n \"\"\"Keep at most ``count`` values from a filter stream.\"\"\"\n\n count: int\n expression: Filter\n\n@dataclass(frozen=True)\nclass Pipe(Filter):\n left: Filter\n right: Filter\n\n@dataclass(frozen=True)\nclass StringTemplate(Filter):\n parts: tuple[str | Filter, ...]\n\n@dataclass(frozen=True)\nclass Format(Filter):\n name: str\n template: StringTemplate | None = None\n\n@dataclass(frozen=True)\nclass Add(Filter):\n left: Filter\n right: Filter\n\n@dataclass(frozen=True)\nclass Node(Filter):\n \"\"\"General expression node used by the complete source parser.\"\"\"\n operation: str\n arguments: tuple[object, ...] = ()\n","exit_code":0,"status":"completed"}}
{"type":"item.started","item":{"id":"item_9","type":"command_execution","command":"/bin/bash -lc \"for q in '[.[]|.[1:3]?)' '[.[]|.[1:3]?]' '[.[-4,-3,-2,-1,0,1,2,3]]' '[range(0,1;3,4)]' '{\\\"a\\\",b,\\\"a\"'$'\"\\\\(1+1)\\\"}'; do echo Q:\"'$q; printf '\"'%s\\\\n' '[1,2,3]' | ./jq -c \\\"\"'$q\"; echo rc:$?; done'","aggregated_output":"","exit_code":null,"status":"in_progress"}}
{"type":"item.completed","item":{"id":"item_9","type":"command_execution","command":"/bin/bash -lc \"for q in '[.[]|.[1:3]?)' '[.[]|.[1:3]?]' '[.[-4,-3,-2,-1,0,1,2,3]]' '[range(0,1;3,4)]' '{\\\"a\\\",b,\\\"a\"'$'\"\\\\(1+1)\\\"}'; do echo Q:\"'$q; printf '\"'%s\\\\n' '[1,2,3]' | ./jq -c \\\"\"'$q\"; echo rc:$?; done'","aggregated_output":"[]\nrc:0\nQ:[.[-4,-3,-2,-1,0,1,2,3]]\n[null]\nrc:0\nQ:[range(0,1;3,4)]\n[0,1,2]\nrc:0\nQ:{\"a\",b,\"a$\\(1+1)\"}\njq: runtime error: cannot index array with string\nrc:5\n","exit_code":0,"status":"completed"}}
{"type":"item.started","item":{"id":"item_10","type":"command_execution","command":"/bin/bash -lc \"python3 - <<'PY'\nimport json\nfor n in ('003','004'):\n d=json.load(open('/tmp/new'+n)); print(n)\n for x in d['cases']:\n if x['status']=='fail' and x['line'] in [122,187,195,283,291,307,353,365,369,381,405,566,709,798,868,873,938,1062,1110,1115,1119,1123,1448,1464,1473,1481,1997,2130]: print(x)\nPY\"","aggregated_output":"","exit_code":null,"status":"in_progress"}}
{"type":"item.completed","item":{"id":"item_10","type":"command_execution","command":"/bin/bash -lc \"python3 - <<'PY'\nimport json\nfor n in ('003','004'):\n d=json.load(open('/tmp/new'+n)); print(n)\n for x in d['cases']:\n if x['status']=='fail' and x['line'] in [122,187,195,283,291,307,353,365,369,381,405,566,709,798,868,873,938,1062,1110,1115,1119,1123,1448,1464,1473,1481,1997,2130]: print(x)\nPY\"","aggregated_output":"003\n{'line': 122, 'program': '{\"a\",b,\"a$\\\\(1+1)\"}', 'status': 'fail', 'detail': 'output mismatch', 'expect_failure': False, 'expected': ['{\"a\":1, \"b\":2, \"a$2\":4}'], 'actual': ['{\"a\":null,\"b\":2,\"a$2\":null}']}\n{'line': 187, 'program': '[..]', 'status': 'fail', 'detail': 'output mismatch', 'expect_failure': False, 'expected': ['[[1,[[2]],{\"a\":[1]}],1,[[2]],[2],2,{\"a\":[1]},[1],1]'], 'actual': []}\n{'line': 195, 'program': '[.[]|.[1:3]?]', 'status': 'fail', 'detail': 'exited 1: Traceback (most recent call last):', 'expect_failure': False, 'expected': ['[null,\"bc\",[],[2,3],[2]]'], 'actual': []}\n{'line': 283, 'program': '[.[-4,-3,-2,-1,0,1,2,3]]', 'status': 'fail', 'detail': 'output mismatch', 'expect_failure': False, 'expected': ['[null,1,2,3,1,2,3,null]'], 'actual': ['[null]']}\n{'line': 291, 'program': '[range(0,1;3,4)]', 'status': 'fail', 'detail': 'output mismatch', 'expect_failure': False, 'expected': ['[0,1,2, 0,1,2,3, 1,2, 1,2,3]'], 'actual': ['[0,1,2]']}\n{'line': 307, 'program': '[range(0,1;4,5;1,2)]', 'status': 'fail', 'detail': 'output mismatch', 'expect_failure': False, 'expected': ['[0,1,2,3,0,2, 0,1,2,3,4,0,2,4, 1,2,3,1,3, 1,2,3,4,1,3]'], 'actual': ['[0,1,2,3]']}\n{'line': 353, 'program': '[foreach .[] / .[] as $i (0; . + $i)]', 'status': 'fail', 'detail': 'output mismatch', 'expect_failure': False, 'expected': ['[1,3,3.5,4.5]'], 'actual': ['[1.0,1.5,3.5,4.5]']}\n{'line': 365, 'program': '[limit(0; error)]', 'status': 'fail', 'detail': 'output mismatch', 'expect_failure': False, 'expected': ['[]'], 'actual': []}\n{'line': 369, 'program': '[limit(1; 1, error)]', 'status': 'fail', 'detail': 'output mismatch', 'expect_failure': False, 'expected': ['[1]'], 'actual': []}\n{'line': 381, 'program': '[skip(0,2,3,4; .[])]', 'status': 'fail', 'detail': 'output mismatch', 'expect_failure': False, 'expected': ['[1,2,3,3]'], 'actual': ['[1,2,3]']}\n{'line': 405, 'program': '[nth(0,5,9,10,15; range(.)), try nth(-1; range(.)) catch .]', 'status': 'fail', 'detail': 'output mismatch', 'expect_failure': False, 'expected': ['[0,5,9,\"nth doesn\\'t support negative indices\"]'], 'actual': []}\n{'line': 566, 'program': '. as {(true):$foo} | $foo', 'status': 'fail', 'detail': 'program was accepted, but the corpus marks it %%FAIL', 'expect_failure': True, 'expected': [], 'actual': []}\n{'line': 709, 'program': '.[] | try toboolean catch .', 'status': 'fail', 'detail': 'output mismatch', 'expect_failure': False, 'expected': ['\"null (null) cannot be parsed as a boolean\"', '\"number (0) cannot be parsed as a boolean\"', '\"string (\\\\\"tru\\\\\") cannot be parsed as a boolean\"', '\"string (\\\\\"truee\\\\\") cannot be parsed as a boolean\"', '\"string (\\\\\"fals\\\\\") cannot be parsed as a boolean\"', '\"string (\\\\\"falsee\\\\\") cannot be parsed as a boolean\"', '\"array ([]) cannot be parsed as a boolean\"', '\"object ({}) cannot be parsed as a boolean\"'], 'actual': ['\"null (null) cannot be parsed as a boolean\"', '\"number (0) cannot be parsed as a boolean\"', '\"string (tru) cannot be parsed as a boolean\"', '\"string (truee) cannot be parsed as a boolean\"', '\"string (fals) cannot be parsed as a boolean\"', '\"string (falsee) cannot be parsed as a boolean\"', '\"array ([]) cannot be parsed as a boolean\"', '\"object ({}) cannot be parsed as a boolean\"']}\n{'line': 798, 'program': 'def f: 1; def g: f, def f: 2; def g: 3; f, def f: g; f, g; def f: 4; [f, def f: g; def g: 5; f, g]+[f,g]', 'status': 'fail', 'detail': 'output mismatch', 'expect_failure': False, 'expected': ['[4,1,2,3,3,5,4,1,2,3,3]'], 'actual': ['[4,5,5,4,4,2,3,3]']}\n{'line': 868, 'program': 'def f: .+1; def g: f; def f: .+100; def f(a):a+.+11; [(g|f(20)), f]', 'status': 'fail', 'detail': 'output mismatch', 'expect_failure': False, 'expected': ['[33,101]'], 'actual': ['[132,101]']}\n{'line': 873, 'program': 'def id(x):x; 2000 as $x | def f(x):1 as $x | id([$x, x, x]); def g(x): 100 as $x | f($x,$x+x); g($x)', 'status': 'fail', 'detail': 'output mismatch', 'expect_failure': False, 'expected': ['[1,100,2100.0,100,2100.0]'], 'actual': ['[1,1,1]']}\n{'line': 938, 'program': '.[] | . as {$a, b: [$c, {$d}]} ?// [$a, {$b}, $e] ?// $f | [$a, $b, $c, $d, $e, $f]', 'status': 'fail', 'detail': 'output mismatch', 'expect_failure': False, 'expected': ['[1, null, 2, 3, null, null]', '[4, 5, null, null, 7, null]', '[null, null, null, null, null, \"foo\"]'], 'actual': []}\n{'line': 1062, 'program': 'any(true, error; .)', 'status': 'fail', 'detail': 'output mismatch', 'expect_failure': False, 'expected': ['true'], 'actual': []}\n{'line': 1110, 'program': 'path(.foo[0,1])', 'status': 'fail', 'detail': 'output mismatch', 'expect_failure': False, 'expected': ['[\"foo\", 0]', '[\"foo\", 1]'], 'actual': []}\n{'line': 1115, 'program': 'path(.[] | select(.>3))', 'status': 'fail', 'detail': 'output mismatch', 'expect_failure': False, 'expected': ['[1]'], 'actual': []}\n{'line': 1119, 'program': 'path(.)', 'status': 'fail', 'detail': 'output mismatch', 'expect_failure': False, 'expected': ['[]'], 'actual': []}\n{'line': 1123, 'program': 'try path(.a | map(select(.b == 0))) catch .', 'status': 'fail', 'detail': 'output mismatch', 'expect_failure': False, 'expected': ['\"Invalid path expression with result [{\\\\\"b\\\\\":0}]\"'], 'actual': ['\"unknown function path\"']}\n{'line': 1448, 'program': '[.[]|try if . == 0 then error(\"foo\") elif . == 1 then .a elif . == 2 then empty else . end catch .]', 'status': 'fail', 'detail': 'output mismatch', 'expect_failure': False, 'expected': ['[\"foo\",\"Cannot index number with string (\\\\\"a\\\\\")\",3]'], 'actual': ['[\"foo\",\"cannot index value\",3]']}\n{'line': 1464, 'program': 'try error(0) // 1', 'status': 'fail', 'detail': 'output mismatch', 'expect_failure': False, 'expected': ['1'], 'actual': []}\n{'line': 1473, 'program': '1 + try 2 catch 3 + 4', 'status': 'fail', 'detail': 'output mismatch', 'expect_failure': False, 'expected': ['7'], 'actual': ['3']}\n{'line': 1481, 'program': 'try -.? catch .', 'status': 'fail', 'detail': 'output mismatch', 'expect_failure': False, 'expected': ['\"string (\\\\\"foo\\\\\") cannot be negated\"'], 'actual': []}\n{'line': 1997, 'program': 'try -. catch .', 'status': 'fail', 'detail': 'output mismatch', 'expect_failure': False, 'expected': ['\"string (\\\\\"very-long-long-long-long...\\\\\") cannot be negated\"'], 'actual': []}\n{'line': 2130, 'program': '(.a as $x | .b) = \"b\"', 'status': 'fail', 'detail': 'output mismatch', 'expect_failure': False, 'expected': ['{\"a\":null,\"b\":\"b\"}'], 'actual': []}\n004\n{'line': 353, 'program': '[foreach .[] / .[] as $i (0; . + $i)]', 'status': 'fail', 'detail': 'output mismatch', 'expect_failure': False, 'expected': ['[1,3,3.5,4.5]'], 'actual': ['[1.0,1.5,3.5,4.5]']}\n{'line': 405, 'program': '[nth(0,5,9,10,15; range(.)), try nth(-1; range(.)) catch .]', 'status': 'fail', 'detail': 'output mismatch', 'expect_failure': False, 'expected': ['[0,5,9,\"nth doesn\\'t support negative indices\"]'], 'actual': []}\n{'line': 566, 'program': '. as {(true):$foo} | $foo', 'status': 'fail', 'detail': 'program was accepted, but the corpus marks it %%FAIL', 'expect_failure': True, 'expected': [], 'actual': []}\n{'line': 709, 'program': '.[] | try toboolean catch .', 'status': 'fail', 'detail': 'output mismatch', 'expect_failure': False, 'expected': ['\"null (null) cannot be parsed as a boolean\"', '\"number (0) cannot be parsed as a boolean\"', '\"string (\\\\\"tru\\\\\") cannot be parsed as a boolean\"', '\"string (\\\\\"truee\\\\\") cannot be parsed as a boolean\"', '\"string (\\\\\"fals\\\\\") cannot be parsed as a boolean\"', '\"string (\\\\\"falsee\\\\\") cannot be parsed as a boolean\"', '\"array ([]) cannot be parsed as a boolean\"', '\"object ({}) cannot be parsed as a boolean\"'], 'actual': ['\"null (null) cannot be parsed as a boolean\"', '\"number (0) cannot be parsed as a boolean\"', '\"string (tru) cannot be parsed as a boolean\"', '\"string (truee) cannot be parsed as a boolean\"', '\"string (fals) cannot be parsed as a boolean\"', '\"string (falsee) cannot be parsed as a boolean\"', '\"array ([]) cannot be parsed as a boolean\"', '\"object ({}) cannot be parsed as a boolean\"']}\n{'line': 798, 'program': 'def f: 1; def g: f, def f: 2; def g: 3; f, def f: g; f, g; def f: 4; [f, def f: g; def g: 5; f, g]+[f,g]', 'status': 'fail', 'detail': 'output mismatch', 'expect_failure': False, 'expected': ['[4,1,2,3,3,5,4,1,2,3,3]'], 'actual': ['[4,5,5,4,4,2,3,3]']}\n{'line': 868, 'program': 'def f: .+1; def g: f; def f: .+100; def f(a):a+.+11; [(g|f(20)), f]', 'status': 'fail', 'detail': 'output mismatch', 'expect_failure': False, 'expected': ['[33,101]'], 'actual': ['[132,101]']}\n{'line': 873, 'program': 'def id(x):x; 2000 as $x | def f(x):1 as $x | id([$x, x, x]); def g(x): 100 as $x | f($x,$x+x); g($x)', 'status': 'fail', 'detail': 'output mismatch', 'expect_failure': False, 'expected': ['[1,100,2100.0,100,2100.0]'], 'actual': ['[1,1,1]']}\n{'line': 938, 'program': '.[] | . as {$a, b: [$c, {$d}]} ?// [$a, {$b}, $e] ?// $f | [$a, $b, $c, $d, $e, $f]', 'status': 'fail', 'detail': 'output mismatch', 'expect_failure': False, 'expected': ['[1, null, 2, 3, null, null]', '[4, 5, null, null, 7, null]', '[null, null, null, null, null, \"foo\"]'], 'actual': []}\n{'line': 1123, 'program': 'try path(.a | map(select(.b == 0))) catch .', 'status': 'fail', 'detail': 'output mismatch', 'expect_failure': False, 'expected': ['\"Invalid path expression with result [{\\\\\"b\\\\\":0}]\"'], 'actual': ['\"unknown function path\"']}\n{'line': 1448, 'program': '[.[]|try if . == 0 then error(\"foo\") elif . == 1 then .a elif . == 2 then empty else . end catch .]', 'status': 'fail', 'detail': 'output mismatch', 'expect_failure': False, 'expected': ['[\"foo\",\"Cannot index number with string (\\\\\"a\\\\\")\",3]'], 'actual': ['[\"foo\",\"cannot index value\",3]']}\n{'line': 1464, 'program': 'try error(0) // 1', 'status': 'fail', 'detail': 'output mismatch', 'expect_failure': False, 'expected': ['1'], 'actual': []}\n{'line': 1473, 'program': '1 + try 2 catch 3 + 4', 'status': 'fail', 'detail': 'output mismatch', 'expect_failure': False, 'expected': ['7'], 'actual': ['3']}\n{'line': 1481, 'program': 'try -.? catch .', 'status': 'fail', 'detail': 'output mismatch', 'expect_failure': False, 'expected': ['\"string (\\\\\"foo\\\\\") cannot be negated\"'], 'actual': []}\n{'line': 1997, 'program': 'try -. catch .', 'status': 'fail', 'detail': 'output mismatch', 'expect_failure': False, 'expected': ['\"string (\\\\\"very-long-long-long-long...\\\\\") cannot be negated\"'], 'actual': []}\n{'line': 2130, 'program': '(.a as $x | .b) = \"b\"', 'status': 'fail', 'detail': 'output mismatch', 'expect_failure': False, 'expected': ['{\"a\":null,\"b\":\"b\"}'], 'actual': []}\n","exit_code":0,"status":"completed"}}
{"type":"item.started","item":{"id":"item_11","type":"command_execution","command":"/bin/bash -lc \"python3 - <<'PY'\nfrom jq_interpreter.parser import parse\nfor s in ['try error(0) // 1','1 + try 2 catch 3 + 4','try -.? catch .','(.a as \"'$x | .b) = \"b\"'\"']:\n try: print(s,parse(s))\n except Exception as e: print(type(e),e)\nPY\"","aggregated_output":"","exit_code":null,"status":"in_progress"}}
{"type":"item.completed","item":{"id":"item_11","type":"command_execution","command":"/bin/bash -lc \"python3 - <<'PY'\nfrom jq_interpreter.parser import parse\nfor s in ['try error(0) // 1','1 + try 2 catch 3 + 4','try -.? catch .','(.a as \"'$x | .b) = \"b\"'\"']:\n try: print(s,parse(s))\n except Exception as e: print(type(e),e)\nPY\"","aggregated_output":"try error(0) // 1 Node(operation='binary', arguments=('//', Node(operation='try', arguments=(Node(operation='call', arguments=('error', (Node(operation='literal', arguments=('0',)),))), None)), Node(operation='literal', arguments=('1',))))\n1 + try 2 catch 3 + 4 Node(operation='binary', arguments=('+', Node(operation='literal', arguments=('1',)), Node(operation='try', arguments=(Node(operation='literal', arguments=('2',)), Node(operation='binary', arguments=('+', Node(operation='literal', arguments=('3',)), Node(operation='literal', arguments=('4',))))))))\ntry -.? catch . Node(operation='try', arguments=(Node(operation='unary', arguments=('-', Node(operation='optional', arguments=(Node(operation='identity', arguments=()),)))), Node(operation='identity', arguments=())))\n(.a as $x | .b) = \"b\" Node(operation='binary', arguments=('=', Node(operation='bind', arguments=(Node(operation='field', arguments=('a',)), Node(operation='pattern_var', arguments=('x',)), Node(operation='field', arguments=('b',)))), Node(operation='string', arguments=('\"b\"',))))\n","exit_code":0,"status":"completed"}}
{"type":"item.completed","item":{"id":"item_12","type":"agent_message","text":"The scoped reports show the dominant failures are shared parser/evaluator semantics, not isolated corpus cases: multi-valued indexes and call arguments collapse generators, `try` precedence is wrong, recursive `..` is missing, and assignment paths through bindings are lost. I’m applying those general fixes first, plus strict computed-key validation."}}
{"type":"item.started","item":{"id":"item_13","type":"file_change","changes":[{"path":"/mnt/c/Users/barlo/projects/drydock/uat/jq/runs/20260822.044627/build/jq/jq_interpreter/parser.py","kind":"update"}],"status":"in_progress"}}
{"type":"item.completed","item":{"id":"item_13","type":"file_change","changes":[{"path":"/mnt/c/Users/barlo/projects/drydock/uat/jq/runs/20260822.044627/build/jq/jq_interpreter/parser.py","kind":"update"}],"status":"completed"}}
{"type":"item.started","item":{"id":"item_14","type":"file_change","changes":[{"path":"/mnt/c/Users/barlo/projects/drydock/uat/jq/runs/20260822.044627/build/jq/jq_interpreter/evaluator.py","kind":"update"}],"status":"in_progress"}}
{"type":"item.completed","item":{"id":"item_14","type":"file_change","changes":[{"path":"/mnt/c/Users/barlo/projects/drydock/uat/jq/runs/20260822.044627/build/jq/jq_interpreter/evaluator.py","kind":"update"}],"status":"completed"}}
{"type":"item.started","item":{"id":"item_15","type":"command_execution","command":"/bin/bash -lc \"grep -n \\\"name == 'range'\\\" -A8 jq_interpreter/evaluator.py\"","aggregated_output":"","exit_code":null,"status":"in_progress"}}
{"type":"item.completed","item":{"id":"item_15","type":"command_execution","command":"/bin/bash -lc \"grep -n \\\"name == 'range'\\\" -A8 jq_interpreter/evaluator.py\"","aggregated_output":"","exit_code":1,"status":"failed"}}
{"type":"item.started","item":{"id":"item_16","type":"command_execution","command":"/bin/bash -lc 'grep -n \"range\" jq_interpreter/evaluator.py | head'","aggregated_output":"","exit_code":null,"status":"in_progress"}}
{"type":"item.completed","item":{"id":"item_16","type":"command_execution","command":"/bin/bash -lc 'grep -n \"range\" jq_interpreter/evaluator.py | head'","aggregated_output":"71: for _ in range(program.count):\n396: for index in range(len(item) - 1, -1, -1):\n407: for index in range(len(entries) - 1, -1, -1):\n438: for _ in range(depth - 1):\n463: if isinstance(current, list): result.extend(p + (i,) for i in range(len(current)))\n618: if name=='range':\n623: yield from range(int(start),int(end),int(step)); return\n655: elif isinstance(value, list): yield list(range(len(value)))\n","exit_code":0,"status":"completed"}}
{"type":"item.started","item":{"id":"item_17","type":"file_change","changes":[{"path":"/mnt/c/Users/barlo/projects/drydock/uat/jq/runs/20260822.044627/build/jq/jq_interpreter/evaluator.py","kind":"update"}],"status":"in_progress"}}
{"type":"item.completed","item":{"id":"item_17","type":"file_change","changes":[{"path":"/mnt/c/Users/barlo/projects/drydock/uat/jq/runs/20260822.044627/build/jq/jq_interpreter/evaluator.py","kind":"update"}],"status":"completed"}}
{"type":"item.started","item":{"id":"item_18","type":"command_execution","command":"/bin/bash -lc \"set +e\nprintf '%s\\\\n' '[1,2,3]' | ./jq -c '[.[-4,-3,-2,-1,0,1,2,3]]'\nprintf '%s\\\\n' '[1,[[2]],{\\\"a\\\":[1]}]' | ./jq -c '[..]'\nprintf '%s\\\\n' '{\\\"a\\\":1,\\\"b\\\":2,\\\"a\"'$2\":4}'\"' | ./jq -c '{\\\"a\\\",b,\\\"a\"'$'\"\\\\(1+1)\\\"}'\nprintf '%s\\\\n' 'null' | ./jq -c 'try error(0) // 1'\nprintf '%s\\\\n' '\\\"foo\\\"' | ./jq -c 'try -.? catch .'\npython3 - <<'PY'\nfrom jq_interpreter.parser import parse\nprint(parse('[range(0,1;3,4)]'))\nPY\"","aggregated_output":"","exit_code":null,"status":"in_progress"}}
{"type":"item.completed","item":{"id":"item_18","type":"command_execution","command":"/bin/bash -lc \"set +e\nprintf '%s\\\\n' '[1,2,3]' | ./jq -c '[.[-4,-3,-2,-1,0,1,2,3]]'\nprintf '%s\\\\n' '[1,[[2]],{\\\"a\\\":[1]}]' | ./jq -c '[..]'\nprintf '%s\\\\n' '{\\\"a\\\":1,\\\"b\\\":2,\\\"a\"'$2\":4}'\"' | ./jq -c '{\\\"a\\\",b,\\\"a\"'$'\"\\\\(1+1)\\\"}'\nprintf '%s\\\\n' 'null' | ./jq -c 'try error(0) // 1'\nprintf '%s\\\\n' '\\\"foo\\\"' | ./jq -c 'try -.? catch .'\npython3 - <<'PY'\nfrom jq_interpreter.parser import parse\nprint(parse('[range(0,1;3,4)]'))\nPY\"","aggregated_output":"[null,1,2,3,1,2,3,null]\n[[1,[[2]],{\"a\":[1]}],1,[[2]],[2],2,{\"a\":[1]},[1],1]\njq: compile error: syntax error\njq: runtime error: bad operand type for unary -: 'str'\nNode(operation='array', arguments=(Node(operation='call', arguments=('range', (Node(operation='binary', arguments=(',', Node(operation='literal', arguments=('0',)), Node(operation='literal', arguments=('1',)))), Node(operation='binary', arguments=(',', Node(operation='literal', arguments=('3',)), Node(operation='literal', arguments=('4',))))))),))\n","exit_code":0,"status":"completed"}}
{"type":"item.started","item":{"id":"item_19","type":"command_execution","command":"/bin/bash -lc \"python3 - <<'PY'\nfrom jq_interpreter.parser import parse\nfor s in ['{\\\"a\\\",b,\\\"a\"'$'\"\\\\\\\\(1+1)\\\"}','{\\\"a\\\",b}']:\n try: print(parse(s))\n except Exception as e: print(type(e),e)\nPY\"","aggregated_output":"","exit_code":null,"status":"in_progress"}}
{"type":"item.completed","item":{"id":"item_19","type":"command_execution","command":"/bin/bash -lc \"python3 - <<'PY'\nfrom jq_interpreter.parser import parse\nfor s in ['{\\\"a\\\",b,\\\"a\"'$'\"\\\\\\\\(1+1)\\\"}','{\\\"a\\\",b}']:\n try: print(parse(s))\n except Exception as e: print(type(e),e)\nPY\"","aggregated_output":"<class 'jq_interpreter.errors.CompileError'> syntax error\nNode(operation='object', arguments=(((Node(operation='string', arguments=('\"a\"',)), Node(operation='index', arguments=(Node(operation='identity', arguments=()), 'a', False))), (Node(operation='string', arguments=('\"b\"',)), Node(operation='index', arguments=(Node(operation='identity', arguments=()), 'b', False)))),))\n","exit_code":0,"status":"completed"}}
{"type":"item.started","item":{"id":"item_20","type":"command_execution","command":"/bin/bash -lc \"sed -n '175,205p' jq_interpreter/parser.py\"","aggregated_output":"","exit_code":null,"status":"in_progress"}}
{"type":"item.completed","item":{"id":"item_20","type":"command_execution","command":"/bin/bash -lc \"sed -n '175,205p' jq_interpreter/parser.py\"","aggregated_output":" items.append(self.pattern())\n while self.p()==',': self.take(); items.append(self.pattern())\n self.take(']'); return self._pattern_alt(Node('pattern_array',(tuple(items),)))\n if t=='{':\n self.take()\n if self.p()=='}': raise CompileError('empty destructuring pattern')\n items=[]\n if self.p()!='}':\n while True:\n if self.p() == '(':\n self.take('('); key_node = self.expr(0); self.take(')')\n key = '<computed>'\n else:\n key=self.take(); key_node = None\n if key.startswith('\"'): key = json.loads(key)\n if self.p()==':':\n self.take(); pat=self.pattern()\n if key.startswith('$'):\n pat = Node('pattern_bind',(key[1:],pat))\n elif key.startswith('$'): pat=Node('pattern_var',(key[1:],))\n else: pat=Node('pattern_var',(key,))\n items.append((key_node if key_node is not None else key.lstrip('$'),pat))\n if self.p()!='}': self.take(',')\n else: break\n self.take('}'); return self._pattern_alt(Node('pattern_object',(tuple(items),)))\n raise CompileError('expected binding pattern')\n\n def _pattern_alt(self, result):\n if self.p()=='?//':\n self.take('?//'); return Node('pattern_alt',(result,self.pattern()))\n return result\n","exit_code":0,"status":"completed"}}
{"type":"item.started","item":{"id":"item_21","type":"command_execution","command":"/bin/bash -lc \"sed -n '135,175p' jq_interpreter/parser.py\"","aggregated_output":"","exit_code":null,"status":"in_progress"}}
{"type":"item.completed","item":{"id":"item_21","type":"command_execution","command":"/bin/bash -lc \"sed -n '135,175p' jq_interpreter/parser.py\"","aggregated_output":" break\n return x\n def object(self):\n self.take('{'); pairs=[]\n while self.p()!='}':\n if self.p()=='(':\n self.take('('); key=self.expr(0); self.take(')')\n else:\n k=self.take()\n if k.startswith('\"'):\n key=Node('string',(k,))\n elif k.startswith('$'):\n key=Node('var',(k[1:],))\n else:\n key=Node('string',(json.dumps(k.lstrip('$').lstrip('.')),))\n if self.p()==':': self.take(); v=self.expr(1, True)\n else:\n # `{name}` and `{$name}` abbreviate an access using the key.\n raw = json.loads(k) if k.startswith('\"') else k.lstrip('$').lstrip('.')\n if k.startswith('$'):\n key = Node('string',(json.dumps(raw),))\n v=Node('var',(raw,)) if k.startswith('$') else Node('index',(Node('identity'),raw,False))\n if key.operation == 'literal':\n raise CompileError('object key must be a string')\n if key.operation == 'literal':\n raise CompileError('object key must be a string')\n pairs.append((key,v))\n if self.p()!= '}': self.take(',')\n self.take('}'); return Node('object',(tuple(pairs),))\n\n def pattern(self):\n t=self.p()\n if t.startswith('$'):\n result=Node('pattern_var',(self.take()[1:],))\n return self._pattern_alt(result)\n if t=='[':\n self.take()\n if self.p()==']': raise CompileError('empty destructuring pattern')\n items=[]\n if self.p()!=']':\n items.append(self.pattern())\n","exit_code":0,"status":"completed"}}
{"type":"item.started","item":{"id":"item_22","type":"file_change","changes":[{"path":"/mnt/c/Users/barlo/projects/drydock/uat/jq/runs/20260822.044627/build/jq/jq_interpreter/parser.py","kind":"update"}],"status":"in_progress"}}
{"type":"item.completed","item":{"id":"item_22","type":"file_change","changes":[{"path":"/mnt/c/Users/barlo/projects/drydock/uat/jq/runs/20260822.044627/build/jq/jq_interpreter/parser.py","kind":"update"}],"status":"completed"}}
{"type":"item.started","item":{"id":"item_23","type":"command_execution","command":"/bin/bash -lc \"python3 - <<'PY'\nfrom jq_interpreter.parser import parse\nprint(parse('{\\\"a\\\",b,\\\"a\"'$'\"\\\\\\\\(1+1)\\\"}'))\nPY\nprintf '%s\\\\n' '{\\\"a\\\":1,\\\"b\\\":2,\\\"a\"'$2\":4}'\"' | ./jq -c '{\\\"a\\\",b,\\\"a\"'$'\"\\\\(1+1)\\\"}'\nprintf '%s\\\\n' 'null' | ./jq -c '[range(0,1;3,4)]'\"","aggregated_output":"","exit_code":null,"status":"in_progress"}}
{"type":"item.completed","item":{"id":"item_23","type":"command_execution","command":"/bin/bash -lc \"python3 - <<'PY'\nfrom jq_interpreter.parser import parse\nprint(parse('{\\\"a\\\",b,\\\"a\"'$'\"\\\\\\\\(1+1)\\\"}'))\nPY\nprintf '%s\\\\n' '{\\\"a\\\":1,\\\"b\\\":2,\\\"a\"'$2\":4}'\"' | ./jq -c '{\\\"a\\\",b,\\\"a\"'$'\"\\\\(1+1)\\\"}'\nprintf '%s\\\\n' 'null' | ./jq -c '[range(0,1;3,4)]'\"","aggregated_output":"Node(operation='object', arguments=(((Node(operation='string', arguments=('\"a\"',)), Node(operation='indexexpr', arguments=(Node(operation='identity', arguments=()), Node(operation='string', arguments=('\"a\"',))))), (Node(operation='string', arguments=('\"b\"',)), Node(operation='index', arguments=(Node(operation='identity', arguments=()), 'b', False))), (Node(operation='string', arguments=('\"a$\\\\(1+1)\"',)), Node(operation='indexexpr', arguments=(Node(operation='identity', arguments=()), Node(operation='string', arguments=('\"a$\\\\(1+1)\"',)))))),))\n{\"a\":1,\"b\":2,\"a$2\":4}\n[0,1,2,0,1,2,3,1,2,1,2,3]\n","exit_code":0,"status":"completed"}}
{"type":"item.started","item":{"id":"item_24","type":"command_execution","command":"/bin/bash -lc \"timeout 150 python3 - <<'PY'\nimport json,os,subprocess,sys\nfor name,sel in [('003',r'\\\\.|\\\\[|\\\\{|\\\\+|\\\\-|\\\\*|/|%'),('004',r'%%FAIL|if |try |reduce |foreach |def | as |label |module|include')]:\n r=subprocess.run([sys.executable,'sources/run_conformance.py','--select',sel,'--json'],capture_output=True,text=True,env={**os.environ,'JQ':os.getcwd()+'/jq'})\n print(name,'rc',r.returncode); open('/tmp/fix'+name,'w').write(r.stdout)\n d=json.loads(r.stdout); print(d['summary'])\nPY\"","aggregated_output":"","exit_code":null,"status":"in_progress"}}
{"type":"item.completed","item":{"id":"item_24","type":"command_execution","command":"/bin/bash -lc \"timeout 150 python3 - <<'PY'\nimport json,os,subprocess,sys\nfor name,sel in [('003',r'\\\\.|\\\\[|\\\\{|\\\\+|\\\\-|\\\\*|/|%'),('004',r'%%FAIL|if |try |reduce |foreach |def | as |label |module|include')]:\n r=subprocess.run([sys.executable,'sources/run_conformance.py','--select',sel,'--json'],capture_output=True,text=True,env={**os.environ,'JQ':os.getcwd()+'/jq'})\n print(name,'rc',r.returncode); open('/tmp/fix'+name,'w').write(r.stdout)\n d=json.loads(r.stdout); print(d['summary'])\nPY\"","aggregated_output":"003 rc 1\n{'pass': 316, 'fail': 138, 'error': 1, 'skip': 9}\n004 rc 1\n{'pass': 147, 'fail': 63, 'error': 1, 'skip': 13}\n","exit_code":0,"status":"completed"}}
{"type":"item.started","item":{"id":"item_25","type":"command_execution","command":"/bin/bash -lc \"python3 - <<'PY'\nimport json\nfor n in ('003','004'):\n d=json.load(open('/tmp/fix'+n)); print(n)\n for x in d['cases']:\n if x['status']=='fail' and x['line'] not in [1900,1904,1908,1912,1917,1921,1925,1929,1969,1973,1977,1982,1993]: print(x['line'],x['program'],x.get('actual'))\nPY\"","aggregated_output":"","exit_code":null,"status":"in_progress"}}
{"type":"item.completed","item":{"id":"item_25","type":"command_execution","command":"/bin/bash -lc \"python3 - <<'PY'\nimport json\nfor n in ('003','004'):\n d=json.load(open('/tmp/fix'+n)); print(n)\n for x in d['cases']:\n if x['status']=='fail' and x['line'] not in [1900,1904,1908,1912,1917,1921,1925,1929,1969,1973,1977,1982,1993]: print(x['line'],x['program'],x.get('actual'))\nPY\"","aggregated_output":"003\n195 [.[]|.[1:3]?] []\n311 [while(.<100; .*2)] []\n329 [.[]|[.,1]|until(.[0] < 1; [.[0] - 1, .[1] * .[0]])|.[1]] []\n353 [foreach .[] / .[] as $i (0; . + $i)] ['[1.0,1.5,3.5,4.5]']\n365 [limit(0; error)] []\n369 [limit(1; 1, error)] []\n381 [skip(0,2,3,4; .[])] ['[1,2,3]']\n405 [nth(0,5,9,10,15; range(.)), try nth(-1; range(.)) catch .] []\n420 [limit(5,7; range(9))] ['[0,1,2,3,4]']\n425 [nth(5,7; range(9;0;-1))] []\n440 [(index(\",\",\"|\"), rindex(\",\",\"|\")), indices(\",\",\"|\")] []\n474 del(.[2:4],.[0],.[-2:]) []\n478 .[2:4] = ([], [\"a\",\"b\"], [\"a\",\"b\",\"c\"]) []\n566 . as {(true):$foo} | $foo []\n617 {\"a\":1} + {\"b\":2} + {\"c\":3} []\n633 [1,2,3,4,1] - [.,3] []\n661 9E999999999, 9999999999E999999990, 1E-999999999, 0.000000001E-999999990 ['null', 'null', '0.0', '0.0']\n689 [(infinite, -infinite) % (1, -1, infinite)] []\n693 [nan % 1, 1 % nan | isnan] ['[null,true]']\n709 .[] | try toboolean catch . ['\"null (null) cannot be parsed as a boolean\"', '\"number (0) cannot be parsed as a boolean\"', '\"string (tru) cannot be parsed as a boolean\"', '\"string (truee) cannot be parsed as a boolean\"', '\"string (fals) cannot be parsed as a boolean\"', '\"string (falsee) cannot be parsed as a boolean\"', '\"array ([]) cannot be parsed as a boolean\"', '\"object ({}) cannot be parsed as a boolean\"']\n720 \"true\\u0000x\", \"false\\u0000\" | try toboolean catch . ['\"string (true\\\\u0000x) cannot be parsed as a boolean\"', '\"string (false\\\\u0000) cannot be parsed as a boolean\"']\n798 def f: 1; def g: f, def f: 2; def g: 3; f, def f: g; f, g; def f: 4; [f, def f: g; def g: 5; f, g]+[f,g] ['[4,5,5,4,4,2,3,3]']\n868 def f: .+1; def g: f; def f: .+100; def f(a):a+.+11; [(g|f(20)), f] ['[132,101]']\n873 def id(x):x; 2000 as $x | def f(x):1 as $x | id([$x, x, x]); def g(x): 100 as $x | f($x,$x+x); g($x) ['[1,1,1]']\n938 .[] | . as {$a, b: [$c, {$d}]} ?// [$a, {$b}, $e] ?// $f | [$a, $b, $c, $d, $e, $f] []\n1062 any(true, error; .) []\n1066 all(false, error; .) []\n1110 path(.foo[0,1]) []\n1115 path(.[] | select(.>3)) []\n1119 path(.) []\n1123 try path(.a | map(select(.b == 0))) catch . ['\"unknown function path\"']\n1127 try path(.a | map(select(.b == 0)) | .[0]) catch . ['\"unknown function path\"']\n1131 try path(.a | map(select(.b == 0)) | .c) catch . ['\"unknown function path\"']\n1135 try path(.a | map(select(.b == 0)) | .[]) catch . ['\"unknown function path\"']\n1139 path(.a[path(.b)[0]]) []\n1143 [paths] []\n1177 del(.), del(empty), del((.foo,.bar,.baz) | .[2,3,0]), del(.foo[0], .bar[0], .foo, .baz.bar[0].x) []\n1184 del(.[1], .[-6], .[2], .[-3:9]) []\n1188 del(.[nan]) []\n1192 del(.[nan,nan]) []\n1201 pick(.a.b.c) []\n1214 try pick(last) catch . ['\"unknown function pick\"']\n1253 def inc(x): x |= .+1; inc(.[].a) []\n1258 .[] | try (getpath([\"a\",0,\"b\"]) |= 5) catch . []\n1270 (.[] | select(. >= 2)) |= empty []\n1278 .foo[1,4,2,3] |= empty ['{\"foo\":[0,4,5]}']\n1290 try ((map(select(.a == 1))[].b) = 10) catch . []\n1294 try ((map(select(.a == 1))[].a) |= .+1) catch . []\n1298 def x: .[1,2]; x=10 []\n1302 try (def x: reverse; x=10) catch . []\n1306 .[] = 1 []\n1370 [.[] | [.foo[] // .bar]] ['[[1,2,1,2],[1],[3,3,3],[],[41,41,41]]']\n1374 .[] //= .[0] []\n1448 [.[]|try if . == 0 then error(\"foo\") elif . == 1 then .a elif . == 2 then empty else . end catch .] ['[\"foo\",\"cannot index value\",3]']\n1464 try error(0) // 1 []\n1481 try -.? catch . []\n1499 try error(\"\\($__loc__)\") catch . ['\"variable $__loc__ is not defined\"']\n1544 [(index(\",\"), rindex(\",\")), indices(\",\")] []\n1548 [ index(\"aba\"), rindex(\"aba\"), indices(\"aba\") ] []\n1553 try _strindices(\"abc\") catch . ['\"unknown function _strindices\"']\n1557 try _strindices(123) catch . ['\"unknown function _strindices\"']\n1575 try trim catch ., try ltrim catch ., try rtrim catch . ['\"trim input must be a string\"', '\"ltrim input must be a string\"', '\"rtrim input must be a string\"']\n1585 indices([1,2]) []\n1589 indices([1,2]) []\n1625 [.[] * \"abc\"] ['[\"\",\"\",\"\",\"\",\"abc\",\"abc\",\"abcabcabc\",\"abcabcabcabcabcabcabcabcabcabc\"]']\n1629 [. * (nan,-nan)] []\n1677 (sort_by(.b) | sort_by(.a)), sort_by(.a, .b), sort_by(.b, .c), group_by(.b), group_by(.a + .b - .c == 2) []\n1693 [min, max, min_by(.[1]), max_by(.[1]), min_by(.[2]), max_by(.[2])] []\n1697 [min,max,min_by(.),max_by(.)] []\n1701 .foo[.baz] ['null']\n1721 with_entries(.key |= \"KEY_\" + .) []\n1741 [][.] []\n1745 map([1,2][0:.]) []\n1835 bsearch({x:1}) []\n1839 try [\"OK\", bsearch(0)] catch [\"KO\",.] ['[\"KO\",\"unknown function bsearch\"]']\n1843 strftime(\"%Y-%m-%dT%H:%M:%SZ\") []\n1847 strftime(\"%A, %B %d, %Y\") []\n1851 strftime(\"%Y-%m-%dT%H:%M:%SZ\") []\n1863 gmtime[5] []\n1868 try strftime(\"%Y-%m-%dT%H:%M:%SZ\") catch . ['\"unknown function strftime\"']\n1872 try strflocaltime(\"%Y-%m-%dT%H:%M:%SZ\") catch . ['\"unknown function strflocaltime\"']\n1876 try mktime catch . ['\"unknown function mktime\"']\n1881 try [\"OK\", strftime([])] catch [\"KO\", .] ['[\"KO\",\"unknown function strftime\"]']\n1885 try [\"OK\", strflocaltime({})] catch [\"KO\", .] ['[\"KO\",\"unknown function strflocaltime\"]']\n1889 [strptime(\"%Y-%m-%dT%H:%M:%SZ\")|(.,mktime)] []\n1895 last(range(365 * 67)|(\"1970-03-01T01:02:03Z\"|strptime(\"%Y-%m-%dT%H:%M:%SZ\")|mktime) + (86400 * .)|strftime(\"%Y-%m-%dT%H:%M:%SZ\")|strptime(\"%Y-%m-%dT%H:%M:%SZ\")) []\n1997 try -. catch . []\n2001 try (.-.) catch . []\n2005 \"x\" * range(0; 12; 2) + \"☆\" * 8 | try -. catch . []\n2014 try (. + \"x\") catch . == if have_decnum then \"number (12345678901234567890123456...) and string (\\\"x\\\") cannot be added\" else \"number (12345678901234568000000000...) and string (\\\"x\\\") cannot be added\" end []\n2034 try join(\",\") catch . ['\"1,2,{\\\\\"a\\\\\":{\\\\\"b\\\\\":{\\\\\"c\\\\\":33}}}\"']\n2038 try join(\",\") catch . ['\"1,2,[3,4,5]\"']\n2086 (.[{}] = 0)? ['{\"{}\":0}']\n2089 INDEX(range(5)|[., \"foo\\(.)\"]; .[0]) []\n2093 JOIN({\"0\":[0,\"abc\"],\"1\":[1,\"bcd\"],\"2\":[2,\"def\"],\"3\":[3,\"efg\"],\"4\":[4,\"fgh\"]}; .[0]|tostring) []\n2130 (.a as $x | .b) = \"b\" ['{\"a\":\"b\",\"b\":null}']\n2135 (.. | select(type == \"object\" and has(\"b\") and (.b | type) == \"array\")|.b) |= .[0] []\n2161 \"-1\"|IN(builtins[] / \"/\"|.[1]) []\n2165 all(builtins[] / \"/\"; .[1]|tonumber >= 0) []\n2169 builtins|any(.[:1] == \"_\") []\n2196 .[0] | tostring | . == if have_decnum then \"13911860366432393\" else \"13911860366432392\" end ['false']\n2200 .x | tojson | . == if have_decnum then \"13911860366432393\" else \"13911860366432392\" end ['false']\n2204 (13911860366432393 == 13911860366432392) | . == if have_decnum then false else true end ['false']\n2211 . - 10 ['13911860366432383']\n2215 .[0] - 10 ['13911860366432383']\n2219 .x - 10 ['13911860366432383']\n2224 -. | tojson == if have_decnum then \"-13911860366432393\" else \"-13911860366432392\" end ['false']\n2232 [1E+1000,-1E+1000 | tojson] == if have_decnum then [\"1E+1000\",\"-1E+1000\"] else [\"1.7976931348623157e+308\",\"-1.7976931348623157e+308\"] end ['false']\n2241 .[] as $n | $n+0 | [., tostring, . == $n] ['[-9007199254740993,\"-9007199254740993\",true]', '[-9007199254740992,\"-9007199254740992\",true]', '[9007199254740992,\"9007199254740992\",true]', '[9007199254740993,\"9007199254740993\",true]', '[13911860366432393,\"13911860366432393\",true]']\n2271 [1E+1000,-1E+1000 | abs | tojson] | unique == if have_decnum then [\"1E+1000\"] else [\"1.7976931348623157e+308\"] end ['false']\n2275 [1E+1000,-1E+1000 | length | tojson] | unique == if have_decnum then [\"1E+1000\"] else [\"1.7976931348623157e+308\"] end []\n2304 { a, $__loc__, c } []\n2324 .[] | try (fromjson | isnan) catch . ['true', '\"invalid JSON\"', '\"invalid JSON\"', '\"invalid JSON\"', '\"invalid JSON\"', '\"invalid JSON\"', '\"invalid JSON\"', '\"invalid JSON\"']\n2337 try input catch . ['\"unknown function input\"']\n2390 .[] |= try tonumber ['[1,3,4,5,6.7,-876,21]']\n2407 map(try implode catch .) []\n2411 try 0[implode] catch . ['\"implode input must be an array\"']\n2416 walk(.) []\n2425 [walk(.,1)] []\n2430 walk(select(IN({}, []) | not)) []\n2435 [range(10)] | .[1.2:3.5] ['[1,2]']\n2439 [range(10)] | .[1.5:3.5] ['[1,2]']\n2443 [range(10)] | .[1.7:3.5] ['[1,2]']\n2455 [[range(10)] | .[1.1,1.5,1.7]] []\n2463 [range(3)] | .[nan:1] []\n2467 [range(3)] | .[1:nan] []\n2471 [range(3)] | .[nan] []\n2475 try ([range(3)] | .[nan] = 9) catch . []\n2479 try (\"foobar\" | .[1.5:3.5] = \"xyz\") catch . []\n2483 try ([range(10)] | .[1.5:3.5] = [\"xyz\"]) catch . []\n2487 try (\"foobar\" | .[1.5]) catch . ['\"cannot index string with number\"']\n2494 try [\"ok\", setpath([1]; 1)] catch [\"ko\", .] ['[\"ok\",{\"hi\":\"hello\",\"1\":1}]']\n2498 try fromjson catch . ['\"invalid JSON\"']\n2533 try [\"OK\", setpath([[1]]; 1)] catch [\"KO\", .] []\n2548 strflocaltime(\"\" | ., @uri) []\n2593 try delpaths([[range(10001) | 0]]) catch . ['null']\n2602 try (reduce range(10001) as $_ ([]; [.]) as $x | $x | contains($x)) catch . []\n2607 reduce range(10000) as $_ ({}; {a: .}) as $x | $x * $x | length []\n004\n353 [foreach .[] / .[] as $i (0; . + $i)] ['[1.0,1.5,3.5,4.5]']\n405 [nth(0,5,9,10,15; range(.)), try nth(-1; range(.)) catch .] []\n566 . as {(true):$foo} | $foo []\n709 .[] | try toboolean catch . ['\"null (null) cannot be parsed as a boolean\"', '\"number (0) cannot be parsed as a boolean\"', '\"string (tru) cannot be parsed as a boolean\"', '\"string (truee) cannot be parsed as a boolean\"', '\"string (fals) cannot be parsed as a boolean\"', '\"string (falsee) cannot be parsed as a boolean\"', '\"array ([]) cannot be parsed as a boolean\"', '\"object ({}) cannot be parsed as a boolean\"']\n720 \"true\\u0000x\", \"false\\u0000\" | try toboolean catch . ['\"string (true\\\\u0000x) cannot be parsed as a boolean\"', '\"string (false\\\\u0000) cannot be parsed as a boolean\"']\n798 def f: 1; def g: f, def f: 2; def g: 3; f, def f: g; f, g; def f: 4; [f, def f: g; def g: 5; f, g]+[f,g] ['[4,5,5,4,4,2,3,3]']\n868 def f: .+1; def g: f; def f: .+100; def f(a):a+.+11; [(g|f(20)), f] ['[132,101]']\n873 def id(x):x; 2000 as $x | def f(x):1 as $x | id([$x, x, x]); def g(x): 100 as $x | f($x,$x+x); g($x) ['[1,1,1]']\n938 .[] | . as {$a, b: [$c, {$d}]} ?// [$a, {$b}, $e] ?// $f | [$a, $b, $c, $d, $e, $f] []\n1123 try path(.a | map(select(.b == 0))) catch . ['\"unknown function path\"']\n1127 try path(.a | map(select(.b == 0)) | .[0]) catch . ['\"unknown function path\"']\n1131 try path(.a | map(select(.b == 0)) | .c) catch . ['\"unknown function path\"']\n1135 try path(.a | map(select(.b == 0)) | .[]) catch . ['\"unknown function path\"']\n1214 try pick(last) catch . ['\"unknown function pick\"']\n1253 def inc(x): x |= .+1; inc(.[].a) []\n1258 .[] | try (getpath([\"a\",0,\"b\"]) |= 5) catch . []\n1290 try ((map(select(.a == 1))[].b) = 10) catch . []\n1294 try ((map(select(.a == 1))[].a) |= .+1) catch . []\n1298 def x: .[1,2]; x=10 []\n1302 try (def x: reverse; x=10) catch . []\n1448 [.[]|try if . == 0 then error(\"foo\") elif . == 1 then .a elif . == 2 then empty else . end catch .] ['[\"foo\",\"cannot index value\",3]']\n1464 try error(0) // 1 []\n1481 try -.? catch . []\n1499 try error(\"\\($__loc__)\") catch . ['\"variable $__loc__ is not defined\"']\n1553 try _strindices(\"abc\") catch . ['\"unknown function _strindices\"']\n1557 try _strindices(123) catch . ['\"unknown function _strindices\"']\n1575 try trim catch ., try ltrim catch ., try rtrim catch . ['\"trim input must be a string\"', '\"ltrim input must be a string\"', '\"rtrim input must be a string\"']\n1839 try [\"OK\", bsearch(0)] catch [\"KO\",.] ['[\"KO\",\"unknown function bsearch\"]']\n1868 try strftime(\"%Y-%m-%dT%H:%M:%SZ\") catch . ['\"unknown function strftime\"']\n1872 try strflocaltime(\"%Y-%m-%dT%H:%M:%SZ\") catch . ['\"unknown function strflocaltime\"']\n1876 try mktime catch . ['\"unknown function mktime\"']\n1881 try [\"OK\", strftime([])] catch [\"KO\", .] ['[\"KO\",\"unknown function strftime\"]']\n1885 try [\"OK\", strflocaltime({})] catch [\"KO\", .] ['[\"KO\",\"unknown function strflocaltime\"]']\n1997 try -. catch . []\n2001 try (.-.) catch . []\n2005 \"x\" * range(0; 12; 2) + \"☆\" * 8 | try -. catch . []\n2014 try (. + \"x\") catch . == if have_decnum then \"number (12345678901234567890123456...) and string (\\\"x\\\") cannot be added\" else \"number (12345678901234568000000000...) and string (\\\"x\\\") cannot be added\" end []\n2034 try join(\",\") catch . ['\"1,2,{\\\\\"a\\\\\":{\\\\\"b\\\\\":{\\\\\"c\\\\\":33}}}\"']\n2038 try join(\",\") catch . ['\"1,2,[3,4,5]\"']\n2130 (.a as $x | .b) = \"b\" ['{\"a\":\"b\",\"b\":null}']\n2196 .[0] | tostring | . == if have_decnum then \"13911860366432393\" else \"13911860366432392\" end ['false']\n2200 .x | tojson | . == if have_decnum then \"13911860366432393\" else \"13911860366432392\" end ['false']\n2204 (13911860366432393 == 13911860366432392) | . == if have_decnum then false else true end ['false']\n2224 -. | tojson == if have_decnum then \"-13911860366432393\" else \"-13911860366432392\" end ['false']\n2232 [1E+1000,-1E+1000 | tojson] == if have_decnum then [\"1E+1000\",\"-1E+1000\"] else [\"1.7976931348623157e+308\",\"-1.7976931348623157e+308\"] end ['false']\n2241 .[] as $n | $n+0 | [., tostring, . == $n] ['[-9007199254740993,\"-9007199254740993\",true]', '[-9007199254740992,\"-9007199254740992\",true]', '[9007199254740992,\"9007199254740992\",true]', '[9007199254740993,\"9007199254740993\",true]', '[13911860366432393,\"13911860366432393\",true]']\n2271 [1E+1000,-1E+1000 | abs | tojson] | unique == if have_decnum then [\"1E+1000\"] else [\"1.7976931348623157e+308\"] end ['false']\n2275 [1E+1000,-1E+1000 | length | tojson] | unique == if have_decnum then [\"1E+1000\"] else [\"1.7976931348623157e+308\"] end []\n2324 .[] | try (fromjson | isnan) catch . ['true', '\"invalid JSON\"', '\"invalid JSON\"', '\"invalid JSON\"', '\"invalid JSON\"', '\"invalid JSON\"', '\"invalid JSON\"', '\"invalid JSON\"']\n2337 try input catch . ['\"unknown function input\"']\n2390 .[] |= try tonumber ['[1,3,4,5,6.7,-876,21]']\n2407 map(try implode catch .) []\n2411 try 0[implode] catch . ['\"implode input must be an array\"']\n2475 try ([range(3)] | .[nan] = 9) catch . []\n2479 try (\"foobar\" | .[1.5:3.5] = \"xyz\") catch . []\n2483 try ([range(10)] | .[1.5:3.5] = [\"xyz\"]) catch . []\n2487 try (\"foobar\" | .[1.5]) catch . ['\"cannot index string with number\"']\n2494 try [\"ok\", setpath([1]; 1)] catch [\"ko\", .] ['[\"ok\",{\"hi\":\"hello\",\"1\":1}]']\n2498 try fromjson catch . ['\"invalid JSON\"']\n2533 try [\"OK\", setpath([[1]]; 1)] catch [\"KO\", .] []\n2593 try delpaths([[range(10001) | 0]]) catch . ['null']\n2602 try (reduce range(10001) as $_ ([]; [.]) as $x | $x | contains($x)) catch . []\n2607 reduce range(10000) as $_ ({}; {a: .}) as $x | $x * $x | length []\n","exit_code":0,"status":"completed"}}
{"type":"item.started","item":{"id":"item_26","type":"file_change","changes":[{"path":"/mnt/c/Users/barlo/projects/drydock/uat/jq/runs/20260822.044627/build/jq/jq_interpreter/evaluator.py","kind":"update"}],"status":"in_progress"}}
{"type":"item.completed","item":{"id":"item_26","type":"file_change","changes":[{"path":"/mnt/c/Users/barlo/projects/drydock/uat/jq/runs/20260822.044627/build/jq/jq_interpreter/evaluator.py","kind":"update"}],"status":"completed"}}
{"type":"item.started","item":{"id":"item_27","type":"file_change","changes":[{"path":"/mnt/c/Users/barlo/projects/drydock/uat/jq/runs/20260822.044627/build/jq/jq_interpreter/evaluator.py","kind":"update"},{"path":"/mnt/c/Users/barlo/projects/drydock/uat/jq/runs/20260822.044627/build/jq/jq_interpreter/parser.py","kind":"update"}],"status":"in_progress"}}
{"type":"item.completed","item":{"id":"item_27","type":"file_change","changes":[{"path":"/mnt/c/Users/barlo/projects/drydock/uat/jq/runs/20260822.044627/build/jq/jq_interpreter/evaluator.py","kind":"update"},{"path":"/mnt/c/Users/barlo/projects/drydock/uat/jq/runs/20260822.044627/build/jq/jq_interpreter/parser.py","kind":"update"}],"status":"completed"}}
{"type":"item.started","item":{"id":"item_28","type":"file_change","changes":[{"path":"/mnt/c/Users/barlo/projects/drydock/uat/jq/runs/20260822.044627/build/jq/jq_interpreter/parser.py","kind":"update"}],"status":"in_progress"}}
{"type":"item.completed","item":{"id":"item_28","type":"file_change","changes":[{"path":"/mnt/c/Users/barlo/projects/drydock/uat/jq/runs/20260822.044627/build/jq/jq_interpreter/parser.py","kind":"update"}],"status":"completed"}}
{"type":"item.started","item":{"id":"item_29","type":"command_execution","command":"/bin/bash -lc \"grep -n \\\"cannot index\\\\|parsed as a boolean\\\" jq_interpreter/evaluator.py\"","aggregated_output":"","exit_code":null,"status":"in_progress"}}
{"type":"item.completed","item":{"id":"item_29","type":"command_execution","command":"/bin/bash -lc \"grep -n \\\"cannot index\\\\|parsed as a boolean\\\" jq_interpreter/evaluator.py\"","aggregated_output":"252: raise RuntimeError(\"cannot index array with string\")\n257: raise RuntimeError(\"cannot index string with number\")\n260: raise RuntimeError(\"cannot index value\")\n643: else: raise RuntimeError(f'{_type_name(value)} ({_stringify(value)}) cannot be parsed as a boolean')\n","exit_code":0,"status":"completed"}}
{"type":"item.started","item":{"id":"item_30","type":"file_change","changes":[{"path":"/mnt/c/Users/barlo/projects/drydock/uat/jq/runs/20260822.044627/build/jq/jq_interpreter/evaluator.py","kind":"update"}],"status":"in_progress"}}
{"type":"item.completed","item":{"id":"item_30","type":"file_change","changes":[{"path":"/mnt/c/Users/barlo/projects/drydock/uat/jq/runs/20260822.044627/build/jq/jq_interpreter/evaluator.py","kind":"update"}],"status":"completed"}}
{"type":"item.started","item":{"id":"item_31","type":"command_execution","command":"/bin/bash -lc \"set +e\nprintf '%s\\\\n' '{\\\"a\\\":1}' | ./jq -c '. as {(true):\"'$foo} | $foo'\"'; echo rc:\"'$?\nprintf '\"'%s\\\\n' '{\\\"foo\\\":[1,2]}' | ./jq -c 'path(.foo[0,1])'\nprintf '%s\\\\n' '\\\"tru\\\"' | ./jq -c 'try toboolean catch .'\nprintf '%s\\\\n' '[1,2,3]' | ./jq -c '[range(10)] | .[1.2:3.5]'\"","aggregated_output":"","exit_code":null,"status":"in_progress"}}
{"type":"item.completed","item":{"id":"item_31","type":"command_execution","command":"/bin/bash -lc \"set +e\nprintf '%s\\\\n' '{\\\"a\\\":1}' | ./jq -c '. as {(true):\"'$foo} | $foo'\"'; echo rc:\"'$?\nprintf '\"'%s\\\\n' '{\\\"foo\\\":[1,2]}' | ./jq -c 'path(.foo[0,1])'\nprintf '%s\\\\n' '\\\"tru\\\"' | ./jq -c 'try toboolean catch .'\nprintf '%s\\\\n' '[1,2,3]' | ./jq -c '[range(10)] | .[1.2:3.5]'\"","aggregated_output":"jq: compile error: object key must be a string\nrc:3\n[\"foo\",0]\n[\"foo\",1]\n\"string (\\\"tru\\\") cannot be parsed as a boolean\"\n[2,3]\n","exit_code":0,"status":"completed"}}
{"type":"item.started","item":{"id":"item_32","type":"file_change","changes":[{"path":"/mnt/c/Users/barlo/projects/drydock/uat/jq/runs/20260822.044627/build/jq/jq_interpreter/evaluator.py","kind":"update"}],"status":"in_progress"}}
{"type":"item.completed","item":{"id":"item_32","type":"file_change","changes":[{"path":"/mnt/c/Users/barlo/projects/drydock/uat/jq/runs/20260822.044627/build/jq/jq_interpreter/evaluator.py","kind":"update"}],"status":"completed"}}
{"type":"item.started","item":{"id":"item_33","type":"command_execution","command":"/bin/bash -lc 'python3 -m pytest -q'","aggregated_output":"","exit_code":null,"status":"in_progress"}}
{"type":"item.completed","item":{"id":"item_33","type":"command_execution","command":"/bin/bash -lc 'python3 -m pytest -q'","aggregated_output":"................................ [100%]\n32 passed in 5.14s\n","exit_code":0,"status":"completed"}}
{"type":"item.completed","item":{"id":"item_34","type":"agent_message","text":"The focused fixes are in place and the project’s own 32 tests are green. I’m now rerunning both exact acceptance invocations to record the final scoped conformance state."}}
{"type":"item.started","item":{"id":"item_35","type":"command_execution","command":"/bin/bash -lc \"timeout 150 python3 - <<'PY'\nimport json,os,subprocess,sys\nchecks=[('parse-003-conformance',r'\\\\.|\\\\[|\\\\{|\\\\+|\\\\-|\\\\*|/|%'),('parse-004-conformance',r'%%FAIL|if |try |reduce |foreach |def | as |label |module|include')]\nfor name,select in checks:\n result=subprocess.run([sys.executable,'sources/run_conformance.py','--select',select,'--json'],capture_output=True,text=True,env={**os.environ,'JQ':f'{os.getcwd()}/jq'})\n report=json.loads(result.stdout); summary=report['summary']; print(name,result.returncode,summary)\n assert sum(summary.values())>0\n assert summary['fail']==0 and summary['error']==0\n assert result.returncode==0\nPY\"","aggregated_output":"","exit_code":null,"status":"in_progress"}}
{"type":"item.completed","item":{"id":"item_35","type":"command_execution","command":"/bin/bash -lc \"timeout 150 python3 - <<'PY'\nimport json,os,subprocess,sys\nchecks=[('parse-003-conformance',r'\\\\.|\\\\[|\\\\{|\\\\+|\\\\-|\\\\*|/|%'),('parse-004-conformance',r'%%FAIL|if |try |reduce |foreach |def | as |label |module|include')]\nfor name,select in checks:\n result=subprocess.run([sys.executable,'sources/run_conformance.py','--select',select,'--json'],capture_output=True,text=True,env={**os.environ,'JQ':f'{os.getcwd()}/jq'})\n report=json.loads(result.stdout); summary=report['summary']; print(name,result.returncode,summary)\n assert sum(summary.values())>0\n assert summary['fail']==0 and summary['error']==0\n assert result.returncode==0\nPY\"","aggregated_output":"Traceback (most recent call last):\n File \"<stdin>\", line 7, in <module>\nAssertionError\nparse-003-conformance 1 {'pass': 331, 'fail': 123, 'error': 1, 'skip': 9}\n","exit_code":1,"status":"failed"}}
{"type":"item.started","item":{"id":"item_36","type":"command_execution","command":"/bin/bash -lc \"python3 - <<'PY'\nimport json,os,subprocess,sys\ns=r'%%FAIL|if |try |reduce |foreach |def | as |label |module|include'\nr=subprocess.run([sys.executable,'sources/run_conformance.py','--select',s,'--json'],capture_output=True,text=True,env={**os.environ,'JQ':os.getcwd()+'/jq'})\nd=json.loads(r.stdout); print(r.returncode,d['summary'])\nPY\"","aggregated_output":"","exit_code":null,"status":"in_progress"}}
{"type":"item.completed","item":{"id":"item_36","type":"command_execution","command":"/bin/bash -lc \"python3 - <<'PY'\nimport json,os,subprocess,sys\ns=r'%%FAIL|if |try |reduce |foreach |def | as |label |module|include'\nr=subprocess.run([sys.executable,'sources/run_conformance.py','--select',s,'--json'],capture_output=True,text=True,env={**os.environ,'JQ':os.getcwd()+'/jq'})\nd=json.loads(r.stdout); print(r.returncode,d['summary'])\nPY\"","aggregated_output":"1 {'pass': 153, 'fail': 57, 'error': 1, 'skip': 13}\n","exit_code":0,"status":"completed"}}
{"type":"item.completed","item":{"id":"item_37","type":"agent_message","text":"RESULT: FAILED\n\nFILES CHANGED:\n- jq_interpreter/parser.py\n- jq_interpreter/evaluator.py\n\nSUMMARY:\nImplemented parser/evaluator fixes for recursive descent, generator indexes, ranges, slices, computed-key validation, paths, bindings, and control precedence. Project tests pass: 32 passed.\n\nScoped acceptance remains failing:\n- parse-003: 331 passed, 123 failed, 1 errored, 9 skipped\n- parse-004: 153 passed, 57 failed, 1 errored, 13 skipped\n\nBLOCKERS:\n- Significant evaluator functionality remains incomplete, including builtins, assignment semantics, function scoping, and advanced control behavior.\n\nFAILURE_SUMMARY: Scoped conformance suites still fail.\nFAILURE_DETAIL: Both authoritative acceptance commands executed successfully but reported nonzero fail/error tallies; further evaluator and builtin implementation is required."}}
{"type":"turn.completed","usage":{"input_tokens":4126446,"cached_input_tokens":4005632,"cache_write_input_tokens":0,"output_tokens":11244,"reasoning_output_tokens":2468}}
Run artifact