{"type":"thread.started","thread_id":"01a02c97-7f2c-7021-b37a-a4bcce6432a1"}
{"type":"turn.started"}
{"type":"item.completed","item":{"id":"item_0","type":"agent_message","text":"I’m inspecting the existing interpreter and its evaluator/AST structure first, then I’ll implement label scope and break propagation within the current design and run the declared scoped conformance check."}}
{"type":"item.started","item":{"id":"item_1","type":"command_execution","command":"/bin/bash -lc \"pwd; rg --files -g '\"'!sources/*'\"' -g '*' | sed -n '1,120p'; rg -n \\\"label|break|reduce|class .*Node|def parse|def eval|Runtime|Error\\\" -g '\"'!sources/*'\"' . | sed -n '1,240p'\"","aggregated_output":"","exit_code":null,"status":"in_progress"}}
{"type":"item.completed","item":{"id":"item_1","type":"command_execution","command":"/bin/bash -lc \"pwd; rg --files -g '\"'!sources/*'\"' -g '*' | sed -n '1,120p'; rg -n \\\"label|break|reduce|class .*Node|def parse|def eval|Runtime|Error\\\" -g '\"'!sources/*'\"' . | sed -n '1,240p'\"","aggregated_output":"/mnt/c/Users/barlo/projects/drydock/uat/jq/runs/20260822.044627/build/jq\njq\ntests/test_flow_003_conditionals_exceptions.py\nsources/jq.test\ntests/test_flow_002_boolean_alternative.py\nsources/jq-manual.txt\ntests/test_flow_001_operators.py\nsources/full_test.sh\ntests/test_core_004_truthiness_comparison.py\nsources/exclusions.txt\ntests/test_core_003_errors.py\nsources/builtin.jq\ntests/test_core_002_composition.py\ntests/test_conf_001_acceptance.py\ntests/test_conformance_assets.py\nsources/parser.y\ntests/test_architecture.py\nsources/lexer.l\ntests/conftest.py\nsources/run_conformance.py\ntests/test_value_001.py\ntests/test_stream_evaluator.py\ntests/test_parse_002.py\ntests/test_lexer.py\ntests/test_json_io.py\ntests/test_value_003_slices_iteration.py\ntests/test_value_002_access.py\ntests/test_value_004.py\njq_interpreter/ast.py\njq_interpreter/interpreter.py\njq_interpreter/diagnostics.py\njq_interpreter/paths.py\njq_interpreter/parser.py\njq_interpreter/lexer.py\njq_interpreter/architecture.py\njq_interpreter/__init__.py\njq_interpreter/runtime.py\njq_interpreter/builtins.py\njq_interpreter/cli.py\njq_interpreter/errors.py\njq_interpreter/evaluator.py\njq_interpreter/__pycache__/cli.cpython-312.pyc\njq_interpreter/__pycache__/cli.cpython-310.pyc\njq_interpreter/__pycache__/builtins.cpython-312.pyc\njq_interpreter/__pycache__/ast.cpython-312.pyc\njq_interpreter/__pycache__/ast.cpython-310.pyc\njq_interpreter/__pycache__/architecture.cpython-312.pyc\njq_interpreter/__pycache__/architecture.cpython-310.pyc\njq_interpreter/__pycache__/lexer.cpython-310.pyc\njq_interpreter/__pycache__/interpreter.cpython-312.pyc\njq_interpreter/__pycache__/interpreter.cpython-310.pyc\njq_interpreter/__pycache__/evaluator.cpython-312.pyc\njq_interpreter/__pycache__/evaluator.cpython-310.pyc\njq_interpreter/__pycache__/errors.cpython-312.pyc\njq_interpreter/__pycache__/errors.cpython-310.pyc\njq_interpreter/__pycache__/diagnostics.cpython-312.pyc\njq_interpreter/__pycache__/diagnostics.cpython-310.pyc\njq_interpreter/__pycache__/paths.cpython-312.pyc\njq_interpreter/__pycache__/paths.cpython-310.pyc\njq_interpreter/__pycache__/parser.cpython-312.pyc\njq_interpreter/__pycache__/parser.cpython-310.pyc\njq_interpreter/__pycache__/lexer.cpython-312.pyc\njq_interpreter/__pycache__/runtime.cpython-312.pyc\njq_interpreter/__pycache__/runtime.cpython-310.pyc\njq_interpreter/__pycache__/__init__.cpython-310.pyc\njq_interpreter/__pycache__/__init__.cpython-312.pyc\nsources/__pycache__/run_conformance.cpython-310.pyc\nsources/__pycache__/run_conformance.cpython-312.pyc\ntests/__pycache__/test_value_004.cpython-310-pytest-9.0.2.pyc\ntests/__pycache__/test_value_003_slices_iteration.cpython-310-pytest-9.0.2.pyc\ntests/__pycache__/test_value_002_access.cpython-312-pytest-9.1.1.pyc\ntests/__pycache__/test_value_002_access.cpython-310-pytest-9.0.2.pyc\ntests/__pycache__/test_value_001.cpython-312-pytest-9.1.1.pyc\ntests/__pycache__/test_value_001.cpython-310-pytest-9.0.2.pyc\ntests/__pycache__/test_stream_evaluator.cpython-312-pytest-9.1.1.pyc\ntests/__pycache__/test_stream_evaluator.cpython-310-pytest-9.0.2.pyc\ntests/__pycache__/test_parse_002.cpython-312-pytest-9.1.1.pyc\ntests/__pycache__/test_parse_002.cpython-310-pytest-9.0.2.pyc\ntests/__pycache__/test_lexer.cpython-312-pytest-9.1.1.pyc\ntests/__pycache__/test_lexer.cpython-310-pytest-9.0.2.pyc\ntests/__pycache__/test_json_io.cpython-312-pytest-9.1.1.pyc\ntests/__pycache__/test_json_io.cpython-310-pytest-9.0.2.pyc\ntests/__pycache__/test_flow_003_conditionals_exceptions.cpython-310-pytest-9.0.2.pyc\ntests/__pycache__/test_flow_002_boolean_alternative.cpython-310-pytest-9.0.2.pyc\ntests/__pycache__/test_flow_001_operators.cpython-310-pytest-9.0.2.pyc\ntests/__pycache__/test_core_004_truthiness_comparison.cpython-312-pytest-9.1.1.pyc\ntests/__pycache__/test_core_004_truthiness_comparison.cpython-310-pytest-9.0.2.pyc\ntests/__pycache__/test_core_003_errors.cpython-312-pytest-9.1.1.pyc\ntests/__pycache__/test_core_003_errors.cpython-310-pytest-9.0.2.pyc\ntests/__pycache__/test_core_002_composition.cpython-312-pytest-9.1.1.pyc\ntests/__pycache__/test_core_002_composition.cpython-310-pytest-9.0.2.pyc\ntests/__pycache__/test_conf_001_acceptance.cpython-312-pytest-9.1.1.pyc\ntests/__pycache__/test_conf_001_acceptance.cpython-310-pytest-9.0.2.pyc\ntests/__pycache__/test_conformance_assets.cpython-312-pytest-9.1.1.pyc\ntests/__pycache__/test_conformance_assets.cpython-310-pytest-9.0.2.pyc\ntests/__pycache__/test_architecture.cpython-312-pytest-9.1.1.pyc\ntests/__pycache__/test_architecture.cpython-310-pytest-9.0.2.pyc\ntests/__pycache__/conftest.cpython-312-pytest-9.1.1.pyc\ntests/__pycache__/conftest.cpython-310-pytest-9.0.2.pyc\n./jq_interpreter/diagnostics.py:6:from .errors import CompileError, RuntimeError\n./jq_interpreter/diagnostics.py:10:def report_compile_error(error: CompileError, stream: TextIO = sys.stderr) -> int:\n./jq_interpreter/diagnostics.py:15:def report_runtime_error(error: RuntimeError, stream: TextIO = sys.stderr) -> int:\n./jq_interpreter/parser.py:6:from .errors import CompileError\n./jq_interpreter/parser.py:28: elif c=='\"': break\n./jq_interpreter/parser.py:29: else: raise CompileError(\"unterminated string\")\n./jq_interpreter/parser.py:39: if not m: raise CompileError(\"invalid binding\")\n./jq_interpreter/parser.py:45: if not m: raise CompileError(\"invalid format\")\n./jq_interpreter/parser.py:48: raise CompileError(\"unexpected character\")\n./jq_interpreter/parser.py:56: if x is not None and v!=x: raise CompileError(f\"expected {x}\")\n./jq_interpreter/parser.py:58: def parse(self):\n./jq_interpreter/parser.py:59: if self.p()==\"<eof>\": raise CompileError(\"empty program\")\n./jq_interpreter/parser.py:62: if self.p()!='<eof>': raise CompileError(\"unexpected token\")\n./jq_interpreter/parser.py:71: if stop_comma and self.p() == ',': break\n./jq_interpreter/parser.py:84: if t in ('try','reduce','foreach','label','break','def','module','import','include'): return self.post(self.control(t))\n./jq_interpreter/parser.py:143: break\n./jq_interpreter/parser.py:174: raise CompileError('object key must be a string')\n./jq_interpreter/parser.py:176: raise CompileError('object key must be a string')\n./jq_interpreter/parser.py:188: if self.p()==']': raise CompileError('empty destructuring pattern')\n./jq_interpreter/parser.py:196: if self.p()=='}': raise CompileError('empty destructuring pattern')\n./jq_interpreter/parser.py:203: raise CompileError('object key must be a string')\n./jq_interpreter/parser.py:216: else: break\n./jq_interpreter/parser.py:218: raise CompileError('expected binding pattern')\n./jq_interpreter/parser.py:240: raise CompileError('module directives are not available')\n./jq_interpreter/parser.py:261: if w in ('reduce','foreach'):\n./jq_interpreter/parser.py:265: if w=='label': name=self.take().lstrip('$'); self.take('|'); return Node('label',(name,self.expr(0)))\n./jq_interpreter/parser.py:266: if w=='break': return Node('break',(self.take().lstrip('$'),))\n./jq_interpreter/parser.py:269:def parse(source: str) -> Filter:\n./jq_interpreter/parser.py:271: if source.strip() == 'not-a-filter': raise CompileError('unknown filter')\n./jq_interpreter/parser.py:272: for label in re.findall(r'\\blabel\\s+\\$([A-Za-z_]\\w*)', source):\n./jq_interpreter/parser.py:274: for name in re.findall(r'\\bbreak\\s+\\$([A-Za-z_]\\w*)', source):\n./jq_interpreter/parser.py:275: if not re.search(r'\\blabel\\s+\\$' + re.escape(name) + r'\\b', source):\n./jq_interpreter/parser.py:276: raise CompileError('break label is not defined')\n./jq_interpreter/parser.py:283: parts.append(json.loads('\"'+stripped[pos:end]+'\"')); break\n./jq_interpreter/parser.py:297: except (IndexError, ValueError) as error:\n./jq_interpreter/parser.py:298: raise CompileError('syntax error') from error\n./jq_interpreter/parser.py:303: raise CompileError('variable $bar is not defined')\n./jq_interpreter/parser.py:306: raise CompileError('unknown filter')\n./jq_interpreter/interpreter.py:23:def parse_input(line: str) -> JsonValue:\n./jq_interpreter/interpreter.py:28:def parse_inputs(text: str) -> Iterator[JsonValue]:\n./jq_interpreter/interpreter.py:42: def parse_integer(text: str) -> int | float:\n./jq_interpreter/errors.py:1:\"\"\"Errors crossing the interpreter's process boundary.\"\"\"\n./jq_interpreter/errors.py:4:class CompileError(Exception):\n./jq_interpreter/errors.py:8:class RuntimeError(Exception):\n./jq_interpreter/errors.py:12:# Runtime failures raised by evaluator helpers must have the same semantics as\n./jq_interpreter/errors.py:17: RuntimeError,\n./jq_interpreter/errors.py:18: ValueError,\n./jq_interpreter/errors.py:19: TypeError,\n./jq_interpreter/errors.py:20: IndexError,\n./jq_interpreter/errors.py:21: ArithmeticError,\n./jq_interpreter/errors.py:22: RecursionError,\n./jq_interpreter/cli.py:10:from .errors import CompileError, FLOW_RUNTIME_ERRORS, RuntimeError\n./jq_interpreter/cli.py:15:# than that and would turn valid jq processing into an uncaught RecursionError\n./jq_interpreter/cli.py:46: except CompileError as error:\n./jq_interpreter/cli.py:52: except FLOW_RUNTIME_ERRORS + (json.JSONDecodeError,) as error:\n./jq_interpreter/cli.py:53: return report_runtime_error(RuntimeError(str(error)))\n./jq_interpreter/__init__.py:3:from .errors import CompileError, RuntimeError\n./jq_interpreter/__init__.py:7:__all__ = [\"CompileError\", \"Interpreter\", \"MODULE_BOUNDARIES\", \"RuntimeError\"]\n./jq_interpreter/evaluator.py:9:from .errors import FLOW_RUNTIME_ERRORS, RuntimeError\n./jq_interpreter/evaluator.py:19:def evaluate(program: Filter, value: JsonValue) -> ValueStream:\n./jq_interpreter/evaluator.py:46: else: raise RuntimeError(\"cannot add values\")\n./jq_interpreter/evaluator.py:69: raise RuntimeError(program.message)\n./jq_interpreter/evaluator.py:79: break\n./jq_interpreter/evaluator.py:81: raise RuntimeError(\"unknown compiled filter\")\n./jq_interpreter/evaluator.py:116: if a[0] not in env: raise RuntimeError(f\"variable ${a[0]} is not defined\")\n./jq_interpreter/evaluator.py:167: raise RuntimeError(f'Cannot slice {_type_name(base)}')\n./jq_interpreter/evaluator.py:190: raise RuntimeError(f\"{_type_name(x)} ({_short(x)}) cannot be negated\")\n./jq_interpreter/evaluator.py:214: elif op == \"label\":\n./jq_interpreter/evaluator.py:215: try: yield from _node(a[1], value, {**env, '__label__': a[0]})\n./jq_interpreter/evaluator.py:218: elif op == \"break\":\n./jq_interpreter/evaluator.py:220: elif op in (\"reduce\", \"foreach\"):\n./jq_interpreter/evaluator.py:261: if op==\"reduce\": yield from currents\n./jq_interpreter/evaluator.py:282: elif op == \"unsupported\": raise RuntimeError(\"unsupported syntax\")\n./jq_interpreter/evaluator.py:375: raise RuntimeError(f\"Cannot iterate over {_type_name(value)} ({_stringify(value)})\")\n./jq_interpreter/evaluator.py:383: raise RuntimeError(f'Cannot index object with {_type_name(k)} ({_short(k)})')\n./jq_interpreter/evaluator.py:389: raise RuntimeError(f'Cannot index array with string ({json.dumps(k)})')\n./jq_interpreter/evaluator.py:394: raise RuntimeError(f'Cannot index string with number ({_short(k)})')\n./jq_interpreter/evaluator.py:397: raise RuntimeError(f'Cannot index {_type_name(v)} with {_type_name(k)} ({json.dumps(k)})')\n./jq_interpreter/evaluator.py:405: except RuntimeError: candidates = []\n./jq_interpreter/evaluator.py:430: raise RuntimeError(f'Invalid path expression with result {_stringify(produced[0])}')\n./jq_interpreter/evaluator.py:431: raise RuntimeError('Invalid path expression')\n./jq_interpreter/evaluator.py:481: else: raise RuntimeError(f\"{_type_name(x)} ({_short(x)}) and {_type_name(y)} ({_short(y)}) cannot be added\")\n./jq_interpreter/evaluator.py:487: raise RuntimeError(f\"{_type_name(x)} ({_short(x)}) and {_type_name(y)} ({_short(y)}) cannot be subtracted\")\n./jq_interpreter/evaluator.py:495: raise RuntimeError('Repeat string result too long')\n./jq_interpreter/evaluator.py:502: raise RuntimeError('Repeat string result too long')\n./jq_interpreter/evaluator.py:509: raise RuntimeError(f\"number ({_short(x)}) and number ({_short(y)}) cannot be divided because the divisor is zero\")\n./jq_interpreter/evaluator.py:515: raise RuntimeError(f\"number ({_short(x)}) and number ({_short(y)}) cannot be divided (remainder) because the divisor is zero\")\n./jq_interpreter/evaluator.py:562: if right == 0: raise RuntimeError('division by zero')\n./jq_interpreter/evaluator.py:566: if right == 0: raise RuntimeError('division by zero')\n./jq_interpreter/evaluator.py:568: raise RuntimeError(f\"{_type_name(left)} ({_short(left)}) and {_type_name(right)} ({_short(right)}) cannot be used with {op}\")\n./jq_interpreter/evaluator.py:576: raise RuntimeError(f\"{_type_name(left)} ({_short(left)}) and {_type_name(right)} ({_short(right)}) must be numbers\")\n./jq_interpreter/evaluator.py:586: if depth > 10000: raise RuntimeError('Object merge too deep')\n./jq_interpreter/evaluator.py:591: if level > 10000: raise RuntimeError('Object merge too deep')\n./jq_interpreter/evaluator.py:608: raise RuntimeError('Equality check too deep')\n./jq_interpreter/evaluator.py:651: raise RuntimeError('unsupported value in comparison')\n./jq_interpreter/evaluator.py:661: raise RuntimeError('Comparison too deep')\n./jq_interpreter/evaluator.py:718: raise RuntimeError('Containment check too deep')\n./jq_interpreter/evaluator.py:735: except RecursionError as error:\n./jq_interpreter/evaluator.py:736: raise RuntimeError('Containment check too deep') from error\n./jq_interpreter/evaluator.py:797: raise RuntimeError('Exceeds depth limit for parsing')\n./jq_interpreter/evaluator.py:799: except RecursionError:\n./jq_interpreter/evaluator.py:839: raise RuntimeError('Cannot set array element at NaN index')\n./jq_interpreter/evaluator.py:841: raise RuntimeError(f'Cannot index object with {_type_name(key)} ({_short(key)})')\n./jq_interpreter/evaluator.py:843: raise RuntimeError('Array index too large')\n./jq_interpreter/evaluator.py:845: if int(key) < 0 and abs(int(key)) > len(current): raise RuntimeError('Out of bounds negative array index')\n./jq_interpreter/evaluator.py:846: if int(key) >= 10000000: raise RuntimeError('Array index too large')\n./jq_interpreter/evaluator.py:848: raise RuntimeError('Out of bounds negative array index')\n./jq_interpreter/evaluator.py:874: raise RuntimeError(f'Invalid path expression near attempt to iterate through {_stringify(produced[0])}')\n./jq_interpreter/evaluator.py:922: raise RuntimeError('Cannot update string slices')\n./jq_interpreter/evaluator.py:932: raise RuntimeError(message)\n./jq_interpreter/evaluator.py:934: raise RuntimeError(f'Cannot index object with {_type_name(key)} ({_short(key)})')\n./jq_interpreter/evaluator.py:956: raise RuntimeError(f'Cannot index {_type_name(current)} with {_type_name(key)} ({_short(key)})')\n./jq_interpreter/evaluator.py:966: if isinstance(key, list): raise RuntimeError('Cannot update field at array index of array')\n./jq_interpreter/evaluator.py:968: else: break\n./jq_interpreter/evaluator.py:977: raise RuntimeError(f'Cannot index object with {_type_name(key)} ({_short(key)})')\n./jq_interpreter/evaluator.py:981: raise RuntimeError('Cannot set array element at NaN index')\n./jq_interpreter/evaluator.py:983: raise RuntimeError('Cannot update field at array index of array')\n./jq_interpreter/evaluator.py:1055: if name == 'error': raise RuntimeError(_one(args[0],value,env) if args else value)\n./jq_interpreter/evaluator.py:1059: else: raise RuntimeError('length requires a string, array, object or number')\n./jq_interpreter/evaluator.py:1073: else: raise RuntimeError('cannot add values')\n./jq_interpreter/evaluator.py:1108: break\n./jq_interpreter/evaluator.py:1112: # min_by/max_by receive a key filter, but always reduce the current\n./jq_interpreter/evaluator.py:1167: raise RuntimeError('map_values requires an array or object')\n./jq_interpreter/evaluator.py:1169: if not isinstance(value, dict): raise RuntimeError('with_entries requires an object')\n./jq_interpreter/evaluator.py:1198: else: raise RuntimeError('cannot reverse value')\n./jq_interpreter/evaluator.py:1202: if depth is not None and depth < 0: raise RuntimeError('flatten depth must not be negative')\n./jq_interpreter/evaluator.py:1203: if not isinstance(value, list): raise RuntimeError('flatten input must be an array')\n./jq_interpreter/evaluator.py:1232: break\n./jq_interpreter/evaluator.py:1235: break\n./jq_interpreter/evaluator.py:1237: if not outputs: break\n./jq_interpreter/evaluator.py:1247: raise RuntimeError(\"nth doesn't support negative indices\")\n./jq_interpreter/evaluator.py:1259: break\n./jq_interpreter/evaluator.py:1265: raise RuntimeError('break')\n./jq_interpreter/evaluator.py:1268: raise RuntimeError(f'{name}/1 requires a string format')\n./jq_interpreter/evaluator.py:1277: raise RuntimeError(f'{name}/1 requires parsed datetime inputs')\n./jq_interpreter/evaluator.py:1280: raise RuntimeError(f'{name}/1 requires a string format')\n./jq_interpreter/evaluator.py:1285: raise RuntimeError('mktime requires parsed datetime inputs')\n./jq_interpreter/evaluator.py:1291: raise RuntimeError('strptime/1 requires a string format')\n./jq_interpreter/evaluator.py:1297: if isinstance(value, str): raise RuntimeError('number (123) is not a string')\n./jq_interpreter/evaluator.py:1298: raise RuntimeError(f'{_type_name(value)} ({_stringify(value)}) cannot be searched, as it is not a string')\n./jq_interpreter/evaluator.py:1300: if not isinstance(value, list): raise RuntimeError(f'{_type_name(value)} ({_short(value)}) cannot be searched from')\n./jq_interpreter/evaluator.py:1332: raise RuntimeError('JOIN requires an object and a filter')\n./jq_interpreter/evaluator.py:1337: raise RuntimeError('INDEX requires two arguments')\n./jq_interpreter/evaluator.py:1352: raise ValueError('not a jq number')\n./jq_interpreter/evaluator.py:1354: except Exception: raise RuntimeError(f'string ({json.dumps(value)}) cannot be parsed as a number')\n./jq_interpreter/evaluator.py:1355: else: raise RuntimeError('cannot parse number')\n./jq_interpreter/evaluator.py:1360: else: raise RuntimeError(f'{_type_name(value)} ({_stringify(value) if not isinstance(value, str) else json.dumps(value)}) cannot be parsed as a boolean')\n./jq_interpreter/evaluator.py:1363: if not isinstance(value, str): raise RuntimeError(f'{_type_name(value)} ({_stringify(value)}) only strings have UTF-8 byte length')\n./jq_interpreter/evaluator.py:1366: if not isinstance(value, str): raise RuntimeError('only strings can be parsed')\n./jq_interpreter/evaluator.py:1368: raise RuntimeError(\"Invalid string literal; expected \\\", but got ' at line 1, column 5 (while parsing '{'a': 123}')\")\n./jq_interpreter/evaluator.py:1373: raise RuntimeError(f\"Invalid numeric literal at EOF at line 1, column {len(value)} (while parsing '{value}')\")\n./jq_interpreter/evaluator.py:1375: except RuntimeError: raise\n./jq_interpreter/evaluator.py:1376: except Exception: raise RuntimeError('invalid JSON')\n./jq_interpreter/evaluator.py:1402: raise RuntimeError(f'Invalid path expression with result {shown}')\n./jq_interpreter/evaluator.py:1404: raise RuntimeError(f'Invalid path expression near attempt to iterate through {shown}')\n./jq_interpreter/evaluator.py:1408: raise RuntimeError(f'Invalid path expression near attempt to access element {_stringify(key_value)} of {shown}')\n./jq_interpreter/evaluator.py:1410: raise RuntimeError(f'Invalid path expression near attempt to access element {json.dumps(tail.arguments[0])} of {shown}')\n./jq_interpreter/evaluator.py:1411: raise RuntimeError(f'Invalid path expression with result {shown}')\n./jq_interpreter/evaluator.py:1414: raise RuntimeError('Invalid path expression')\n./jq_interpreter/evaluator.py:1419: if not paths: raise RuntimeError('Invalid path expression')\n./jq_interpreter/evaluator.py:1421: raise RuntimeError('Out of bounds negative array index')\n./jq_interpreter/evaluator.py:1444: if position < 0: break\n./jq_interpreter/evaluator.py:1462: raise RuntimeError('cannot search value')\n./jq_interpreter/evaluator.py:1476: else: raise RuntimeError('keys requires object or array')\n./jq_interpreter/evaluator.py:1480: if not isinstance(path, list): raise RuntimeError('Paths must be specified as an array')\n./jq_interpreter/evaluator.py:1481: if len(path) > 10000: raise RuntimeError('Path too deep')\n./jq_interpreter/evaluator.py:1485: if not isinstance(path, list): raise RuntimeError('Paths must be specified as an array')\n./jq_interpreter/evaluator.py:1486: if len(path) > 10000: raise RuntimeError('Path too deep')\n./jq_interpreter/evaluator.py:1490: if not isinstance(paths, list): raise RuntimeError('Paths must be specified as an array')\n./jq_interpreter/evaluator.py:1492: raise RuntimeError('Path too deep')\n./jq_interpreter/evaluator.py:1502: except RuntimeError:\n./jq_interpreter/evaluator.py:1533: except ValueError: yield None\n./jq_interpreter/evaluator.py:1534: else: raise RuntimeError('cannot search value')\n./jq_interpreter/evaluator.py:1565: if not isinstance(value, list): raise RuntimeError('implode input must be an array')\n./jq_interpreter/evaluator.py:1570: raise RuntimeError(f'{_type_name(item)} ({shown}) can\\'t be imploded, unicode codepoint needs to be numeric')\n./jq_interpreter/evaluator.py:1572: raise RuntimeError('number (null) can\\'t be imploded, unicode codepoint needs to be numeric')\n./jq_interpreter/evaluator.py:1576: if not isinstance(value, str): raise RuntimeError('explode input must be a string')\n./jq_interpreter/evaluator.py:1582: if count < 0: raise RuntimeError(\"limit doesn't support negative count\")\n./jq_interpreter/evaluator.py:1586: if count == 0: break\n./jq_interpreter/evaluator.py:1592: if count < 0: raise RuntimeError(\"skip doesn't support negative count\")\n./jq_interpreter/evaluator.py:1599: if not isinstance(value, list): raise RuntimeError('cannot join value')\n./jq_interpreter/evaluator.py:1606: raise RuntimeError(f'{_type_name(prefix)} ({json.dumps(prefix)}) and {_type_name(item)} ({_stringify(item)}) cannot be added')\n./jq_interpreter/evaluator.py:1624: if function is None: raise RuntimeError(f'{name} is not available')\n./jq_interpreter/evaluator.py:1644: if function is None: raise RuntimeError(f'{name} is not available')\n./jq_interpreter/evaluator.py:1650: if function is None: raise RuntimeError('fma is not available')\n./jq_interpreter/evaluator.py:1663: raise RuntimeError(('startswith()' if name == 'ltrimstr' else 'endswith()') + ' requires string inputs')\n./jq_interpreter/evaluator.py:1673: if not isinstance(value, str): raise RuntimeError('trim input must be a string')\n./jq_interpreter/evaluator.py:1681: raise RuntimeError('cannot sort value')\n./jq_interpreter/evaluator.py:1688: if not isinstance(value, list): raise RuntimeError('cannot sort value')\n./jq_interpreter/evaluator.py:1701: raise RuntimeError(f\"unknown function {name}\")\n./jq_interpreter/evaluator.py:1706: if depth > 1000: raise RuntimeError('Comparison too deep')\n./jq_interpreter/evaluator.py:1729: if mark<0: out+=json.loads('\"'+inner[pos:]+'\"'); break\n./jq_interpreter/evaluator.py:1752: break\n./jq_interpreter/evaluator.py:1753: except UnicodeDecodeError:\n./jq_interpreter/evaluator.py:1775: raise RuntimeError(f'{name} is not available')\n./jq_interpreter/evaluator.py:1798: raise RuntimeError(f\"unknown format @{name}\")\n./jq_interpreter/ast.py:77:class Node(Filter):\n./jq_interpreter/runtime.py:1:\"\"\"Runtime value and stream contracts.\"\"\"\n./tests/test_architecture.py:9:from jq_interpreter import CompileError, Interpreter, MODULE_BOUNDARIES\n./tests/test_architecture.py:66: with self.assertRaises(CompileError):\n./jq_interpreter/lexer.py:7:from .errors import CompileError\n./jq_interpreter/lexer.py:33:_KEYWORDS = {\"as\", \"def\", \"module\", \"import\", \"include\", \"if\", \"then\", \"else\", \"elif\", \"and\", \"or\", \"end\", \"reduce\", \"foreach\", \"try\", \"catch\", \"label\", \"break\"}\n./jq_interpreter/lexer.py:41:def _error(source: str, position: int, message: str) -> CompileError:\n./jq_interpreter/lexer.py:44: return CompileError(f\"{message} at line {line}, column {position - line_start + 1}\")\n./jq_interpreter/lexer.py:86: break\n./tests/test_parse_002.py:7:from jq_interpreter.errors import CompileError\n./tests/test_parse_002.py:51: with pytest.raises(CompileError):\n./tests/test_lexer.py:3:from jq_interpreter.errors import CompileError\n./tests/test_lexer.py:36: with pytest.raises(CompileError):\n","exit_code":0,"status":"completed"}}
{"type":"item.started","item":{"id":"item_2","type":"command_execution","command":"/bin/bash -lc \"sed -n '1,340p' jq_interpreter/parser.py; sed -n '1,310p' jq_interpreter/evaluator.py; sed -n '1,120p' jq_interpreter/errors.py; sed -n '1,120p' tests/test_conf_001_acceptance.py; sed -n '1,120p' tests/conftest.py\"","aggregated_output":"","exit_code":null,"status":"in_progress"}}
{"type":"item.completed","item":{"id":"item_2","type":"command_execution","command":"/bin/bash -lc \"sed -n '1,340p' jq_interpreter/parser.py; sed -n '1,310p' jq_interpreter/evaluator.py; sed -n '1,120p' jq_interpreter/errors.py; sed -n '1,120p' tests/test_conf_001_acceptance.py; sed -n '1,120p' tests/conftest.py\"","aggregated_output":"\"\"\"Precedence-aware jq expression parser.\"\"\"\nimport json\nimport re\nfrom dataclasses import dataclass\nfrom .ast import Filter, Node, StringTemplate, Format\nfrom .errors import CompileError\nfrom .lexer import tokenize\n\n@dataclass(frozen=True)\nclass T: text: str\nOPS=(\"//=\",\"?//\",\"!=\",\"==\",\"|=\",\"+=\",\"-=\",\"*=\",\"/=\",\"%=\",\"<=\",\">=\",\"..\",\"//\")\n# jq's query grammar gives the pipe lower precedence than comma. This is\n# significant for ``a | b, c``: it means ``a | (b, c)`` and keeps the input\n# stream attached to both branches. The parser's numeric levels increase\n# with binding strength.\nPREC={\"|\":1,\",\":2,\"=\":3,\"|=\":3,\"+=\":3,\"-=\":3,\"*=\":3,\"/=\":3,\"%=\":3,\"//=\":3,\"//\":4,\"or\":5,\"and\":6,\"==\":7,\"!=\":7,\"<\":7,\">\":7,\"<=\":7,\">=\":7,\"+\":8,\"-\":8,\"*\":9,\"/\":9,\"%\":9}\n\ndef lex(s: str) -> list[T]:\n s=re.sub(r\"#[^\\n]*\",\"\",s); out=[]; i=0\n while i<len(s):\n if s[i].isspace(): i+=1; continue\n if s[i]=='\"':\n a=i; i+=1; esc=False\n while i<len(s):\n c=s[i]; i+=1\n if esc: esc=False\n elif c=='\\\\': esc=True\n elif c=='\"': break\n else: raise CompileError(\"unterminated string\")\n out.append(T(s[a:i])); continue\n op=next((x for x in OPS if s.startswith(x,i)),None)\n if op: out.append(T(op)); i+=len(op); continue\n m=re.match(r\"(?:[0-9]+(?:\\.[0-9]*)?|\\.[0-9]+)(?:[eE][+-]?[0-9]+)?\",s[i:])\n if m: out.append(T(m.group())); i+=len(m.group()); continue\n m=re.match(r\"(?:[A-Za-z_][A-Za-z_0-9]*::)*[A-Za-z_][A-Za-z_0-9]*\",s[i:])\n if m: out.append(T(m.group())); i+=len(m.group()); continue\n if s[i]=='$':\n m=re.match(r\"\\$[A-Za-z_][A-Za-z_0-9]*(?:::[A-Za-z_][A-Za-z_0-9]*)*\",s[i:])\n if not m: raise CompileError(\"invalid binding\")\n out.append(T(m.group())); i+=len(m.group()); continue\n if s[i]=='.' and i+1<len(s) and re.match(r\"[A-Za-z_]\",s[i+1]):\n m=re.match(r\"\\.[A-Za-z_][A-Za-z_0-9]*\",s[i:]); out.append(T(m.group())); i+=len(m.group()); continue\n if s[i]=='@':\n m=re.match(r\"@[A-Za-z_][A-Za-z_0-9]*\",s[i:])\n if not m: raise CompileError(\"invalid format\")\n out.append(T(m.group())); i+=len(m.group()); continue\n if s[i] in \".?=;,:|+-*/%$<>()[]{}\": out.append(T(s[i])); i+=1; continue\n raise CompileError(\"unexpected character\")\n out.append(T(\"<eof>\")); return out\n\nclass Parser:\n def __init__(self,s:str): self.t=lex(s); self.i=0\n def p(self): return self.t[self.i].text\n def take(self,x=None):\n v=self.p()\n if x is not None and v!=x: raise CompileError(f\"expected {x}\")\n self.i+=1; return v\n def parse(self):\n if self.p()==\"<eof>\": raise CompileError(\"empty program\")\n x=self.expr(0)\n while self.p()==';': self.take()\n if self.p()!='<eof>': raise CompileError(\"unexpected token\")\n return x\n def expr(self,n, stop_comma=False):\n x=self.prefix()\n # Binding is a query construct, below all ordinary operators.\n if self.p()=='as' and n <= 2:\n self.take('as'); pattern=self.pattern(); self.take('|')\n return Node('bind',(x,pattern,self.expr(0)))\n while (self.p() in PREC or self.p() in ('and','or')) and PREC.get(self.p(), 0)>=n:\n if stop_comma and self.p() == ',': break\n op=self.take(); q=PREC[op]; x=Node(\"binary\",(op,x,self.expr(q if op in (\"=\",\"|=\",\"+=\",\"-=\",\"*=\",\"/=\",\"%=\",\"//=\") else q+1, stop_comma)))\n if self.p()=='as' and n <= 2:\n self.take('as'); pattern=self.pattern(); self.take('|')\n return Node('bind',(x,pattern,self.expr(0)))\n return x\n def prefix(self):\n t=self.p()\n if t=='-':\n # Unary minus binds to the complete postfix term. In particular\n # ``-.?`` is try-able arithmetic, not an optional identity.\n self.take(); return Node('unary',('-',self.prefix()))\n if t=='if': return self.post(self.if_expr())\n if t in ('try','reduce','foreach','label','break','def','module','import','include'): return self.post(self.control(t))\n if t=='(': self.take(); x=self.expr(0); self.take(')'); return self.post(x)\n if t=='[':\n self.take()\n if self.p()==']': x=Node('array',(None,))\n else:\n # Commas delimit array elements here; query commas inside an\n # element remain available through parentheses.\n parts=[self.expr(1, True)]\n while self.p()==',': self.take(); parts.append(self.expr(1, True))\n combined=parts[0]\n for part in parts[1:]: combined=Node('binary',(',',combined,part))\n # In an array, a trailing pipe belongs to the complete comma\n # query (`[a,b | f]` is `[(a,b) | f]`).\n if (combined.operation == 'binary' and combined.arguments[0] == ','\n and combined.arguments[2].operation == 'binary'\n and combined.arguments[2].arguments[0] == '|'\n and combined.arguments[2].arguments[1].operation in ('unary', 'literal', 'binary')):\n tail = combined.arguments[2]\n combined = Node('binary', ('|', Node('binary', (',', combined.arguments[1], tail.arguments[1])), tail.arguments[2]))\n x=Node('array',(combined,))\n self.take(']'); return self.post(x)\n if t=='{': return self.object()\n if t=='.': self.take(); return self.post(Node('identity'))\n if t=='..': self.take(); return self.post(Node('recurse'))\n if t.startswith('.'): self.take(); return self.post(Node('field',(t[1:],)))\n if t.startswith('$'): self.take(); return self.post(Node('var',(t[1:],)))\n if t.startswith('\"'): self.take(); return self.post(Node('string',(t,)))\n if t.startswith('@'): self.take(); return self.post(Node('format',(t[1:],)))\n self.take()\n if t in ('true','false','null','nan','infinite','-infinite','-nan') or re.fullmatch(r'(?:[0-9]+(?:\\.[0-9]*)?|\\.[0-9]+)(?:[eE][+-]?[0-9]+)?',t): return self.post(Node('literal',(t,)))\n return self.post(Node('call',(t,())))\n def post(self,x):\n while True:\n if self.p().startswith('\"') and isinstance(x,Node) and x.operation=='format':\n x=Node('format_template',(x.arguments[0],self.take())); continue\n if self.p().startswith('\"'):\n x=Node('indexexpr',(x,Node('string',(self.take(),)))); continue\n if self.p()=='?': self.take(); x=Node('optional',(x,)); continue\n if self.p().startswith('.') and len(self.p())>1: x=Node('index',(x,self.take()[1:],False)); continue\n if self.p()=='.' and self.t[self.i+1].text.startswith('\"'):\n self.take('.'); x=Node('indexexpr',(x,Node('string',(self.take(),)))); continue\n if self.p()=='.' and self.t[self.i+1].text=='[':\n self.take('.'); continue\n if self.p()=='[':\n self.take()\n if self.p()==']': self.take(); x=Node('iterate',(x,)); continue\n a = Node('literal', ('null',)) if self.p()==':' else self.expr(0)\n if self.p()==':': self.take(); b=None if self.p()==']' else self.expr(0); self.take(']'); x=Node('slice',(x,a,b))\n else: self.take(']'); x=Node('indexexpr',(x,a))\n continue\n if self.p()=='(' and isinstance(x,Node) and x.operation=='call':\n name=x.arguments[0]; self.take(); args=[]\n if self.p()!=')':\n args.append(self.expr(1))\n # jq's grammar uses semicolons for filter arguments. The\n # corpus also exercises the permissive comma spelling.\n while self.p()==';': self.take(); args.append(self.expr(1))\n self.take(')'); x=Node('call',(name,tuple(args))); continue\n break\n return x\n def object(self):\n self.take('{'); pairs=[]\n while self.p()!='}':\n if self.p()=='(':\n self.take('('); key=self.expr(0); self.take(')')\n else:\n k=self.take()\n if k.startswith('\"'):\n key=Node('string',(k,))\n elif k.startswith('$'):\n key=Node('var',(k[1:],))\n else:\n key=Node('string',(json.dumps(k.lstrip('$').lstrip('.')),))\n if self.p()==':': self.take(); v=self.expr(1, True)\n else:\n # `{name}` and `{$name}` abbreviate an access using the key.\n if k.startswith('\"'):\n # The key itself may be an interpolated jq string; keep\n # it as a filter so decoding happens at evaluation time.\n raw = None\n v = Node('indexexpr',(Node('identity'), key))\n else:\n raw = k.lstrip('$').lstrip('.')\n if k.startswith('$'):\n key = Node('string',(json.dumps(raw),))\n v=Node('var',(raw,))\n elif not k.startswith('\"'):\n v=Node('index',(Node('identity'),raw,False))\n if key.operation == 'literal':\n raise CompileError('object key must be a string')\n if key.operation == 'literal':\n raise CompileError('object key must be a string')\n pairs.append((key,v))\n if self.p()!= '}': self.take(',')\n self.take('}'); return Node('object',(tuple(pairs),))\n\n def pattern(self):\n t=self.p()\n if t.startswith('$'):\n result=Node('pattern_var',(self.take()[1:],))\n return self._pattern_alt(result)\n if t=='[':\n self.take()\n if self.p()==']': raise CompileError('empty destructuring pattern')\n items=[]\n if self.p()!=']':\n items.append(self.pattern())\n while self.p()==',': self.take(); items.append(self.pattern())\n self.take(']'); return self._pattern_alt(Node('pattern_array',(tuple(items),)))\n if t=='{':\n self.take()\n if self.p()=='}': raise CompileError('empty destructuring pattern')\n items=[]\n if self.p()!='}':\n while True:\n if self.p() == '(':\n self.take('('); key_node = self.expr(0); self.take(')')\n if key_node.operation == 'literal':\n raise CompileError('object key must be a string')\n key = '<computed>'\n else:\n key=self.take(); key_node = None\n if key.startswith('\"'): key = json.loads(key)\n if self.p()==':':\n self.take(); pat=self.pattern()\n if key.startswith('$'):\n pat = Node('pattern_bind',(key[1:],pat))\n elif key.startswith('$'): pat=Node('pattern_var',(key[1:],))\n else: pat=Node('pattern_var',(key,))\n items.append((key_node if key_node is not None else key.lstrip('$'),pat))\n if self.p()!='}': self.take(',')\n else: break\n self.take('}'); return self._pattern_alt(Node('pattern_object',(tuple(items),)))\n raise CompileError('expected binding pattern')\n\n def _pattern_alt(self, result):\n if self.p()=='?//':\n self.take('?//'); return Node('pattern_alt',(result,self.pattern()))\n return result\n def if_expr(self):\n self.take('if'); c=self.expr(0); self.take('then'); a=self.expr(0); b=Node('literal',('null',))\n if self.p()=='else': self.take(); b=self.expr(0); self.take('end')\n elif self.p()=='elif':\n b=self._elif_expr()\n else: self.take('end'); b=Node('identity')\n return Node('if',(c,a,b))\n def _elif_expr(self):\n self.take('elif'); c=self.expr(0); self.take('then'); a=self.expr(0)\n if self.p()=='elif': b=self._elif_expr()\n elif self.p()=='else': self.take(); b=self.expr(0); self.take('end')\n else: self.take('end'); b=Node('identity')\n return Node('if',(c,a,b))\n def control(self,w):\n self.take(w)\n if w in ('module', 'import', 'include'):\n raise CompileError('module directives are not available')\n if w=='try':\n # In object values the following comma belongs to the object,\n # while the try/catch body still admits the full query pipe.\n # `try` binds more tightly than defined-or and comma. Its\n # optional catch clause is consequently visible to this control\n # production rather than being swallowed by the protected query.\n a=self.expr(10, True); b=None\n if self.p()=='catch': self.take(); b=self.expr(10, True)\n return Node('try',(a,b))\n if w=='def':\n name=self.take(); ps=[]\n if self.p()=='(': self.take();\n while self.p() not in (')',':'):\n ps.append(self.take().lstrip('$'))\n if self.p()==';': self.take()\n if ps: self.take(')')\n self.take(':'); b=self.expr(0); self.take(';')\n definition=Node('def',(name,tuple(ps),b))\n if self.p()!='<eof>': return Node('defprog',(definition,self.expr(0)))\n return definition\n if w in ('reduce','foreach'):\n src=self.expr(3); self.take('as'); pat=self.pattern(); self.take('('); init=self.expr(0); self.take(';'); upd=self.expr(2); ext=None\n if self.p()==';': self.take(); ext=self.expr(2)\n self.take(')'); return Node(w,(src,pat,init,upd,ext))\n if w=='label': name=self.take().lstrip('$'); self.take('|'); return Node('label',(name,self.expr(0)))\n if w=='break': return Node('break',(self.take().lstrip('$'),))\n return Node('unsupported',(w,))\n\ndef parse(source: str) -> Filter:\n tokenize(source)\n if source.strip() == 'not-a-filter': raise CompileError('unknown filter')\n for label in re.findall(r'\\blabel\\s+\\$([A-Za-z_]\\w*)', source):\n pass\n for name in re.findall(r'\\bbreak\\s+\\$([A-Za-z_]\\w*)', source):\n if not re.search(r'\\blabel\\s+\\$' + re.escape(name) + r'\\b', source):\n raise CompileError('break label is not defined')\n stripped=source.strip()\n if stripped.startswith('\"') and '\\\\(' in stripped:\n parts=[]; pos=1; end=len(stripped)-1\n while pos<end:\n mark=stripped.find('\\\\(',pos)\n if mark<0:\n parts.append(json.loads('\"'+stripped[pos:end]+'\"')); break\n if mark>pos: parts.append(json.loads('\"'+stripped[pos:mark]+'\"'))\n depth=1; cursor=mark+2\n while depth and cursor<end:\n if stripped[cursor]=='(': depth+=1\n elif stripped[cursor]==')': depth-=1\n cursor+=1\n parts.append(parse(stripped[mark+2:cursor-1])); pos=cursor\n return StringTemplate(tuple(parts))\n if stripped.startswith('@') and ' \"' in stripped:\n name, template=stripped.split(None,1); inner=parse(template)\n return Format(name[1:], inner if isinstance(inner,StringTemplate) else StringTemplate((inner,)))\n try:\n result=Parser(source).parse()\n except (IndexError, ValueError) as error:\n raise CompileError('syntax error') from error\n # Bare calls are valid jq builtins as well as user definitions supplied by\n # the builtin library. Retain compile-time rejection for an unknown bare\n # identifier while registering the standard library's zero-argument names.\n if '$bar' in source and not re.search(r'\\bas\\s+\\$bar\\b', source):\n raise CompileError('variable $bar is not defined')\n known = set('empty error length type utf8bytelength not tonumber toboolean tostring tojson abs fabs floor ceil round trunc sin cos tan asin acos atan sinh cosh tanh asinh acosh atanh log log10 log1p log2 logb exp exp2 exp10 expm1 pow cbrt gamma lgamma tgamma erf erfc j0 j1 y0 y1 atan2 copysign drem fdim fmax fmin fmod frexp hypot jn ldexp modf nextafter nexttoward remainder scalb scalbln yn fma infinite nan isinfinite isnan isfinite isnormal keys sort add min max min_by max_by any all arrays objects iterables booleans numbers normals finites strings nulls values scalars unique reverse paths path indices builtins modulemeta input debug implode explode trim ltrim rtrim isempty have_decnum gmtime'.split())\n if isinstance(result, Node) and result.operation == 'call' and not result.arguments[1] and result.arguments[0] not in known:\n raise CompileError('unknown filter')\n return result\n\"\"\"Ordered generator evaluator boundary.\"\"\"\nimport json\nimport math\nimport datetime\nimport itertools\nimport sys\n\nfrom .ast import Add, Array, Comma, Filter, Format, Identity, Iterate, Literal, Limit, Node, Pipe, Raise, StringTemplate\nfrom .errors import FLOW_RUNTIME_ERRORS, RuntimeError\nfrom .runtime import JsonValue, ValueStream, identity_stream\n\n\nclass _OverflowFloat(float):\n \"\"\"A parsed exponent overflow that jq still emits as a JSON number.\"\"\"\n\n pass\n\n\ndef evaluate(program: Filter, value: JsonValue) -> ValueStream:\n \"\"\"Evaluate one input as an ordered stream of output values.\"\"\"\n if isinstance(program, Node):\n yield from _node(program, value, {})\n return\n if isinstance(program, Identity):\n yield from identity_stream(value)\n return\n if isinstance(program, Iterate):\n yield from _iter_values(value)\n return\n if isinstance(program, Literal):\n yield program.value\n return\n if isinstance(program, Pipe):\n for intermediate in evaluate(program.left, value): yield from evaluate(program.right, intermediate)\n return\n if isinstance(program, Add):\n left = list(evaluate(program.left, value))\n right = list(evaluate(program.right, value))\n for first in left:\n for second in right:\n if isinstance(first, (int, float)) and isinstance(second, (int, float)):\n yield first + second\n elif isinstance(first, str) and isinstance(second, str): yield first + second\n elif first is None: yield second\n elif second is None: yield first\n else: raise RuntimeError(\"cannot add values\")\n return\n if isinstance(program, StringTemplate):\n pieces: list[str] = []\n for part in program.parts:\n pieces.append(part if isinstance(part, str) else \"\".join(_stringify(x) for x in evaluate(part, value)))\n yield \"\".join(pieces)\n return\n if isinstance(program, Format):\n if program.template is None: yield _apply_format(program.name, value)\n else:\n pieces: list[str] = []\n for part in program.template.parts:\n if isinstance(part, str): pieces.append(part)\n else:\n pieces.extend(_apply_format(program.name, item) for item in evaluate(part, value))\n yield \"\".join(pieces)\n return\n if isinstance(program, Comma):\n yield from evaluate(program.left, value)\n yield from evaluate(program.right, value)\n return\n if isinstance(program, Raise):\n raise RuntimeError(program.message)\n if isinstance(program, Array):\n yield list(evaluate(program.expression, value))\n return\n if isinstance(program, Limit):\n outputs = iter(evaluate(program.expression, value))\n for _ in range(program.count):\n try:\n yield next(outputs)\n except StopIteration:\n break\n return\n raise RuntimeError(\"unknown compiled filter\")\n\ndef _node(node: Node, value: object, env: dict[str, object]) -> ValueStream:\n op, a = node.operation, node.arguments\n if op == \"identity\": yield value\n elif op == \"literal\":\n text=a[0]; special={\"true\":True,\"false\":False,\"null\":None,\"nan\":float(\"nan\"),\"infinite\":float(\"inf\"),\"-infinite\":float(\"-inf\"),\"-nan\":float(\"nan\")}\n if text in special:\n yield special[text]\n else:\n parsed = json.loads(text)\n if isinstance(parsed, int) and abs(parsed) > 2**53:\n parsed = float(parsed)\n if isinstance(parsed, float) and math.isinf(parsed):\n parsed = _OverflowFloat(parsed)\n yield parsed\n elif op == \"string\": yield _decode_string(a[0], value, env)\n elif op == \"format\": yield _apply_format(a[0], value)\n elif op == \"format_template\":\n # Interpolation is evaluated first; the formatter consumes the\n # resulting string (not the original input value).\n yield _apply_format(a[0], _decode_string(a[1], value, env))\n elif op == \"var\":\n if a[0] == '__loc__':\n yield {'file': '<top-level>', 'line': 1}\n return\n if a[0] in env and not isinstance(env[a[0]], tuple):\n bound = env[a[0]]\n if isinstance(bound, Node): yield from _node(bound, value, env)\n else: yield bound\n return\n if a[0] in env.get('__params__', {}):\n captured, argument = env['__params__'][a[0]]\n yield from _node(argument, value, captured)\n return\n if a[0] not in env: raise RuntimeError(f\"variable ${a[0]} is not defined\")\n bound = env[a[0]]\n if isinstance(bound, tuple) and bound and bound[0] == '__closure__':\n yield from _node(bound[1], value, {**env, **bound[2]})\n elif isinstance(bound, Node):\n yield from _node(bound, value, env)\n else:\n yield bound\n elif op == \"bind\":\n for item in _node(a[0], value, env):\n bound=dict(env)\n _initialize_pattern(a[1], bound)\n if not _bind_pattern(a[1], item, bound):\n continue\n # `exp as $x | rest` binds the value produced by exp while the\n # remainder continues with the original input.\n yield from _node(a[2], value, bound)\n elif op == \"field\": yield _index(value, a[0])\n elif op == \"recurse\":\n def walk(item):\n yield item\n if isinstance(item, list):\n for child in item: yield from walk(child)\n elif isinstance(item, dict):\n for child in item.values(): yield from walk(child)\n yield from walk(value)\n elif op == \"index\":\n for base in _node(a[0],value,env): yield _index(base,a[1])\n elif op == \"iterate\":\n for base in _node(a[0],value,env):\n yield from _iter_values(base)\n elif op in (\"indexexpr\",\"slice\"):\n for base in _node(a[0],value,env):\n if op==\"slice\":\n # Slice bounds are filters over the surrounding input, not\n # over the value being sliced (for example map([1,2][0:.])).\n start=_one(a[1],value,env); end=None if a[2] is None else _one(a[2],value,env)\n import math as _math\n if base is None:\n yield None\n elif isinstance(base, (list, str)):\n # jq clamps slice bounds to the collection and rounds\n # fractional starts down / ends up. Resolve the bounds\n # only after checking the base so slicing null retains\n # jq's null-propagating access behavior.\n first = 0 if start is None or (isinstance(start, float) and _math.isnan(start)) else _math.floor(start)\n last = None if end is None or (isinstance(end, float) and _math.isnan(end)) else _math.ceil(end)\n if first < 0: first = max(0, len(base) + int(first))\n if last is not None and last < 0: last = max(0, len(base) + int(last))\n yield base[int(first):None if last is None else int(last)]\n else:\n raise RuntimeError(f'Cannot slice {_type_name(base)}')\n else:\n for key in _node(a[1], value, env):\n yield _index(base, key)\n elif op == \"array\": yield [] if a[0] is None else list(_node(a[0],value,env))\n elif op == \"object\":\n results=[{}]\n for key, expr in a[0]:\n keys=list(_node(key,value,env))\n values=list(_node(expr,value,env))\n expanded=[]\n for prior in results:\n for k in keys:\n for v in values:\n item=dict(prior); item[str(k)]=v; expanded.append(item)\n results=expanded\n yield from results\n elif op == \"binary\": yield from _binary(a[0],a[1],a[2],value,env)\n elif op == \"unary\":\n # Unary operators are filters and must preserve generator\n # multiplicity (``-.[]`` negates every array element).\n for x in _node(a[1], value, env):\n if not _is_number(x):\n raise RuntimeError(f\"{_type_name(x)} ({_short(x)}) cannot be negated\")\n yield _OverflowFloat(-x) if isinstance(x, _OverflowFloat) else -x\n elif op == \"optional\":\n stream = iter(_node(a[0], value, env))\n while True:\n try:\n yield next(stream)\n except StopIteration:\n return\n except FLOW_RUNTIME_ERRORS:\n return\n elif op == \"if\":\n # The condition is a filter, not a scalar expression. jq evaluates\n # each condition result independently and therefore may select both\n # branches for one input.\n for condition in _node(a[0], value, env):\n branch = a[1] if _truth(condition) else a[2]\n yield from _node(branch, value, env)\n elif op == \"try\":\n try: yield from _node(a[0],value,env)\n except FLOW_RUNTIME_ERRORS as error:\n if a[1] is not None:\n caught = error.args[0] if error.args else str(error)\n yield from _node(a[1],caught,env)\n elif op == \"label\":\n try: yield from _node(a[1], value, {**env, '__label__': a[0]})\n except _Break as exc:\n if exc.name != a[0]: raise\n elif op == \"break\":\n raise _Break(a[0])\n elif op in (\"reduce\", \"foreach\"):\n states=list(_node(a[0], value, env))\n # Binary filters in jq are generator products whose divisor-side\n # stream is advanced outermost. This matters for reductions and\n # foreach because their state observes the ordering, even though the\n # resulting multiset is unchanged.\n source = a[0]\n if (source.operation == 'binary' and source.arguments[0] == '/'\n and source.arguments[1].operation == 'iterate'\n and source.arguments[2].operation == 'iterate'):\n left = list(_node(source.arguments[1], value, env))\n right = list(_node(source.arguments[2], value, env))\n states = [x / y for y in right for x in left]\n initial=list(_node(a[2], value, env))\n if op == 'foreach':\n for start in initial:\n current = start\n for item in states:\n bound=dict(env)\n if not _bind_pattern(a[1], item, bound): continue\n outputs=list(_node(a[3], current, bound))\n for result in outputs:\n current = result\n if a[4] is None: yield result\n else: yield from _node(a[4], result, bound)\n return\n currents=initial\n for item in states:\n next_currents=[]\n for current in currents:\n bound=dict(env)\n _initialize_pattern(a[1], bound)\n if not _bind_pattern(a[1], item, bound):\n continue\n next_currents.extend(_node(a[3], current, bound))\n currents=next_currents\n if op == \"foreach\":\n if a[4] is None:\n yield from currents\n else:\n for result in currents: yield from _node(a[4], result, env)\n if op==\"reduce\": yield from currents\n elif op == \"call\": yield from _call(a[0],a[1],value,env)\n elif op == \"def\":\n env.setdefault('__funcs__',{})[(a[0], len(a[1]))]=(a[1],a[2])\n yield value\n elif op == \"defprog\":\n funcs=dict(env.get('__funcs__',{}))\n definitions=[]\n program: Node = node\n while program.operation == 'defprog':\n definitions.append(program.arguments[0].arguments)\n program = program.arguments[1]\n # Each definition captures the overload set visible at its point of\n # declaration. Later redefinitions affect the remainder of the\n # program but do not retroactively change earlier function bodies.\n for name, params, body in definitions:\n closure = dict(funcs)\n function = (params, body, closure)\n closure[(name, len(params))] = function # permit recursion\n funcs[(name, len(params))] = function\n yield from _node(program, value, {**env, '__funcs__': funcs})\n elif op == \"unsupported\": raise RuntimeError(\"unsupported syntax\")\n\nclass _Break(Exception):\n def __init__(self, name): self.name=name\n\ndef _bind_pattern(pattern, value, env):\n op, args=pattern.operation, pattern.arguments\n if op=='pattern_alt':\n first, second=args\n trial=dict(env)\n if _bind_pattern(first,value,trial): env.update(trial); return True\n return _bind_pattern(second,value,env)\n if op=='pattern_var': env[args[0]]=value; return True\n elif op == 'pattern_bind':\n env[args[0]] = value\n return _bind_pattern(args[1], value, env)\n elif op=='pattern_array':\n if not isinstance(value,list): return False\n for i,p in enumerate(args[0]):\n if not _bind_pattern(p, value[i] if i<len(value) else None, env): return False\n return True\n elif op=='pattern_object':\n if not isinstance(value,dict): return False\n for key,p in args[0]:\n if isinstance(key, Node):\n key = _one(key, value, env)\n if not _bind_pattern(p, value.get(key), env): return False\n return True\n return False\n\"\"\"Errors crossing the interpreter's process boundary.\"\"\"\n\n\nclass CompileError(Exception):\n \"\"\"The jq program could not be parsed or statically validated.\"\"\"\n\n\nclass RuntimeError(Exception):\n \"\"\"Evaluation failed after the program was compiled.\"\"\"\n\n\n# Runtime failures raised by evaluator helpers must have the same semantics as\n# jq errors when they cross a flow operator. Keep this tuple shared by the\n# evaluator and the CLI so try/optional do not accidentally miss a Python\n# arithmetic or recursion failure.\nFLOW_RUNTIME_ERRORS = (\n RuntimeError,\n ValueError,\n TypeError,\n IndexError,\n ArithmeticError,\n RecursionError,\n)\n\"\"\"Acceptance coverage for conformance asset staging.\"\"\"\n\nimport sys\nimport unittest\nfrom pathlib import Path\n\n\nROOT = Path(__file__).parents[1]\nsys.path.insert(0, str(ROOT / \"sources\"))\n\nimport run_conformance as harness\n\n\nclass Conf001AcceptanceTests(unittest.TestCase):\n def test_authoritative_corpus_and_exclusions(self) -> None:\n cases = harness.parse_corpus(harness.CORPUS.read_text(encoding=\"utf-8\"))\n excluded = harness.apply_exclusions(\n cases,\n harness.parse_exclusions(harness.EXCLUSIONS),\n )\n\n self.assertEqual(len(cases), 550)\n self.assertEqual(len(excluded), 13)\n self.assertTrue(harness.CORPUS.is_file())\n self.assertTrue(harness.EXCLUSIONS.is_file())\n\n\nif __name__ == \"__main__\":\n unittest.main()\nimport sys\nfrom pathlib import Path\n\nROOT = Path(__file__).parents[1]\nif str(ROOT) not in sys.path:\n sys.path.insert(0, str(ROOT))\n","exit_code":0,"status":"completed"}}
{"type":"item.started","item":{"id":"item_3","type":"command_execution","command":"/bin/bash -lc \"sed -n '310,520p' jq_interpreter/evaluator.py; sed -n '1,100p' jq_interpreter/ast.py; sed -n '1,100p' jq; JQ=\\\"\"'$PWD/jq\" python3 sources/run_conformance.py --select '\"'label|break' --json\"","aggregated_output":"","exit_code":null,"status":"in_progress"}}
{"type":"item.completed","item":{"id":"item_3","type":"command_execution","command":"/bin/bash -lc \"sed -n '310,520p' jq_interpreter/evaluator.py; sed -n '1,100p' jq_interpreter/ast.py; sed -n '1,100p' jq; JQ=\\\"\"'$PWD/jq\" python3 sources/run_conformance.py --select '\"'label|break' --json\"","aggregated_output":"{\n \"candidate\": [\n \"/mnt/c/Users/barlo/projects/drydock/uat/jq/runs/20260822.044627/build/jq/jq\"\n ],\n \"corpus\": \"jq.test\",\n \"summary\": {\n \"pass\": 7,\n \"fail\": 0,\n \"error\": 0,\n \"skip\": 0\n },\n \"cases\": []\n}\n","exit_code":0,"status":"completed"}}
{"type":"item.completed","item":{"id":"item_4","type":"agent_message","text":"The current implementation already has runtime `_Break` propagation, but compile-time validation is incorrectly global: `break $x` is accepted whenever any `label $x` appears anywhere in the source, even when that label is not lexically visible. I’m replacing that with an AST-scoped validator and adding focused tests for visibility, nested labels, and termination behavior."}}
{"type":"item.started","item":{"id":"item_5","type":"file_change","changes":[{"path":"/mnt/c/Users/barlo/projects/drydock/uat/jq/runs/20260822.044627/build/jq/jq_interpreter/parser.py","kind":"update"}],"status":"in_progress"}}
{"type":"item.completed","item":{"id":"item_5","type":"file_change","changes":[{"path":"/mnt/c/Users/barlo/projects/drydock/uat/jq/runs/20260822.044627/build/jq/jq_interpreter/parser.py","kind":"update"}],"status":"completed"}}
{"type":"item.started","item":{"id":"item_6","type":"file_change","changes":[{"path":"/mnt/c/Users/barlo/projects/drydock/uat/jq/runs/20260822.044627/build/jq/tests/test_flow_004_labels_breaks.py","kind":"add"}],"status":"in_progress"}}
{"type":"item.completed","item":{"id":"item_6","type":"file_change","changes":[{"path":"/mnt/c/Users/barlo/projects/drydock/uat/jq/runs/20260822.044627/build/jq/tests/test_flow_004_labels_breaks.py","kind":"add"}],"status":"completed"}}
{"type":"item.started","item":{"id":"item_7","type":"command_execution","command":"/bin/bash -lc 'pytest -q tests/test_flow_004_labels_breaks.py tests/test_flow_003_conditionals_exceptions.py; JQ=\"$PWD/jq\" python3 sources/run_conformance.py --select '\"'label|break' --json\"","aggregated_output":"","exit_code":null,"status":"in_progress"}}
{"type":"item.completed","item":{"id":"item_7","type":"command_execution","command":"/bin/bash -lc 'pytest -q tests/test_flow_004_labels_breaks.py tests/test_flow_003_conditionals_exceptions.py; JQ=\"$PWD/jq\" python3 sources/run_conformance.py --select '\"'label|break' --json\"","aggregated_output":"..F........ [100%]\n=================================== FAILURES ===================================\n_____________ test_break_terminates_only_the_matching_label_scope ______________\n\n def test_break_terminates_only_the_matching_label_scope() -> None:\n> assert outputs(\n '[label $out | .[] | if . > 1 then break $out else . end, \"after\"]',\n [0, 1, 2],\n ) == [[0, 1, \"after\"]]\nE AssertionError: assert [[0, 'after', 1, 'after']] == [[0, 1, 'after']]\nE \nE At index 0 diff: [0, 'after', 1, 'after'] != [0, 1, 'after']\nE Use -v to get more diff\n\ntests/test_flow_004_labels_breaks.py:23: AssertionError\n=========================== short test summary info ============================\nFAILED tests/test_flow_004_labels_breaks.py::test_break_terminates_only_the_matching_label_scope\n1 failed, 10 passed in 4.46s\n{\n \"candidate\": [\n \"/mnt/c/Users/barlo/projects/drydock/uat/jq/runs/20260822.044627/build/jq/jq\"\n ],\n \"corpus\": \"jq.test\",\n \"summary\": {\n \"pass\": 7,\n \"fail\": 0,\n \"error\": 0,\n \"skip\": 0\n },\n \"cases\": []\n}\n","exit_code":0,"status":"completed"}}
{"type":"item.completed","item":{"id":"item_8","type":"agent_message","text":"The scoped corpus check is green (7/7 selected cases). One newly added unit expectation exposed a test-expression precedence mistake rather than an implementation defect: jq applies the trailing comma inside the label’s piped body, so `\"after\"` is emitted for each earlier item. I’m correcting that test and then running the full project suite plus the required acceptance command."}}
{"type":"item.started","item":{"id":"item_9","type":"file_change","changes":[{"path":"/mnt/c/Users/barlo/projects/drydock/uat/jq/runs/20260822.044627/build/jq/tests/test_flow_004_labels_breaks.py","kind":"update"}],"status":"in_progress"}}
{"type":"item.completed","item":{"id":"item_9","type":"file_change","changes":[{"path":"/mnt/c/Users/barlo/projects/drydock/uat/jq/runs/20260822.044627/build/jq/tests/test_flow_004_labels_breaks.py","kind":"update"}],"status":"completed"}}
{"type":"item.started","item":{"id":"item_10","type":"command_execution","command":"/bin/bash -lc 'pytest -q; JQ=\"$PWD/jq\" python3 sources/run_conformance.py --select '\"'label|break' --json; git diff --stat; git diff -- jq_interpreter/parser.py tests/test_flow_004_labels_breaks.py\"","aggregated_output":"","exit_code":null,"status":"in_progress"}}
{"type":"item.completed","item":{"id":"item_10","type":"command_execution","command":"/bin/bash -lc 'pytest -q; JQ=\"$PWD/jq\" python3 sources/run_conformance.py --select '\"'label|break' --json; git diff --stat; git diff -- jq_interpreter/parser.py tests/test_flow_004_labels_breaks.py\"","aggregated_output":"........................................................................ [ 75%]\n........................ [100%]\n96 passed in 11.96s\n{\n \"candidate\": [\n \"/mnt/c/Users/barlo/projects/drydock/uat/jq/runs/20260822.044627/build/jq/jq\"\n ],\n \"corpus\": \"jq.test\",\n \"summary\": {\n \"pass\": 7,\n \"fail\": 0,\n \"error\": 0,\n \"skip\": 0\n },\n \"cases\": []\n}\n .../20260822.044627/build/jq/jq_interpreter/cli.py | 4 +-\n .../build/jq/jq_interpreter/errors.py | 14 +\n .../build/jq/jq_interpreter/evaluator.py | 1177 +++-\n .../build/jq/jq_interpreter/interpreter.py | 19 +-\n .../build/jq/jq_interpreter/parser.py | 46 +-\n .../07-after-plan-target-status.stdout.log | 2 +-\n .../evidence/commands/10-initial-build-1.llm.log | 34 -\n .../commands/10-initial-build-1.stderr.log | 2 -\n .../commands/10-initial-build-1.stdout.log | 275 +-\n .../11-after-initial-build-build-status.stderr.log | 0\n .../11-after-initial-build-build-status.stdout.log | 141 -\n ...12-after-initial-build-target-status.stderr.log | 0\n ...12-after-initial-build-target-status.stdout.log | 49 -\n ...after-initial-build-workspace-status.stderr.log | 0\n ...after-initial-build-workspace-status.stdout.log | 16 -\n runs/20260822.044627/workspace/logs/history.jsonl | 2 +\n .../20260822.044627/workspace/targets/jq/ERRORS.md | 30 -\n .../workspace/targets/jq/MANIFEST.md | 77 +-\n .../workspace/targets/jq/PROJECT_STATUS.jsonl | 5 +-\n .../targets/jq/QuarterDeck/commanders_chair.html | 33 +-\n .../workspace/targets/jq/STOP_NOW.md | 13 -\n .../workspace/targets/jq/evidence/block-8.md | 7005 ++++----------------\n .../targets/jq/evidence/prepassed-acceptance.json | 11 +-\n 23 files changed, 2565 insertions(+), 6390 deletions(-)\ndiff --git a/runs/20260822.044627/build/jq/jq_interpreter/parser.py b/runs/20260822.044627/build/jq/jq_interpreter/parser.py\nindex 320d5b4..c59dc0e 100644\n--- a/runs/20260822.044627/build/jq/jq_interpreter/parser.py\n+++ b/runs/20260822.044627/build/jq/jq_interpreter/parser.py\n@@ -93,6 +93,14 @@ class Parser:\n while self.p()==',': self.take(); parts.append(self.expr(1, True))\n combined=parts[0]\n for part in parts[1:]: combined=Node('binary',(',',combined,part))\n+ # In an array, a trailing pipe belongs to the complete comma\n+ # query (`[a,b | f]` is `[(a,b) | f]`).\n+ if (combined.operation == 'binary' and combined.arguments[0] == ','\n+ and combined.arguments[2].operation == 'binary'\n+ and combined.arguments[2].arguments[0] == '|'\n+ and combined.arguments[2].arguments[1].operation in ('unary', 'literal', 'binary')):\n+ tail = combined.arguments[2]\n+ combined = Node('binary', ('|', Node('binary', (',', combined.arguments[1], tail.arguments[1])), tail.arguments[2]))\n x=Node('array',(combined,))\n self.take(']'); return self.post(x)\n if t=='{': return self.object()\n@@ -261,11 +269,6 @@ class Parser:\n def parse(source: str) -> Filter:\n tokenize(source)\n if source.strip() == 'not-a-filter': raise CompileError('unknown filter')\n- for label in re.findall(r'\\blabel\\s+\\$([A-Za-z_]\\w*)', source):\n- pass\n- for name in re.findall(r'\\bbreak\\s+\\$([A-Za-z_]\\w*)', source):\n- if not re.search(r'\\blabel\\s+\\$' + re.escape(name) + r'\\b', source):\n- raise CompileError('break label is not defined')\n stripped=source.strip()\n if stripped.startswith('\"') and '\\\\(' in stripped:\n parts=[]; pos=1; end=len(stripped)-1\n@@ -288,12 +291,43 @@ def parse(source: str) -> Filter:\n result=Parser(source).parse()\n except (IndexError, ValueError) as error:\n raise CompileError('syntax error') from error\n+ _validate_labels(result)\n # Bare calls are valid jq builtins as well as user definitions supplied by\n # the builtin library. Retain compile-time rejection for an unknown bare\n # identifier while registering the standard library's zero-argument names.\n if '$bar' in source and not re.search(r'\\bas\\s+\\$bar\\b', source):\n raise CompileError('variable $bar is not defined')\n- known = set('empty error length type not tostring tojson abs fabs floor ceil round sqrt sin cos tan asin acos atan log log10 exp exp2 log2 pow keys sort add min max any all arrays objects iterables booleans numbers normals finites strings nulls values scalars unique reverse paths path indices builtins modulemeta input debug implode explode trim ltrim rtrim isempty have_decnum'.split())\n+ known = set('empty error length type utf8bytelength not tonumber toboolean tostring tojson abs fabs floor ceil round trunc sin cos tan asin acos atan sinh cosh tanh asinh acosh atanh log log10 log1p log2 logb exp exp2 exp10 expm1 pow cbrt gamma lgamma tgamma erf erfc j0 j1 y0 y1 atan2 copysign drem fdim fmax fmin fmod frexp hypot jn ldexp modf nextafter nexttoward remainder scalb scalbln yn fma infinite nan isinfinite isnan isfinite isnormal keys sort add min max min_by max_by any all arrays objects iterables booleans numbers normals finites strings nulls values scalars unique reverse paths path indices builtins modulemeta input debug implode explode trim ltrim rtrim isempty have_decnum gmtime'.split())\n if isinstance(result, Node) and result.operation == 'call' and not result.arguments[1] and result.arguments[0] not in known:\n raise CompileError('unknown filter')\n return result\n+\n+\n+def _validate_labels(node: Filter, visible: tuple[str, ...] = ()) -> None:\n+ \"\"\"Reject breaks whose label is not lexically visible at the break.\n+\n+ A source-wide search cannot model jq's lexical scope: a label in a\n+ sibling expression (or to the right of a break) must not make that break\n+ valid. Walking the parsed tree also keeps labels inside strings and\n+ comments out of the validation surface.\n+ \"\"\"\n+ if not isinstance(node, Node):\n+ return\n+ if node.operation == 'label':\n+ _validate_labels(node.arguments[1], visible + (node.arguments[0],))\n+ return\n+ if node.operation == 'break':\n+ if node.arguments[0] not in visible:\n+ raise CompileError('break label is not defined')\n+ return\n+ for argument in node.arguments:\n+ if isinstance(argument, Filter):\n+ _validate_labels(argument, visible)\n+ elif isinstance(argument, (tuple, list)):\n+ for item in argument:\n+ if isinstance(item, Filter):\n+ _validate_labels(item, visible)\n+ elif isinstance(item, tuple):\n+ for nested in item:\n+ if isinstance(nested, Filter):\n+ _validate_labels(nested, visible)\n","exit_code":0,"status":"completed"}}
{"type":"item.started","item":{"id":"item_11","type":"command_execution","command":"/bin/bash -lc \"git status --short -- jq_interpreter/parser.py tests/test_flow_004_labels_breaks.py; git ls-files tests/test_flow_004_labels_breaks.py; stat -c '%y %n' jq_interpreter/parser.py tests/test_flow_004_labels_breaks.py\"","aggregated_output":"","exit_code":null,"status":"in_progress"}}
{"type":"item.completed","item":{"id":"item_11","type":"command_execution","command":"/bin/bash -lc \"git status --short -- jq_interpreter/parser.py tests/test_flow_004_labels_breaks.py; git ls-files tests/test_flow_004_labels_breaks.py; stat -c '%y %n' jq_interpreter/parser.py tests/test_flow_004_labels_breaks.py\"","aggregated_output":" M jq_interpreter/parser.py\n?? tests/test_flow_004_labels_breaks.py\n2026-08-22 23:09:18.406208600 -0400 jq_interpreter/parser.py\n2026-08-22 23:09:44.743082900 -0400 tests/test_flow_004_labels_breaks.py\n","exit_code":0,"status":"completed"}}
{"type":"item.completed","item":{"id":"item_12","type":"agent_message","text":"All 96 project tests now pass, and the required `label|break` conformance slice remains 7 passed with zero failures/errors. I also verified the only files changed for this block are the parser and the new FLOW-004 tests; unrelated pre-existing worktree changes were left untouched."}}
{"type":"item.completed","item":{"id":"item_13","type":"agent_message","text":"RESULT: SUCCESS\n\nFILES CHANGED:\n- jq_interpreter/parser.py\n- tests/test_flow_004_labels_breaks.py\n\nSUMMARY:\nImplemented AST-based lexical label validation and added FLOW-004 coverage. All 96 tests pass; scoped conformance passes 7/7.\n\nBLOCKERS:\n- None"}}
{"type":"turn.completed","usage":{"input_tokens":1074793,"cached_input_tokens":974080,"cache_write_input_tokens":0,"output_tokens":3412,"reasoning_output_tokens":936}}
Run artifact