Run artifact

evidence/provider_raw/20260823.113822.128Z_jq_build_codex.raw.jsonl

{"type":"thread.started","thread_id":"01a02e6a-230d-73c1-b0eb-a0385f30fe16"}
{"type":"turn.started"}
{"type":"item.completed","item":{"id":"item_0","type":"agent_message","text":"I’m inspecting the existing interpreter and evaluator paths first, then I’ll add the date/time builtins in the smallest compatible layer and run both declared scoped acceptance checks."}}
{"type":"item.started","item":{"id":"item_1","type":"command_execution","command":"/bin/bash -lc \"pwd; rg --files -g '\"'!sources/**'\"' | sort; rg -n \\\"strftime|fromdate|gmtime|BUILTIN|builtin|class .*Eval|def eval|function\\\" -g '\"'!sources/**'\"' . | head -240\"","aggregated_output":"","exit_code":null,"status":"in_progress"}}
{"type":"item.completed","item":{"id":"item_1","type":"command_execution","command":"/bin/bash -lc \"pwd; rg --files -g '\"'!sources/**'\"' | sort; rg -n \\\"strftime|fromdate|gmtime|BUILTIN|builtin|class .*Eval|def eval|function\\\" -g '\"'!sources/**'\"' . | head -240\"","aggregated_output":"/mnt/c/Users/barlo/projects/drydock/uat/jq/runs/20260822.044627/build/jq\njq\njq_interpreter/__init__.py\njq_interpreter/architecture.py\njq_interpreter/ast.py\njq_interpreter/builtins.py\njq_interpreter/cli.py\njq_interpreter/diagnostics.py\njq_interpreter/errors.py\njq_interpreter/evaluator.py\njq_interpreter/interpreter.py\njq_interpreter/lexer.py\njq_interpreter/parser.py\njq_interpreter/paths.py\njq_interpreter/runtime.py\ntests/conftest.py\ntests/test_architecture.py\ntests/test_conf_001_acceptance.py\ntests/test_conformance_assets.py\ntests/test_core_002_composition.py\ntests/test_core_003_errors.py\ntests/test_core_004_truthiness_comparison.py\ntests/test_data_002_sorting.py\ntests/test_data_003_entries_containment.py\ntests/test_flow_001_operators.py\ntests/test_flow_002_boolean_alternative.py\ntests/test_flow_003_conditionals_exceptions.py\ntests/test_flow_004_labels_breaks.py\ntests/test_flow_005_reductions_iteration.py\ntests/test_flow_006_recursive_generators.py\ntests/test_func_002_parameters.py\ntests/test_json_io.py\ntests/test_lexer.py\ntests/test_parse_002.py\ntests/test_path_001_discovery_projection.py\ntests/test_path_002_access_mutation.py\ntests/test_service_lexical_bindings.py\ntests/test_stream_evaluator.py\ntests/test_text_001_string_builtins.py\ntests/test_text_002_formats.py\ntests/test_text_003_regex.py\ntests/test_value_001.py\ntests/test_value_002_access.py\ntests/test_value_003_slices_iteration.py\ntests/test_value_004.py\n./tests/test_text_001_string_builtins.py:1:\"\"\"Focused tests for the TEXT-001 string builtin surface.\"\"\"\n./tests/test_text_001_string_builtins.py:41:def test_string_builtins_reject_non_string_inputs() -> None:\n./tests/test_value_004.py:44:def test_math_functions_and_invalid_conversion_exit_runtime() -> None:\n./jq_interpreter/builtins.py:3:Language-specific builtin definitions will be added here; the evaluator depends on\n./jq_interpreter/evaluator.py:21:def evaluate(program: Filter, value: JsonValue) -> ValueStream:\n./jq_interpreter/evaluator.py:292:        # that point.  Capturing only ``funcs`` is subtly wrong: a function\n./jq_interpreter/evaluator.py:296:        # function's closure.\n./jq_interpreter/evaluator.py:300:            function = (params, body, closure)\n./jq_interpreter/evaluator.py:301:            closure['__funcs__'][(name, len(params))] = function  # permit recursion\n./jq_interpreter/evaluator.py:302:            funcs[(name, len(params))] = function\n./jq_interpreter/evaluator.py:890:    # functions whose argument is a comma expression.\n./jq_interpreter/evaluator.py:963:        function = env['__funcs__'][(args[0], 0)]\n./jq_interpreter/evaluator.py:965:        if len(function) > 2:\n./jq_interpreter/evaluator.py:966:            closure_env['__funcs__'] = function[2]\n./jq_interpreter/evaluator.py:967:        return _paths(function[1], value, closure_env)\n./jq_interpreter/evaluator.py:1155:    function = env.get('__funcs__',{}).get((name, len(args)))\n./jq_interpreter/evaluator.py:1156:    if function is not None:\n./jq_interpreter/evaluator.py:1157:        params, body, *closure = function\n./jq_interpreter/evaluator.py:1158:        # A function executes in the environment captured at its definition,\n./jq_interpreter/evaluator.py:1480:    if name in ('strftime', 'strflocaltime'):\n./jq_interpreter/evaluator.py:1495:            yield dt.strftime(fmt)\n./jq_interpreter/evaluator.py:1508:               (parsed.weekday() + 1) % 7, int(parsed.strftime('%j')) - 1]\n./jq_interpreter/evaluator.py:1515:        # Commas inside a call are generator values, not separate function\n./jq_interpreter/evaluator.py:1531:    if name == 'builtins':\n./jq_interpreter/evaluator.py:1535:            'floor/0', 'flatten/0', 'from_entries/0', 'fromjson/0', 'gmtime/0',\n./jq_interpreter/evaluator.py:1539:            'startswith/1', 'strftime/1', 'strptime/1', 'to_entries/0',\n./jq_interpreter/evaluator.py:1826:    if name == 'gmtime':\n./jq_interpreter/evaluator.py:1895:        function = unary_math.get(name, getattr(math, name, None))\n./jq_interpreter/evaluator.py:1896:        if function is None: raise RuntimeError(f'{name} is not available')\n./jq_interpreter/evaluator.py:1897:        yield function(value); return\n./jq_interpreter/evaluator.py:1910:        function = getattr(math, name)\n./jq_interpreter/evaluator.py:1912:            yield list(function(argument))\n./jq_interpreter/evaluator.py:1915:        function = getattr(math, name, None)\n./jq_interpreter/evaluator.py:1916:        if function is None: raise RuntimeError(f'{name} is not available')\n./jq_interpreter/evaluator.py:1918:            yield function(int(first), second)\n./jq_interpreter/evaluator.py:1921:        function = getattr(math, name, None)\n./jq_interpreter/evaluator.py:1922:        if function is None: raise RuntimeError('fma is not available')\n./jq_interpreter/evaluator.py:1924:            yield function(first, second, third)\n./jq_interpreter/evaluator.py:1989:    raise RuntimeError(f\"unknown function {name}\")\n./jq_interpreter/runtime.py:23:class EvaluationContext:\n./jq_interpreter/parser.py:298:    # Bare calls are valid jq builtins as well as user definitions supplied by\n./jq_interpreter/parser.py:299:    # the builtin library.  Retain compile-time rejection for an unknown bare\n./jq_interpreter/parser.py:301:    known = set('empty error length type utf8bytelength not tonumber toboolean tostring tojson abs fabs floor ceil round trunc sin cos tan asin acos atan sinh cosh tanh asinh acosh atanh log log10 log1p log2 logb exp exp2 exp10 expm1 pow cbrt gamma lgamma tgamma erf erfc j0 j1 y0 y1 atan2 copysign drem fdim fmax fmin fmod frexp hypot jn ldexp modf nextafter nexttoward remainder scalb scalbln yn fma infinite nan isinfinite isnan isfinite isnormal keys keys_unsorted has in inside contains to_entries from_entries with_entries sort add min max min_by max_by any all arrays objects iterables booleans numbers normals finites strings nulls values scalars unique reverse paths path indices builtins modulemeta input debug implode explode trim ltrim rtrim trimstr ltrimstr rtrimstr ascii_downcase ascii_upcase startswith endswith split splits join isempty have_decnum gmtime map map_values select flatten transpose combinations walk test match capture scan sub gsub'.split())\n./jq_interpreter/parser.py:394:    \"\"\"Return the variable name exposed by a function formal.\"\"\"\n./tests/test_func_002_parameters.py:1:\"\"\"Regression coverage for filter and value function parameters.\"\"\"\n./tests/test_func_002_parameters.py:42:def test_function_arities_are_independent() -> None:\n./tests/test_func_002_parameters.py:47:def test_function_captures_definition_scope_instead_of_call_scope() -> None:\n./tests/test_func_002_parameters.py:52:def test_recursive_function_uses_its_own_definition() -> None:\n./tests/test_func_002_parameters.py:57:def test_redefinition_does_not_rebind_an_earlier_function_body() -> None:\n./jq_interpreter/architecture.py:26:    ModuleBoundary(\"jq_interpreter.builtins\", \"jq standard-library filter implementations\"),\n./tests/test_conformance_assets.py:35:            \"builtin.jq\",\n./tests/test_architecture.py:27:            \"jq_interpreter.builtins\",\n","exit_code":0,"status":"completed"}}
{"type":"item.started","item":{"id":"item_2","type":"command_execution","command":"/bin/bash -lc \"sed -n '1,80p' jq_interpreter/evaluator.py; sed -n '1430,1548p' jq_interpreter/evaluator.py; sed -n '1780,1885p' jq_interpreter/evaluator.py; sed -n '270,315p' jq_interpreter/parser.py; sed -n '1,120p' tests/conftest.py; sed -n '1,100p' tests/test_text_003_regex.py\"","aggregated_output":"","exit_code":null,"status":"in_progress"}}
{"type":"item.completed","item":{"id":"item_2","type":"command_execution","command":"/bin/bash -lc \"sed -n '1,80p' jq_interpreter/evaluator.py; sed -n '1430,1548p' jq_interpreter/evaluator.py; sed -n '1780,1885p' jq_interpreter/evaluator.py; sed -n '270,315p' jq_interpreter/parser.py; sed -n '1,120p' tests/conftest.py; sed -n '1,100p' tests/test_text_003_regex.py\"","aggregated_output":"\"\"\"Ordered generator evaluator boundary.\"\"\"\nimport json\nimport math\nimport datetime\nimport itertools\nimport sys\nimport re\nfrom functools import cmp_to_key\n\nfrom .ast import Add, Array, Comma, Filter, Format, Identity, Iterate, Literal, Limit, Node, Pipe, Raise, StringTemplate\nfrom .errors import FLOW_RUNTIME_ERRORS, RuntimeError\nfrom .runtime import InputNumber, JsonValue, ValueStream, identity_stream\n\n\nclass _OverflowFloat(float):\n    \"\"\"A parsed exponent overflow that jq still emits as a JSON number.\"\"\"\n\n    pass\n\n\ndef evaluate(program: Filter, value: JsonValue) -> ValueStream:\n    \"\"\"Evaluate one input as an ordered stream of output values.\"\"\"\n    if isinstance(program, Node):\n        yield from _node(program, value, {})\n        return\n    if isinstance(program, Identity):\n        yield from identity_stream(value)\n        return\n    if isinstance(program, Iterate):\n        yield from _iter_values(value)\n        return\n    if isinstance(program, Literal):\n        yield program.value\n        return\n    if isinstance(program, Pipe):\n        for intermediate in evaluate(program.left, value): yield from evaluate(program.right, intermediate)\n        return\n    if isinstance(program, Add):\n        left = list(evaluate(program.left, value))\n        right = list(evaluate(program.right, value))\n        for first in left:\n            for second in right:\n                if isinstance(first, (int, float)) and isinstance(second, (int, float)):\n                    yield first + second\n                elif isinstance(first, str) and isinstance(second, str): yield first + second\n                elif first is None: yield second\n                elif second is None: yield first\n                else: raise RuntimeError(\"cannot add values\")\n        return\n    if isinstance(program, StringTemplate):\n        pieces: list[str] = []\n        for part in program.parts:\n            pieces.append(part if isinstance(part, str) else \"\".join(_stringify(x) for x in evaluate(part, value)))\n        yield \"\".join(pieces)\n        return\n    if isinstance(program, Format):\n        if program.template is None: yield _apply_format(program.name, value)\n        else:\n            pieces: list[str] = []\n            for part in program.template.parts:\n                if isinstance(part, str): pieces.append(part)\n                else:\n                    pieces.extend(_apply_format(program.name, item) for item in evaluate(part, value))\n            yield \"\".join(pieces)\n        return\n    if isinstance(program, Comma):\n        yield from evaluate(program.left, value)\n        yield from evaluate(program.right, value)\n        return\n    if isinstance(program, Raise):\n        raise RuntimeError(program.message)\n    if isinstance(program, Array):\n        yield list(evaluate(program.expression, value))\n        return\n    if isinstance(program, Limit):\n        outputs = iter(evaluate(program.expression, value))\n        for _ in range(program.count):\n            try:\n                yield next(outputs)\n            except StopIteration:\n                yield result\n                results.append(result)\n            for result in results:\n                yield from loop(result)\n        yield from loop(value)\n        return\n    if name == 'recurse':\n        def loop(current):\n            yield current\n            for child in _node(args[0], current, env):\n                if len(args) > 1:\n                    if any(_truth(test) for test in _node(args[1], child, env)):\n                        yield from loop(child)\n                else:\n                    yield from loop(child)\n        if not args:\n            def descendants(current):\n                yield current\n                if isinstance(current, list):\n                    for child in current:\n                        yield from descendants(child)\n                elif isinstance(current, dict):\n                    for child in current.values():\n                        yield from descendants(child)\n            yield from descendants(value)\n        else:\n            yield from loop(value)\n        return\n    if name == 'nth':\n        indexes = list(_node(args[0], value, env))\n        if any(int(index) < 0 for index in indexes):\n            raise RuntimeError(\"nth doesn't support negative indices\")\n        # ``nth`` must not exhaust a generator after the largest requested\n        # index.  Besides avoiding unnecessary work, this is observable when\n        # the source emits a runtime error after the requested value:\n        # ``nth(1; 0,1,error)`` still yields 1.\n        values: list[object] = []\n        source = iter(_node(args[-1], value, env))\n        required = max((int(index) for index in indexes), default=-1)\n        while len(values) <= required:\n            try:\n                values.append(next(source))\n            except StopIteration:\n                break\n        for index in indexes:\n            index = int(index)\n            if index < len(values): yield values[index]\n        return\n    if name == 'input':\n        raise RuntimeError('break')\n    if name in ('strftime', 'strflocaltime'):\n        if not args or not isinstance(_one(args[0], value, env), str):\n            raise RuntimeError(f'{name}/1 requires a string format')\n        if isinstance(value, (int, float)) and not isinstance(value, bool):\n            dt = datetime.datetime.fromtimestamp(float(value), datetime.timezone.utc)\n        elif isinstance(value, list) and len(value) >= 3 and all(isinstance(x, (int, float)) for x in value[:3]):\n            dt = datetime.datetime(int(value[0]), int(value[1]) + 1, int(value[2]),\n                                   int(value[3]) if len(value) > 3 else 0,\n                                   int(value[4]) if len(value) > 4 else 0,\n                                   int(value[5]) if len(value) > 5 else 0)\n        else:\n            raise RuntimeError(f'{name}/1 requires parsed datetime inputs')\n        for fmt in _node(args[0], value, env):\n            if not isinstance(fmt, str):\n                raise RuntimeError(f'{name}/1 requires a string format')\n            yield dt.strftime(fmt)\n        return\n    if name == 'mktime':\n        if not isinstance(value, list) or len(value) < 6 or not all(isinstance(x, (int, float)) for x in value[:6]):\n            raise RuntimeError('mktime requires parsed datetime inputs')\n        dt = datetime.datetime(int(value[0]), int(value[1]) + 1, int(value[2]), int(value[3]), int(value[4]), int(value[5]), tzinfo=datetime.timezone.utc)\n        yield int(dt.timestamp()); return\n    if name == 'strptime':\n        fmt = _one(args[0], value, env) if args else None\n        if not isinstance(value, str) or not isinstance(fmt, str):\n            raise RuntimeError('strptime/1 requires a string format')\n        parsed = datetime.datetime.strptime(value, fmt)\n        yield [parsed.year, parsed.month - 1, parsed.day, parsed.hour, parsed.minute, parsed.second,\n               (parsed.weekday() + 1) % 7, int(parsed.strftime('%j')) - 1]\n        return\n    if name == '_strindices':\n        if isinstance(value, str): raise RuntimeError('number (123) is not a string')\n        raise RuntimeError(f'{_type_name(value)} ({_stringify(value)}) cannot be searched, as it is not a string')\n    if name == 'bsearch':\n        if not isinstance(value, list): raise RuntimeError(f'{_type_name(value)} ({_short(value)}) cannot be searched from')\n        # Commas inside a call are generator values, not separate function\n        # parameters.  Keep every generated needle in source order (while\n        # retaining semicolon-separated arguments for compatibility).\n        needles = []\n        if len(args) == 1:\n            needles.extend(_node(args[0], value, env))\n        else:\n            needles.extend(_one(arg, value, env) for arg in args)\n        for needle in needles:\n            lo, hi = 0, len(value)\n            while lo < hi:\n                mid = (lo + hi) // 2\n                if _jq_sort_key(value[mid]) < _jq_sort_key(needle): lo = mid + 1\n                else: hi = mid\n            yield lo if lo < len(value) and _deep_equal(value[lo], needle) else -lo - 1\n        return\n    if name == 'builtins':\n        yield [\n            'abs/0', 'add/0', 'all/0', 'any/0', 'arrays/0', 'ascii_downcase/0',\n            'ascii_upcase/0', 'contains/1', 'empty/0', 'endswith/1', 'error/0',\n            'floor/0', 'flatten/0', 'from_entries/0', 'fromjson/0', 'gmtime/0',\n            'has/1', 'index/1', 'indices/1', 'in/1', 'isempty/1', 'join/1',\n            'keys/0', 'length/0', 'map/1', 'max/0', 'min/0', 'not/0',\n            'objects/0', 'range/1', 'select/1', 'sort/0', 'split/1',\n            'startswith/1', 'strftime/1', 'strptime/1', 'to_entries/0',\n            'tostring/0', 'type/0', 'unique/0', 'values/0', 'walk/1',\n        ]; return\n    if name == 'IN':\n        candidates = list(_node(args[0], value, env)) if args else []\n        if len(args) > 1:\n            targets = list(_node(args[1], value, env))\n            yield any(_deep_equal(item, target) for item in candidates for target in targets)\n            return\n        yield any(_deep_equal(value, candidate) for candidate in candidates); return\n                parent, key = path[:-1], path[-1]\n                # jq resolves every deletion path against the original\n                # value.  Normalize negative array indices before applying\n                # any mutation so later removals cannot change their target.\n                container = _get_path(value, parent)\n                if isinstance(container, list) and isinstance(key, (int, float)) and key < 0:\n                    key = len(container) + int(key)\n                grouped.setdefault(parent, set()).add(key)\n        # Remove array members in descending index order so one deletion\n        # cannot shift a later member.  Deeper parents are handled first.\n        for parent in sorted(grouped, key=lambda item: len(item), reverse=True):\n            for key in sorted(grouped[parent], key=lambda item: item if isinstance(item, (int, float)) else 0, reverse=True):\n                result = _delete_path(result, parent + (key,))\n        if any(not path for path in all_paths):\n            result = None\n        yield result\n        return\n    if name == 'rindex':\n        needles = list(_node(args[0], value, env)) if args else [None]\n        for needle in needles:\n            if isinstance(value, str): yield None if needle == '' else (value.rfind(needle) if needle in value else None)\n            elif isinstance(value, list):\n                try: yield len(value) - 1 - value[::-1].index(needle)\n                except ValueError: yield None\n            else: raise RuntimeError('cannot search value')\n        return\n    if name == 'first':\n        try: yield next(_node(args[0], value, env))\n        except StopIteration: return\n        return\n    if name == 'last':\n        vals=list(_node(args[0], value, env));\n        if vals: yield vals[-1]\n        return\n    if name == 'select':\n        if _truth(_one(args[0], value, env)): yield value\n        return\n    if name == 'infinite': yield float('inf'); return\n    if name == 'nan': yield float('nan'); return\n    if name in ('isnan', 'isinfinite', 'isfinite', 'isnormal'):\n        numeric = isinstance(value, (int, float)) and not isinstance(value, bool)\n        if name == 'isnan': result = numeric and isinstance(value, float) and math.isnan(value)\n        elif name == 'isinfinite': result = numeric and math.isinf(value)\n        elif name == 'isfinite': result = numeric and math.isfinite(value)\n        else: result = numeric and math.isfinite(value) and value != 0 and abs(value) >= sys.float_info.min\n        yield result; return\n    if name == 'gmtime':\n        stamp = float(value)\n        dt = datetime.datetime.fromtimestamp(stamp, datetime.timezone.utc)\n        yield [dt.year, dt.month - 1, dt.day, dt.hour, dt.minute,\n               dt.second + (stamp - int(stamp)), dt.weekday(),\n               dt.timetuple().tm_yday - 1]\n        return\n    if name == 'pow': yield math.pow(_one(args[0],value,env), _one(args[1],value,env)); return\n    if name == 'implode':\n        if not isinstance(value, list): raise RuntimeError('implode input must be an array')\n        chars=[]\n        for item in value:\n            if not isinstance(item, (int, float)) or isinstance(item, bool):\n                shown = json.dumps(item, ensure_ascii=False) if isinstance(item, str) else _stringify(item)\n                raise RuntimeError(f'{_type_name(item)} ({shown}) can\\'t be imploded, unicode codepoint needs to be numeric')\n            if isinstance(item, float) and math.isnan(item):\n                raise RuntimeError('number (null) can\\'t be imploded, unicode codepoint needs to be numeric')\n            chars.append(chr(int(item)) if 0 <= int(item) <= 0x10ffff and not 0xd800 <= int(item) <= 0xdfff else '\\ufffd')\n        yield ''.join(chars); return\n    if name == 'explode':\n        if not isinstance(value, str): raise RuntimeError('explode input must be a string')\n        yield [ord(x) for x in value]; return\n    if name == 'limit':\n        counts=list(_node(args[0], value, env))\n        for count_value in counts:\n            count=int(count_value)\n            if count < 0: raise RuntimeError(\"limit doesn't support negative count\")\n            if count == 0: continue\n            for item in _node(args[1], value, env):\n                yield item; count -= 1\n                if count == 0: break\n        return\n    if name == 'skip':\n        counts=list(_node(args[0], value, env))\n        for count_value in counts:\n            count=int(count_value)\n            if count < 0: raise RuntimeError(\"skip doesn't support negative count\")\n            for item in _node(args[1], value, env):\n                if count: count -= 1\n                else: yield item\n        return\n    if name == 'join':\n        for separator in _node(args[0], value, env):\n            if not isinstance(separator, str):\n                raise RuntimeError('join separator must be a string')\n            if not isinstance(value, list): raise RuntimeError('cannot join value')\n            pieces=[]\n            for item in value:\n                if item is None: pieces.append('')\n                elif isinstance(item, (str, int, float, bool)): pieces.append(_stringify(item))\n                else:\n                    prefix=str(separator).join(pieces) + str(separator) if pieces else ''\n                    raise RuntimeError(f'{_type_name(prefix)} ({json.dumps(prefix)}) and {_type_name(item)} ({_stringify(item)}) cannot be added')\n            yield separator.join(pieces)\n        return\n    unary_math = {\n        'cbrt': lambda x: math.copysign(abs(x) ** (1.0 / 3.0), x),\n        'exp10': lambda x: 10.0 ** x,\n        'j0': lambda x: (_raise_unavailable('j0')),\n        'j1': lambda x: (_raise_unavailable('j1')),\n\ndef parse(source: str) -> Filter:\n    tokenize(source)\n    if source.strip() == 'not-a-filter': raise CompileError('unknown filter')\n    stripped=source.strip()\n    if stripped.startswith('\"') and '\\\\(' in stripped:\n        parts=[]; pos=1; end=len(stripped)-1\n        while pos<end:\n            mark=stripped.find('\\\\(',pos)\n            if mark<0:\n                parts.append(json.loads('\"'+stripped[pos:end]+'\"')); break\n            if mark>pos: parts.append(json.loads('\"'+stripped[pos:mark]+'\"'))\n            depth=1; cursor=mark+2\n            while depth and cursor<end:\n                if stripped[cursor]=='(': depth+=1\n                elif stripped[cursor]==')': depth-=1\n                cursor+=1\n            parts.append(parse(stripped[mark+2:cursor-1])); pos=cursor\n        return StringTemplate(tuple(parts))\n    if stripped.startswith('@') and ' \"' in stripped:\n        name, template=stripped.split(None,1); inner=parse(template)\n        return Format(name[1:], inner if isinstance(inner,StringTemplate) else StringTemplate((inner,)))\n    try:\n        result=Parser(source).parse()\n    except (IndexError, ValueError) as error:\n        raise CompileError('syntax error') from error\n    _validate_labels(result)\n    _validate_variables(result)\n    # Bare calls are valid jq builtins as well as user definitions supplied by\n    # the builtin library.  Retain compile-time rejection for an unknown bare\n    # identifier while registering the standard library's zero-argument names.\n    known = set('empty error length type utf8bytelength not tonumber toboolean tostring tojson abs fabs floor ceil round trunc sin cos tan asin acos atan sinh cosh tanh asinh acosh atanh log log10 log1p log2 logb exp exp2 exp10 expm1 pow cbrt gamma lgamma tgamma erf erfc j0 j1 y0 y1 atan2 copysign drem fdim fmax fmin fmod frexp hypot jn ldexp modf nextafter nexttoward remainder scalb scalbln yn fma infinite nan isinfinite isnan isfinite isnormal keys keys_unsorted has in inside contains to_entries from_entries with_entries sort add min max min_by max_by any all arrays objects iterables booleans numbers normals finites strings nulls values scalars unique reverse paths path indices builtins modulemeta input debug implode explode trim ltrim rtrim trimstr ltrimstr rtrimstr ascii_downcase ascii_upcase startswith endswith split splits join isempty have_decnum gmtime map map_values select flatten transpose combinations walk test match capture scan sub gsub'.split())\n    if isinstance(result, Node) and result.operation == 'call' and not result.arguments[1] and result.arguments[0] not in known:\n        raise CompileError('unknown filter')\n    return result\n\n\n_PREDEFINED_VARIABLES = {'ENV', 'JQ_BUILD_CONFIGURATION', 'ARGS', '__loc__'}\n\n\ndef _validate_variables(node: Filter, visible: frozenset[str] = frozenset()) -> None:\n    \"\"\"Check value-variable references against their lexical scope.\n\n    Bindings are query constructs: the source expression sees the incoming\n    scope, while the remainder sees a child scope containing the pattern's\n    names.  Walking the AST here keeps an undefined variable a compile error\nimport sys\nfrom pathlib import Path\n\nROOT = Path(__file__).parents[1]\nif str(ROOT) not in sys.path:\n    sys.path.insert(0, str(ROOT))\n\"\"\"Focused tests for the TEXT-003 regular-expression filters.\"\"\"\n\nimport json\nimport subprocess\nfrom pathlib import Path\n\n\nROOT = Path(__file__).parents[1]\n\n\ndef run_jq(program: str, input_value: object) -> tuple[int, list[object]]:\n    result = subprocess.run(\n        [str(ROOT / \"jq\"), \"-c\", program],\n        input=json.dumps(input_value, ensure_ascii=False) + \"\\n\",\n        capture_output=True,\n        text=True,\n        check=False,\n    )\n    return result.returncode, [json.loads(line) for line in result.stdout.splitlines()]\n\n\ndef test_test_maps_flags_and_global_match_emits_offsets() -> None:\n    assert run_jq('[test(\"foo\"), test(\"foo\"; \"i\")]', \"FOO\") == (0, [[False, True]])\n    assert run_jq('[match(\"foo\"; \"g\")]', \"foo bar foo\") == (0, [[\n        {\"offset\": 0, \"length\": 3, \"string\": \"foo\", \"captures\": []},\n        {\"offset\": 8, \"length\": 3, \"string\": \"foo\", \"captures\": []},\n    ]])\n\n\ndef test_named_and_unnamed_captures_are_preserved() -> None:\n    assert run_jq('match(\"(?<word>[a-z]+)-(\\\\\\\\d+)\")', \"abc-12\") == (0, [{\n        \"offset\": 0, \"length\": 6, \"string\": \"abc-12\",\n        \"captures\": [\n            {\"offset\": 0, \"length\": 3, \"string\": \"abc\", \"name\": \"word\"},\n            {\"offset\": 4, \"length\": 2, \"string\": \"12\", \"name\": None},\n        ],\n    }])\n    assert run_jq('capture(\"(?<word>[a-z]+)-(?<number>\\\\\\\\d+)\")', \"abc-12\") == (0, [{\"word\": \"abc\", \"number\": \"12\"}])\n\n\ndef test_scan_and_regex_split_preserve_stream_order() -> None:\n    assert run_jq('[scan(\"(a+)(b+)\")]', \"abaabbaaabbb\") == (0, [[['a', 'b'], ['aa', 'bb'], ['aaa', 'bbb']]])\n    assert run_jq('split(\", *\"; null)', \"ab,cd, ef\") == (0, [[\"ab\", \"cd\", \"ef\"]])\n    assert run_jq('[splits(\", *\")]', \"ab,cd,   ef\") == (0, [[\"ab\", \"cd\", \"ef\"]])\n\n\ndef test_substitution_interpolates_named_captures_and_supports_streams() -> None:\n    assert run_jq('gsub(\"(?<x>.)[^a]*\"; \"+\\\\(.x)-\")', \"Abcabc\") == (0, [\"+A-+a-\"])\n    assert run_jq('[sub(\"(?<a>.)\"; \"\\\\(.a|ascii_upcase)\", \"\\\\(.a|ascii_downcase)\")]', \"aB\") == (0, [[\"AB\", \"aB\"]])\n\n\ndef test_regex_filters_reject_non_string_input() -> None:\n    assert run_jq('test(\"x\")', 3)[0] == 5\n","exit_code":0,"status":"completed"}}
{"type":"item.started","item":{"id":"item_3","type":"command_execution","command":"/bin/bash -lc 'JQ=\"$PWD/jq\" python3 sources/run_conformance.py --select '\"'date|strftime|strptime|strflocaltime|gmtime|localtime|mktime' --json; JQ=\\\"\"'$PWD/jq\" python3 sources/run_conformance.py --select '\"'fromdate|todate|strptime|strftime|gmtime|mktime' --json\"","aggregated_output":"","exit_code":null,"status":"in_progress"}}
{"type":"item.completed","item":{"id":"item_3","type":"command_execution","command":"/bin/bash -lc 'JQ=\"$PWD/jq\" python3 sources/run_conformance.py --select '\"'date|strftime|strptime|strflocaltime|gmtime|localtime|mktime' --json; JQ=\\\"\"'$PWD/jq\" python3 sources/run_conformance.py --select '\"'fromdate|todate|strptime|strftime|gmtime|mktime' --json\"","aggregated_output":"{\n  \"candidate\": [\n    \"/mnt/c/Users/barlo/projects/drydock/uat/jq/runs/20260822.044627/build/jq/jq\"\n  ],\n  \"corpus\": \"jq.test\",\n  \"summary\": {\n    \"pass\": 12,\n    \"fail\": 2,\n    \"error\": 0,\n    \"skip\": 0\n  },\n  \"cases\": [\n    {\n      \"line\": 1855,\n      \"program\": \"mktime\",\n      \"status\": \"fail\",\n      \"detail\": \"program did not compile: jq: compile error: unknown filter\",\n      \"expect_failure\": false,\n      \"expected\": [\n        \"1726876800\"\n      ],\n      \"actual\": []\n    },\n    {\n      \"line\": 1859,\n      \"program\": \"gmtime\",\n      \"status\": \"fail\",\n      \"detail\": \"output mismatch\",\n      \"expect_failure\": false,\n      \"expected\": [\n        \"[2015,2,5,23,51,47,4,63]\"\n      ],\n      \"actual\": [\n        \"[2015,2,5,23,51,47,3,63]\"\n      ]\n    }\n  ]\n}\n{\n  \"candidate\": [\n    \"/mnt/c/Users/barlo/projects/drydock/uat/jq/runs/20260822.044627/build/jq/jq\"\n  ],\n  \"corpus\": \"jq.test\",\n  \"summary\": {\n    \"pass\": 9,\n    \"fail\": 2,\n    \"error\": 0,\n    \"skip\": 0\n  },\n  \"cases\": [\n    {\n      \"line\": 1855,\n      \"program\": \"mktime\",\n      \"status\": \"fail\",\n      \"detail\": \"program did not compile: jq: compile error: unknown filter\",\n      \"expect_failure\": false,\n      \"expected\": [\n        \"1726876800\"\n      ],\n      \"actual\": []\n    },\n    {\n      \"line\": 1859,\n      \"program\": \"gmtime\",\n      \"status\": \"fail\",\n      \"detail\": \"output mismatch\",\n      \"expect_failure\": false,\n      \"expected\": [\n        \"[2015,2,5,23,51,47,4,63]\"\n      ],\n      \"actual\": [\n        \"[2015,2,5,23,51,47,3,63]\"\n      ]\n    }\n  ]\n}\n","exit_code":1,"status":"failed"}}
{"type":"item.completed","item":{"id":"item_4","type":"agent_message","text":"The scoped checks already isolate two concrete gaps: `mktime` is not registered as a bare builtin, and `gmtime` uses Python’s Monday-based weekday instead of jq’s Sunday-based index. The existing date branch also needs the missing ISO aliases and correct local-time handling, so I’m addressing those together."}}
{"type":"item.started","item":{"id":"item_5","type":"file_change","changes":[{"path":"/mnt/c/Users/barlo/projects/drydock/uat/jq/runs/20260822.044627/build/jq/jq_interpreter/evaluator.py","kind":"update"},{"path":"/mnt/c/Users/barlo/projects/drydock/uat/jq/runs/20260822.044627/build/jq/jq_interpreter/parser.py","kind":"update"}],"status":"in_progress"}}
{"type":"item.completed","item":{"id":"item_5","type":"file_change","changes":[{"path":"/mnt/c/Users/barlo/projects/drydock/uat/jq/runs/20260822.044627/build/jq/jq_interpreter/evaluator.py","kind":"update"},{"path":"/mnt/c/Users/barlo/projects/drydock/uat/jq/runs/20260822.044627/build/jq/jq_interpreter/parser.py","kind":"update"}],"status":"completed"}}
{"type":"item.started","item":{"id":"item_6","type":"file_change","changes":[{"path":"/mnt/c/Users/barlo/projects/drydock/uat/jq/runs/20260822.044627/build/jq/jq_interpreter/evaluator.py","kind":"update"}],"status":"in_progress"}}
{"type":"item.completed","item":{"id":"item_6","type":"file_change","changes":[{"path":"/mnt/c/Users/barlo/projects/drydock/uat/jq/runs/20260822.044627/build/jq/jq_interpreter/evaluator.py","kind":"update"}],"status":"completed"}}
{"type":"item.started","item":{"id":"item_7","type":"command_execution","command":"/bin/bash -lc 'python3 -m pytest -q; JQ=\"$PWD/jq\" python3 sources/run_conformance.py --select '\"'date|strftime|strptime|strflocaltime|gmtime|localtime|mktime' --json; JQ=\\\"\"'$PWD/jq\" python3 sources/run_conformance.py --select '\"'fromdate|todate|strptime|strftime|gmtime|mktime' --json\"","aggregated_output":"","exit_code":null,"status":"in_progress"}}
{"type":"item.completed","item":{"id":"item_7","type":"command_execution","command":"/bin/bash -lc 'python3 -m pytest -q; JQ=\"$PWD/jq\" python3 sources/run_conformance.py --select '\"'date|strftime|strptime|strflocaltime|gmtime|localtime|mktime' --json; JQ=\\\"\"'$PWD/jq\" python3 sources/run_conformance.py --select '\"'fromdate|todate|strptime|strftime|gmtime|mktime' --json\"","aggregated_output":"........................................................................ [ 43%]\n........................................................................ [ 86%]\n.......................                                                  [100%]\n167 passed in 25.51s\n{\n  \"candidate\": [\n    \"/mnt/c/Users/barlo/projects/drydock/uat/jq/runs/20260822.044627/build/jq/jq\"\n  ],\n  \"corpus\": \"jq.test\",\n  \"summary\": {\n    \"pass\": 13,\n    \"fail\": 1,\n    \"error\": 0,\n    \"skip\": 0\n  },\n  \"cases\": [\n    {\n      \"line\": 1855,\n      \"program\": \"mktime\",\n      \"status\": \"fail\",\n      \"detail\": \"output mismatch\",\n      \"expect_failure\": false,\n      \"expected\": [\n        \"1726876800\"\n      ],\n      \"actual\": []\n    }\n  ]\n}\n{\n  \"candidate\": [\n    \"/mnt/c/Users/barlo/projects/drydock/uat/jq/runs/20260822.044627/build/jq/jq\"\n  ],\n  \"corpus\": \"jq.test\",\n  \"summary\": {\n    \"pass\": 10,\n    \"fail\": 1,\n    \"error\": 0,\n    \"skip\": 0\n  },\n  \"cases\": [\n    {\n      \"line\": 1855,\n      \"program\": \"mktime\",\n      \"status\": \"fail\",\n      \"detail\": \"output mismatch\",\n      \"expect_failure\": false,\n      \"expected\": [\n        \"1726876800\"\n      ],\n      \"actual\": []\n    }\n  ]\n}\n","exit_code":1,"status":"failed"}}
{"type":"item.completed","item":{"id":"item_8","type":"agent_message","text":"The project’s existing 167-test suite is green. The first acceptance slice is down to one edge case: jq accepts short broken-down arrays such as `[2024,8,21]` for `mktime`, defaulting omitted fields, while the current implementation still requires six fields. I’m correcting that boundary and rerunning the scoped checks."}}
{"type":"item.started","item":{"id":"item_9","type":"file_change","changes":[{"path":"/mnt/c/Users/barlo/projects/drydock/uat/jq/runs/20260822.044627/build/jq/jq_interpreter/evaluator.py","kind":"update"}],"status":"in_progress"}}
{"type":"item.completed","item":{"id":"item_9","type":"file_change","changes":[{"path":"/mnt/c/Users/barlo/projects/drydock/uat/jq/runs/20260822.044627/build/jq/jq_interpreter/evaluator.py","kind":"update"}],"status":"completed"}}
{"type":"item.started","item":{"id":"item_10","type":"command_execution","command":"/bin/bash -lc 'JQ=\"$PWD/jq\" python3 sources/run_conformance.py --select '\"'date|strftime|strptime|strflocaltime|gmtime|localtime|mktime' --json; JQ=\\\"\"'$PWD/jq\" python3 sources/run_conformance.py --select '\"'fromdate|todate|strptime|strftime|gmtime|mktime' --json; printf '%s\\\\n' '\\\"2015-03-05T23:51:47Z\\\"|fromdate' '1425599507|todate' '\\\"2015-03-05T23:51:47Z\\\"|strptime(\\\"%Y-%m-%dT%H:%M:%SZ\\\")' '1726876800|localtime' | while IFS= read -r p; do printf '%s\\\\n' \\\"\"'$p\"; done'","aggregated_output":"","exit_code":null,"status":"in_progress"}}
{"type":"item.completed","item":{"id":"item_10","type":"command_execution","command":"/bin/bash -lc 'JQ=\"$PWD/jq\" python3 sources/run_conformance.py --select '\"'date|strftime|strptime|strflocaltime|gmtime|localtime|mktime' --json; JQ=\\\"\"'$PWD/jq\" python3 sources/run_conformance.py --select '\"'fromdate|todate|strptime|strftime|gmtime|mktime' --json; printf '%s\\\\n' '\\\"2015-03-05T23:51:47Z\\\"|fromdate' '1425599507|todate' '\\\"2015-03-05T23:51:47Z\\\"|strptime(\\\"%Y-%m-%dT%H:%M:%SZ\\\")' '1726876800|localtime' | while IFS= read -r p; do printf '%s\\\\n' \\\"\"'$p\"; done'","aggregated_output":"{\n  \"candidate\": [\n    \"/mnt/c/Users/barlo/projects/drydock/uat/jq/runs/20260822.044627/build/jq/jq\"\n  ],\n  \"corpus\": \"jq.test\",\n  \"summary\": {\n    \"pass\": 14,\n    \"fail\": 0,\n    \"error\": 0,\n    \"skip\": 0\n  },\n  \"cases\": []\n}\n{\n  \"candidate\": [\n    \"/mnt/c/Users/barlo/projects/drydock/uat/jq/runs/20260822.044627/build/jq/jq\"\n  ],\n  \"corpus\": \"jq.test\",\n  \"summary\": {\n    \"pass\": 11,\n    \"fail\": 0,\n    \"error\": 0,\n    \"skip\": 0\n  },\n  \"cases\": []\n}\n\"2015-03-05T23:51:47Z\"|fromdate\n1425599507|todate\n\"2015-03-05T23:51:47Z\"|strptime(\"%Y-%m-%dT%H:%M:%SZ\")\n1726876800|localtime\n","exit_code":0,"status":"completed"}}
{"type":"item.started","item":{"id":"item_11","type":"file_change","changes":[{"path":"/mnt/c/Users/barlo/projects/drydock/uat/jq/tests/test_service_date_time.py","kind":"add"}],"status":"in_progress"}}
{"type":"item.completed","item":{"id":"item_11","type":"file_change","changes":[{"path":"/mnt/c/Users/barlo/projects/drydock/uat/jq/tests/test_service_date_time.py","kind":"add"}],"status":"completed"}}
{"type":"item.started","item":{"id":"item_12","type":"command_execution","command":"/bin/bash -lc 'python3 -m pytest -q; JQ=\"$PWD/jq\" python3 sources/run_conformance.py --select '\"'date|strftime|strptime|strflocaltime|gmtime|localtime|mktime' --json; JQ=\\\"\"'$PWD/jq\" python3 sources/run_conformance.py --select '\"'fromdate|todate|strptime|strftime|gmtime|mktime' --json; git diff --stat; git diff -- jq_interpreter/evaluator.py jq_interpreter/parser.py tests/test_service_date_time.py\"","aggregated_output":"","exit_code":null,"status":"in_progress"}}
{"type":"item.completed","item":{"id":"item_13","type":"agent_message","text":"Both declared conformance slices pass: 14/14 and 11/11, with zero failures or errors. The combined verification command exceeded the shell tool’s 30-second foreground window during the broader pytest run, so I’m splitting the final checks into bounded commands and will report their actual statuses."}}
{"type":"item.started","item":{"id":"item_14","type":"command_execution","command":"/bin/bash -lc 'python3 -m pytest -q tests/test_service_date_time.py tests/test_text_001_string_builtins.py; git diff --stat; git status --short'","aggregated_output":"","exit_code":null,"status":"in_progress"}}
{"type":"item.completed","item":{"id":"item_14","type":"command_execution","command":"/bin/bash -lc 'python3 -m pytest -q tests/test_service_date_time.py tests/test_text_001_string_builtins.py; git diff --stat; git status --short'","aggregated_output":"\nno tests ran in 0.01s\nERROR: file or directory not found: tests/test_service_date_time.py\n\n .../build/jq/jq_interpreter/evaluator.py           |  46 ++-\n .../build/jq/jq_interpreter/parser.py              |   2 +-\n .../evidence/commands/09-initial-ready.stdout.log  |   2 +-\n .../evidence/commands/10-initial-build-1.llm.log   | 229 -----------\n .../commands/10-initial-build-1.stderr.log         |   2 -\n .../commands/10-initial-build-1.stdout.log         | 418 +--------------------\n .../11-after-initial-build-build-status.stderr.log |   0\n .../11-after-initial-build-build-status.stdout.log | 141 -------\n ...12-after-initial-build-target-status.stderr.log |   0\n ...12-after-initial-build-target-status.stdout.log |  49 ---\n ...after-initial-build-workspace-status.stderr.log |   0\n ...after-initial-build-workspace-status.stdout.log |  16 -\n .../20260822.044627/workspace/targets/jq/ERRORS.md |  33 --\n .../workspace/targets/jq/MANIFEST.md               |  15 +-\n .../workspace/targets/jq/PROJECT_STATUS.jsonl      |   5 +-\n .../targets/jq/QuarterDeck/commanders_chair.html   |   9 +-\n .../workspace/targets/jq/STOP_NOW.md               |  13 -\n .../workspace/targets/jq/evidence/block-37.md      | 105 +-----\n 18 files changed, 69 insertions(+), 1016 deletions(-)\n M jq_interpreter/evaluator.py\n M jq_interpreter/parser.py\n M ../../evidence/commands/09-initial-ready.stdout.log\n D ../../evidence/commands/10-initial-build-1.llm.log\n M ../../evidence/commands/10-initial-build-1.stderr.log\n M ../../evidence/commands/10-initial-build-1.stdout.log\n D ../../evidence/commands/11-after-initial-build-build-status.stderr.log\n D ../../evidence/commands/11-after-initial-build-build-status.stdout.log\n D ../../evidence/commands/12-after-initial-build-target-status.stderr.log\n D ../../evidence/commands/12-after-initial-build-target-status.stdout.log\n D ../../evidence/commands/13-after-initial-build-workspace-status.stderr.log\n D ../../evidence/commands/13-after-initial-build-workspace-status.stdout.log\n D ../../workspace/targets/jq/ERRORS.md\n M ../../workspace/targets/jq/MANIFEST.md\n M ../../workspace/targets/jq/PROJECT_STATUS.jsonl\n M ../../workspace/targets/jq/QuarterDeck/commanders_chair.html\n D ../../workspace/targets/jq/STOP_NOW.md\n M ../../workspace/targets/jq/evidence/block-37.md\n?? ../../evidence/commands/superseded/20260823.113801/\n?? ../../workspace/logs/20260823.113802.284Z_jq_status.log\n?? ../../workspace/logs/20260823.113803.929Z_jq_build_codex.log\n?? ../../workspace/logs/20260823.113822.128Z_jq_build_codex.prompt.md\n?? ../../workspace/logs/20260823.113822.128Z_jq_build_codex.raw.jsonl\n?? ../../workspace/logs/20260823.113822.128Z_jq_build_codex.stderr.log\n?? ../../../../tests/test_service_date_time.py\n","exit_code":0,"status":"completed"}}
{"type":"item.started","item":{"id":"item_15","type":"command_execution","command":"/bin/bash -lc \"pwd; find /mnt/c/Users/barlo/projects/drydock/uat/jq/runs/20260822.044627 -name test_service_date_time.py -print; find . -maxdepth 2 -name 'test_service_date_time.py' -print; sed -n '1,20p' ../../../../tests/test_service_date_time.py 2>/dev/null || true\"","aggregated_output":"","exit_code":null,"status":"in_progress"}}
{"type":"item.completed","item":{"id":"item_15","type":"command_execution","command":"/bin/bash -lc \"pwd; find /mnt/c/Users/barlo/projects/drydock/uat/jq/runs/20260822.044627 -name test_service_date_time.py -print; find . -maxdepth 2 -name 'test_service_date_time.py' -print; sed -n '1,20p' ../../../../tests/test_service_date_time.py 2>/dev/null || true\"","aggregated_output":"\"\"\"Focused coverage for the TEXT-004 date and time filters.\"\"\"\n\nimport json\nimport os\nimport subprocess\nfrom pathlib import Path\n\n\nROOT = Path(__file__).parents[1]\n\n\ndef run_jq(program: str, input_value: object, *, timezone: str = \"UTC\") -> tuple[int, list[object]]:\n    environment = {**os.environ, \"TZ\": timezone}\n    result = subprocess.run(\n        [str(ROOT / \"jq\"), \"-c\", program],\n        input=json.dumps(input_value) + \"\\n\",\n        capture_output=True,\n        text=True,\n        env=environment,\n        check=False,\n","exit_code":0,"status":"completed"}}
{"type":"item.started","item":{"id":"item_16","type":"command_execution","command":"/bin/bash -lc 'realpath ../../../../tests/test_service_date_time.py; realpath tests; ls -l ../../../../tests/test_service_date_time.py; ls -l tests | tail -3'","aggregated_output":"","exit_code":null,"status":"in_progress"}}
{"type":"item.completed","item":{"id":"item_16","type":"command_execution","command":"/bin/bash -lc 'realpath ../../../../tests/test_service_date_time.py; realpath tests; ls -l ../../../../tests/test_service_date_time.py; ls -l tests | tail -3'","aggregated_output":"-rwxrwxrwx 1 barlo barlo 1878 Aug 22 22:37 test_value_002_access.py\n-rwxrwxrwx 1 barlo barlo 1954 Aug 22 22:42 test_value_003_slices_iteration.py\n-rwxrwxrwx 1 barlo barlo 1591 Aug 22 22:48 test_value_004.py\n","exit_code":0,"status":"completed"}}
{"type":"item.completed","item":{"id":"item_17","type":"agent_message","text":"I caught a path-placement issue before completion: the new focused test file was created in the parent project’s `tests/` directory rather than this build directory, so it was not part of the build and the targeted test command correctly reported it missing. I’m relocating it into the authorized build tree and removing the misplaced copy."}}
{"type":"item.completed","item":{"id":"item_12","type":"command_execution","command":"/bin/bash -lc 'python3 -m pytest -q; JQ=\"$PWD/jq\" python3 sources/run_conformance.py --select '\"'date|strftime|strptime|strflocaltime|gmtime|localtime|mktime' --json; JQ=\\\"\"'$PWD/jq\" python3 sources/run_conformance.py --select '\"'fromdate|todate|strptime|strftime|gmtime|mktime' --json; git diff --stat; git diff -- jq_interpreter/evaluator.py jq_interpreter/parser.py tests/test_service_date_time.py\"","aggregated_output":"........................................................................ [ 43%]\n........................................................................ [ 86%]\n.......................                                                  [100%]\n167 passed in 60.12s (0:01:00)\n{\n  \"candidate\": [\n    \"/mnt/c/Users/barlo/projects/drydock/uat/jq/runs/20260822.044627/build/jq/jq\"\n  ],\n  \"corpus\": \"jq.test\",\n  \"summary\": {\n    \"pass\": 14,\n    \"fail\": 0,\n    \"error\": 0,\n    \"skip\": 0\n  },\n  \"cases\": []\n}\n{\n  \"candidate\": [\n    \"/mnt/c/Users/barlo/projects/drydock/uat/jq/runs/20260822.044627/build/jq/jq\"\n  ],\n  \"corpus\": \"jq.test\",\n  \"summary\": {\n    \"pass\": 11,\n    \"fail\": 0,\n    \"error\": 0,\n    \"skip\": 0\n  },\n  \"cases\": []\n}\n .../build/jq/jq_interpreter/evaluator.py           |  46 ++-\n .../build/jq/jq_interpreter/parser.py              |   2 +-\n .../evidence/commands/09-initial-ready.stdout.log  |   2 +-\n .../evidence/commands/10-initial-build-1.llm.log   | 229 -----------\n .../commands/10-initial-build-1.stderr.log         |   2 -\n .../commands/10-initial-build-1.stdout.log         | 418 +--------------------\n .../11-after-initial-build-build-status.stderr.log |   0\n .../11-after-initial-build-build-status.stdout.log | 141 -------\n ...12-after-initial-build-target-status.stderr.log |   0\n ...12-after-initial-build-target-status.stdout.log |  49 ---\n ...after-initial-build-workspace-status.stderr.log |   0\n ...after-initial-build-workspace-status.stdout.log |  16 -\n .../20260822.044627/workspace/targets/jq/ERRORS.md |  33 --\n .../workspace/targets/jq/MANIFEST.md               |  15 +-\n .../workspace/targets/jq/PROJECT_STATUS.jsonl      |   5 +-\n .../targets/jq/QuarterDeck/commanders_chair.html   |   9 +-\n .../workspace/targets/jq/STOP_NOW.md               |  13 -\n .../workspace/targets/jq/evidence/block-37.md      | 105 +-----\n 18 files changed, 69 insertions(+), 1016 deletions(-)\ndiff --git a/runs/20260822.044627/build/jq/jq_interpreter/evaluator.py b/runs/20260822.044627/build/jq/jq_interpreter/evaluator.py\nindex d0f5692..10d5bf3 100644\n--- a/runs/20260822.044627/build/jq/jq_interpreter/evaluator.py\n+++ b/runs/20260822.044627/build/jq/jq_interpreter/evaluator.py\n@@ -2,6 +2,8 @@\n import json\n import math\n import datetime\n+import calendar\n+import time\n import itertools\n import sys\n import re\n@@ -1477,16 +1479,34 @@ def _call(name,args,value,env):\n         return\n     if name == 'input':\n         raise RuntimeError('break')\n+    if name in ('fromdateiso8601', 'fromdate'):\n+        if not isinstance(value, str):\n+            raise RuntimeError('date input must be a string')\n+        try:\n+            parsed = datetime.datetime.strptime(value, '%Y-%m-%dT%H:%M:%SZ')\n+        except ValueError as error:\n+            raise RuntimeError('date input must be in ISO 8601 format') from error\n+        yield calendar.timegm(parsed.timetuple()); return\n+    if name in ('todateiso8601', 'todate'):\n+        if not isinstance(value, (int, float)) or isinstance(value, bool):\n+            raise RuntimeError('date input must be a number')\n+        yield datetime.datetime.fromtimestamp(float(value), datetime.timezone.utc).strftime('%Y-%m-%dT%H:%M:%SZ'); return\n     if name in ('strftime', 'strflocaltime'):\n         if not args or not isinstance(_one(args[0], value, env), str):\n             raise RuntimeError(f'{name}/1 requires a string format')\n         if isinstance(value, (int, float)) and not isinstance(value, bool):\n-            dt = datetime.datetime.fromtimestamp(float(value), datetime.timezone.utc)\n+            timestamp = float(value)\n+            dt = (datetime.datetime.fromtimestamp(timestamp, datetime.timezone.utc)\n+                  if name == 'strftime' else datetime.datetime.fromtimestamp(timestamp).astimezone())\n         elif isinstance(value, list) and len(value) >= 3 and all(isinstance(x, (int, float)) for x in value[:3]):\n-            dt = datetime.datetime(int(value[0]), int(value[1]) + 1, int(value[2]),\n-                                   int(value[3]) if len(value) > 3 else 0,\n-                                   int(value[4]) if len(value) > 4 else 0,\n-                                   int(value[5]) if len(value) > 5 else 0)\n+            try:\n+                dt = datetime.datetime(int(value[0]), int(value[1]) + 1, int(value[2]),\n+                                       int(value[3]) if len(value) > 3 else 0,\n+                                       int(value[4]) if len(value) > 4 else 0,\n+                                       int(value[5]) if len(value) > 5 else 0,\n+                                       tzinfo=(datetime.timezone.utc if name == 'strftime' else None))\n+            except (TypeError, ValueError, OverflowError) as error:\n+                raise RuntimeError(f'{name}/1 requires parsed datetime inputs') from error\n         else:\n             raise RuntimeError(f'{name}/1 requires parsed datetime inputs')\n         for fmt in _node(args[0], value, env):\n@@ -1494,11 +1514,15 @@ def _call(name,args,value,env):\n                 raise RuntimeError(f'{name}/1 requires a string format')\n             yield dt.strftime(fmt)\n         return\n-    if name == 'mktime':\n-        if not isinstance(value, list) or len(value) < 6 or not all(isinstance(x, (int, float)) for x in value[:6]):\n-            raise RuntimeError('mktime requires parsed datetime inputs')\n-        dt = datetime.datetime(int(value[0]), int(value[1]) + 1, int(value[2]), int(value[3]), int(value[4]), int(value[5]), tzinfo=datetime.timezone.utc)\n-        yield int(dt.timestamp()); return\n+    if name in ('mktime', 'localtime'):\n+        if not isinstance(value, list) or len(value) < 3 or not all(isinstance(x, (int, float)) for x in value[:min(len(value), 6)]):\n+            raise RuntimeError(f'{name} requires parsed datetime inputs')\n+        if name == 'mktime':\n+            fields = [int(value[index]) if index < len(value) else 0 for index in range(6)]\n+            yield calendar.timegm((fields[0], fields[1] + 1, fields[2], fields[3], fields[4], fields[5], 0, 0, 0)); return\n+        broken = time.localtime(float(value))\n+        yield [broken.tm_year, broken.tm_mon - 1, broken.tm_mday, broken.tm_hour,\n+               broken.tm_min, broken.tm_sec, (broken.tm_wday + 1) % 7, broken.tm_yday - 1]; return\n     if name == 'strptime':\n         fmt = _one(args[0], value, env) if args else None\n         if not isinstance(value, str) or not isinstance(fmt, str):\n@@ -1827,7 +1851,7 @@ def _call(name,args,value,env):\n         stamp = float(value)\n         dt = datetime.datetime.fromtimestamp(stamp, datetime.timezone.utc)\n         yield [dt.year, dt.month - 1, dt.day, dt.hour, dt.minute,\n-               dt.second + (stamp - int(stamp)), dt.weekday(),\n+               dt.second + (stamp - int(stamp)), (dt.weekday() + 1) % 7,\n                dt.timetuple().tm_yday - 1]\n         return\n     if name == 'pow': yield math.pow(_one(args[0],value,env), _one(args[1],value,env)); return\ndiff --git a/runs/20260822.044627/build/jq/jq_interpreter/parser.py b/runs/20260822.044627/build/jq/jq_interpreter/parser.py\nindex 2b94548..f0b5267 100644\n--- a/runs/20260822.044627/build/jq/jq_interpreter/parser.py\n+++ b/runs/20260822.044627/build/jq/jq_interpreter/parser.py\n@@ -298,7 +298,7 @@ def parse(source: str) -> Filter:\n     # Bare calls are valid jq builtins as well as user definitions supplied by\n     # the builtin library.  Retain compile-time rejection for an unknown bare\n     # identifier while registering the standard library's zero-argument names.\n-    known = set('empty error length type utf8bytelength not tonumber toboolean tostring tojson abs fabs floor ceil round trunc sin cos tan asin acos atan sinh cosh tanh asinh acosh atanh log log10 log1p log2 logb exp exp2 exp10 expm1 pow cbrt gamma lgamma tgamma erf erfc j0 j1 y0 y1 atan2 copysign drem fdim fmax fmin fmod frexp hypot jn ldexp modf nextafter nexttoward remainder scalb scalbln yn fma infinite nan isinfinite isnan isfinite isnormal keys keys_unsorted has in inside contains to_entries from_entries with_entries sort add min max min_by max_by any all arrays objects iterables booleans numbers normals finites strings nulls values scalars unique reverse paths path indices builtins modulemeta input debug implode explode trim ltrim rtrim trimstr ltrimstr rtrimstr ascii_downcase ascii_upcase startswith endswith split splits join isempty have_decnum gmtime map map_values select flatten transpose combinations walk test match capture scan sub gsub'.split())\n+    known = set('empty error length type utf8bytelength not tonumber toboolean tostring tojson abs fabs floor ceil round trunc sin cos tan asin acos atan sinh cosh tanh asinh acosh atanh log log10 log1p log2 logb exp exp2 exp10 expm1 pow cbrt gamma lgamma tgamma erf erfc j0 j1 y0 y1 atan2 copysign drem fdim fmax fmin fmod frexp hypot jn ldexp modf nextafter nexttoward remainder scalb scalbln yn fma infinite nan isinfinite isnan isfinite isnormal keys keys_unsorted has in inside contains to_entries from_entries with_entries sort add min max min_by max_by any all arrays objects iterables booleans numbers normals finites strings nulls values scalars unique reverse paths path indices builtins modulemeta input debug implode explode trim ltrim rtrim trimstr ltrimstr rtrimstr ascii_downcase ascii_upcase startswith endswith split splits join isempty have_decnum fromdate todate fromdateiso8601 todateiso8601 strftime strflocaltime strptime gmtime localtime mktime map map_values select flatten transpose combinations walk test match capture scan sub gsub'.split())\n     if isinstance(result, Node) and result.operation == 'call' and not result.arguments[1] and result.arguments[0] not in known:\n         raise CompileError('unknown filter')\n     return result\n","exit_code":0,"status":"completed"}}
{"type":"item.started","item":{"id":"item_18","type":"file_change","changes":[{"path":"/mnt/c/Users/barlo/projects/drydock/uat/jq/runs/20260822.044627/build/jq/tests/test_service_date_time.py","kind":"add"},{"path":"/mnt/c/Users/barlo/projects/drydock/uat/jq/tests/test_service_date_time.py","kind":"delete"}],"status":"in_progress"}}
{"type":"item.completed","item":{"id":"item_18","type":"file_change","changes":[{"path":"/mnt/c/Users/barlo/projects/drydock/uat/jq/runs/20260822.044627/build/jq/tests/test_service_date_time.py","kind":"add"},{"path":"/mnt/c/Users/barlo/projects/drydock/uat/jq/tests/test_service_date_time.py","kind":"delete"}],"status":"completed"}}
{"type":"item.started","item":{"id":"item_19","type":"command_execution","command":"/bin/bash -lc 'realpath tests/test_service_date_time.py; test -e tests/test_service_date_time.py && echo build-present || echo build-missing; test -e ../../../../tests/test_service_date_time.py && echo parent-present || echo parent-missing'","aggregated_output":"","exit_code":null,"status":"in_progress"}}
{"type":"item.completed","item":{"id":"item_19","type":"command_execution","command":"/bin/bash -lc 'realpath tests/test_service_date_time.py; test -e tests/test_service_date_time.py && echo build-present || echo build-missing; test -e ../../../../tests/test_service_date_time.py && echo parent-present || echo parent-missing'","aggregated_output":"/mnt/c/Users/barlo/projects/drydock/uat/jq/runs/20260822.044627/build/jq/tests/test_service_date_time.py\nbuild-present\nparent-missing\n","exit_code":0,"status":"completed"}}
{"type":"item.started","item":{"id":"item_20","type":"command_execution","command":"/bin/bash -lc 'python3 -m pytest -q tests/test_service_date_time.py'","aggregated_output":"","exit_code":null,"status":"in_progress"}}
{"type":"item.completed","item":{"id":"item_20","type":"command_execution","command":"/bin/bash -lc 'python3 -m pytest -q tests/test_service_date_time.py'","aggregated_output":".F.                                                                      [100%]\n=================================== FAILURES ===================================\n_____________ test_broken_down_time_filters_use_jq_calendar_shape ______________\n\n    def test_broken_down_time_filters_use_jq_calendar_shape() -> None:\n        broken_down = [2015, 2, 5, 23, 51, 47, 4, 63]\n        assert run_jq('strptime(\"%Y-%m-%dT%H:%M:%SZ\")', \"2015-03-05T23:51:47Z\") == (0, [broken_down])\n        assert run_jq('strftime(\"%Y-%m-%dT%H:%M:%SZ\")', broken_down) == (0, [\"2015-03-05T23:51:47Z\"])\n        assert run_jq('strflocaltime(\"%Y-%m-%dT%H:%M:%SZ\")', broken_down) == (0, [\"2015-03-05T23:51:47Z\"])\n        assert run_jq(\"gmtime\", 1425599507) == (0, [broken_down])\n>       assert run_jq(\"localtime\", 1425599507) == (0, [broken_down])\nE       assert (5, []) == (0, [[2015, 2...51, 47, ...]])\nE         \nE         At index 0 diff: 5 != 0\nE         Use -v to get more diff\n\ntests/test_service_date_time.py:37: AssertionError\n=========================== short test summary info ============================\nFAILED tests/test_service_date_time.py::test_broken_down_time_filters_use_jq_calendar_shape\n1 failed, 2 passed in 5.07s\n","exit_code":1,"status":"failed"}}
{"type":"item.started","item":{"id":"item_21","type":"command_execution","command":"/bin/bash -lc \"printf '1425599507\\\\n' | ./jq -c localtime; printf '1425599507\\\\n' | ./jq -c localtime 2>&1\"","aggregated_output":"","exit_code":null,"status":"in_progress"}}
{"type":"item.completed","item":{"id":"item_21","type":"command_execution","command":"/bin/bash -lc \"printf '1425599507\\\\n' | ./jq -c localtime; printf '1425599507\\\\n' | ./jq -c localtime 2>&1\"","aggregated_output":"jq: runtime error: localtime requires parsed datetime inputs\njq: runtime error: localtime requires parsed datetime inputs\n","exit_code":5,"status":"failed"}}
{"type":"item.started","item":{"id":"item_22","type":"file_change","changes":[{"path":"/mnt/c/Users/barlo/projects/drydock/uat/jq/runs/20260822.044627/build/jq/jq_interpreter/evaluator.py","kind":"update"}],"status":"in_progress"}}
{"type":"item.completed","item":{"id":"item_22","type":"file_change","changes":[{"path":"/mnt/c/Users/barlo/projects/drydock/uat/jq/runs/20260822.044627/build/jq/jq_interpreter/evaluator.py","kind":"update"}],"status":"completed"}}
{"type":"item.started","item":{"id":"item_23","type":"command_execution","command":"/bin/bash -lc 'python3 -m pytest -q tests/test_service_date_time.py; JQ=\"$PWD/jq\" python3 sources/run_conformance.py --select '\"'date|strftime|strptime|strflocaltime|gmtime|localtime|mktime' --json; JQ=\\\"\"'$PWD/jq\" python3 sources/run_conformance.py --select '\"'fromdate|todate|strptime|strftime|gmtime|mktime' --json\"","aggregated_output":"","exit_code":null,"status":"in_progress"}}
{"type":"item.completed","item":{"id":"item_23","type":"command_execution","command":"/bin/bash -lc 'python3 -m pytest -q tests/test_service_date_time.py; JQ=\"$PWD/jq\" python3 sources/run_conformance.py --select '\"'date|strftime|strptime|strflocaltime|gmtime|localtime|mktime' --json; JQ=\\\"\"'$PWD/jq\" python3 sources/run_conformance.py --select '\"'fromdate|todate|strptime|strftime|gmtime|mktime' --json\"","aggregated_output":"...                                                                      [100%]\n3 passed in 6.01s\n{\n  \"candidate\": [\n    \"/mnt/c/Users/barlo/projects/drydock/uat/jq/runs/20260822.044627/build/jq/jq\"\n  ],\n  \"corpus\": \"jq.test\",\n  \"summary\": {\n    \"pass\": 14,\n    \"fail\": 0,\n    \"error\": 0,\n    \"skip\": 0\n  },\n  \"cases\": []\n}\n{\n  \"candidate\": [\n    \"/mnt/c/Users/barlo/projects/drydock/uat/jq/runs/20260822.044627/build/jq/jq\"\n  ],\n  \"corpus\": \"jq.test\",\n  \"summary\": {\n    \"pass\": 11,\n    \"fail\": 0,\n    \"error\": 0,\n    \"skip\": 0\n  },\n  \"cases\": []\n}\n","exit_code":0,"status":"completed"}}
{"type":"item.completed","item":{"id":"item_24","type":"agent_message","text":"The focused date/time tests now pass 3/3, and both declared acceptance checks pass with zero failures/errors (14/14 and 11/11). I’m doing one final repository test-suite run and checking the exact build-local file list for handoff."}}
{"type":"item.started","item":{"id":"item_25","type":"command_execution","command":"/bin/bash -lc 'python3 -m pytest -q'","aggregated_output":"","exit_code":null,"status":"in_progress"}}
{"type":"item.completed","item":{"id":"item_25","type":"command_execution","command":"/bin/bash -lc 'python3 -m pytest -q'","aggregated_output":"........................................................................ [ 42%]\n........................................................................ [ 84%]\n..........................                                               [100%]\n170 passed in 31.27s\n","exit_code":0,"status":"completed"}}
{"type":"item.completed","item":{"id":"item_26","type":"agent_message","text":"RESULT: SUCCESS\n\nFILES CHANGED:\n- jq_interpreter/evaluator.py\n- jq_interpreter/parser.py\n- tests/test_service_date_time.py\n\nSUMMARY:\nImplemented UTC date parsing, formatting, local/UTC time conversion, `mktime`, and ISO aliases. All 170 tests pass; acceptance slices pass 14/14 and 11/11.\n\nBLOCKERS:\n- None"}}
{"type":"turn.completed","usage":{"input_tokens":1995382,"cached_input_tokens":1896704,"cache_write_input_tokens":0,"output_tokens":8283,"reasoning_output_tokens":1298}}