Run artifact

evidence/provider_raw/20260823.114910.696Z_jq_build_codex.raw.jsonl

{"type":"thread.started","thread_id":"01a02e74-0764-7e63-b6d0-88878b186130"}
{"type":"turn.started"}
{"type":"item.completed","item":{"id":"item_0","type":"agent_message","text":"I’ll inspect the existing interpreter and identify where runtime diagnostics, stderr emission, and process exit handling belong. Then I’ll implement the smallest scoped change, add focused tests in the project’s existing style if a test location exists, and run the declared diagnostics conformance gate."}}
{"type":"item.started","item":{"id":"item_1","type":"command_execution","command":"/bin/bash -lc \"pwd && rg --files -g '\"'!sources/**'\"' -g '\"'!*.pyc'\"' | sort | head -200 && printf '\\\\n--- source inventory ---\\\\n' && find . -maxdepth 2 -type f -not -path './sources/*' -print | sort\"","aggregated_output":"","exit_code":null,"status":"in_progress"}}
{"type":"item.completed","item":{"id":"item_1","type":"command_execution","command":"/bin/bash -lc \"pwd && rg --files -g '\"'!sources/**'\"' -g '\"'!*.pyc'\"' | sort | head -200 && printf '\\\\n--- source inventory ---\\\\n' && find . -maxdepth 2 -type f -not -path './sources/*' -print | sort\"","aggregated_output":"/mnt/c/Users/barlo/projects/drydock/uat/jq/runs/20260822.044627/build/jq\njq\njq_interpreter/__init__.py\njq_interpreter/architecture.py\njq_interpreter/ast.py\njq_interpreter/builtins.py\njq_interpreter/cli.py\njq_interpreter/diagnostics.py\njq_interpreter/errors.py\njq_interpreter/evaluator.py\njq_interpreter/interpreter.py\njq_interpreter/lexer.py\njq_interpreter/parser.py\njq_interpreter/paths.py\njq_interpreter/runtime.py\ntests/conftest.py\ntests/test_architecture.py\ntests/test_conf_001_acceptance.py\ntests/test_conformance_assets.py\ntests/test_core_002_composition.py\ntests/test_core_003_errors.py\ntests/test_core_004_truthiness_comparison.py\ntests/test_data_002_sorting.py\ntests/test_data_003_entries_containment.py\ntests/test_flow_001_operators.py\ntests/test_flow_002_boolean_alternative.py\ntests/test_flow_003_conditionals_exceptions.py\ntests/test_flow_004_labels_breaks.py\ntests/test_flow_005_reductions_iteration.py\ntests/test_flow_006_recursive_generators.py\ntests/test_func_002_parameters.py\ntests/test_json_io.py\ntests/test_lexer.py\ntests/test_parse_002.py\ntests/test_path_001_discovery_projection.py\ntests/test_path_002_access_mutation.py\ntests/test_service_date_time.py\ntests/test_service_lexical_bindings.py\ntests/test_stream_evaluator.py\ntests/test_text_001_string_builtins.py\ntests/test_text_002_formats.py\ntests/test_text_003_regex.py\ntests/test_value_001.py\ntests/test_value_002_access.py\ntests/test_value_003_slices_iteration.py\ntests/test_value_004.py\n\n--- source inventory ---\n./jq\n./jq_interpreter/__init__.py\n./jq_interpreter/architecture.py\n./jq_interpreter/ast.py\n./jq_interpreter/builtins.py\n./jq_interpreter/cli.py\n./jq_interpreter/diagnostics.py\n./jq_interpreter/errors.py\n./jq_interpreter/evaluator.py\n./jq_interpreter/interpreter.py\n./jq_interpreter/lexer.py\n./jq_interpreter/parser.py\n./jq_interpreter/paths.py\n./jq_interpreter/runtime.py\n./tests/conftest.py\n./tests/test_architecture.py\n./tests/test_conf_001_acceptance.py\n./tests/test_conformance_assets.py\n./tests/test_core_002_composition.py\n./tests/test_core_003_errors.py\n./tests/test_core_004_truthiness_comparison.py\n./tests/test_data_002_sorting.py\n./tests/test_data_003_entries_containment.py\n./tests/test_flow_001_operators.py\n./tests/test_flow_002_boolean_alternative.py\n./tests/test_flow_003_conditionals_exceptions.py\n./tests/test_flow_004_labels_breaks.py\n./tests/test_flow_005_reductions_iteration.py\n./tests/test_flow_006_recursive_generators.py\n./tests/test_func_002_parameters.py\n./tests/test_json_io.py\n./tests/test_lexer.py\n./tests/test_parse_002.py\n./tests/test_path_001_discovery_projection.py\n./tests/test_path_002_access_mutation.py\n./tests/test_service_date_time.py\n./tests/test_service_lexical_bindings.py\n./tests/test_stream_evaluator.py\n./tests/test_text_001_string_builtins.py\n./tests/test_text_002_formats.py\n./tests/test_text_003_regex.py\n./tests/test_value_001.py\n./tests/test_value_002_access.py\n./tests/test_value_003_slices_iteration.py\n./tests/test_value_004.py\n","exit_code":0,"status":"completed"}}
{"type":"item.started","item":{"id":"item_2","type":"command_execution","command":"/bin/bash -lc \"sed -n '1,240p' jq_interpreter/diagnostics.py && printf '\\\\n--- cli ---\\\\n' && sed -n '1,280p' jq_interpreter/cli.py && printf '\\\\n--- evaluator relevant ---\\\\n' && rg -n \\\"debug|stderr|halt|Builtin|Error|emit|stdout|stderr|exit|Runtime\\\" jq_interpreter tests | head -240\"","aggregated_output":"","exit_code":null,"status":"in_progress"}}
{"type":"item.completed","item":{"id":"item_2","type":"command_execution","command":"/bin/bash -lc \"sed -n '1,240p' jq_interpreter/diagnostics.py && printf '\\\\n--- cli ---\\\\n' && sed -n '1,280p' jq_interpreter/cli.py && printf '\\\\n--- evaluator relevant ---\\\\n' && rg -n \\\"debug|stderr|halt|Builtin|Error|emit|stdout|stderr|exit|Runtime\\\" jq_interpreter tests | head -240\"","aggregated_output":"\"\"\"Process diagnostics and exit-code policy.\"\"\"\n\nimport sys\nfrom typing import TextIO\n\nfrom .errors import CompileError, RuntimeError\nfrom .architecture import COMPILE_EXIT, RUNTIME_EXIT\n\n\ndef report_compile_error(error: CompileError, stream: TextIO = sys.stderr) -> int:\n    print(f\"jq: compile error: {error}\", file=stream)\n    return COMPILE_EXIT\n\n\ndef report_runtime_error(error: RuntimeError, stream: TextIO = sys.stderr) -> int:\n    print(f\"jq: runtime error: {error}\", file=stream)\n    return RUNTIME_EXIT\n\n--- cli ---\n\"\"\"Executable boundary for ``jq -c '<program>'``.\"\"\"\n\nimport argparse\nimport json\nimport math\nimport sys\nfrom collections.abc import Iterator\n\nfrom .diagnostics import report_compile_error, report_runtime_error\nfrom .errors import CompileError, FLOW_RUNTIME_ERRORS, RuntimeError\nfrom .interpreter import Interpreter, parse_input_records\n\n# The conformance corpus deliberately exercises jq's deep-value limit with\n# values around ten thousand levels deep.  Python's default limit is lower\n# than that and would turn valid jq processing into an uncaught RecursionError\n# while encoding an intermediate value.\nsys.setrecursionlimit(100000)\n\n\ndef _inputs() -> Iterator[object]:\n    yield from parse_input_records(sys.stdin.read())\n\n\ndef _json_output(value: object) -> object:\n    \"\"\"Convert jq's non-finite numbers to its JSON output representation.\n\n    jq represents NaN and infinities as ``null`` when emitting JSON.  Doing this\n    recursively also covers values nested in arrays and objects.\n    \"\"\"\n    if isinstance(value, float) and not math.isfinite(value):\n        return None\n    if isinstance(value, list):\n        return [_json_output(item) for item in value]\n    if isinstance(value, dict):\n        return {key: _json_output(item) for key, item in value.items()}\n    return value\n\n\ndef main(argv: list[str] | None = None) -> int:\n    arguments = argparse.ArgumentParser(prog=\"jq\")\n    arguments.add_argument(\"-c\", action=\"store_true\")\n    arguments.add_argument(\"program\")\n    options = arguments.parse_args(argv)\n    try:\n        interpreter = Interpreter(options.program)\n    except CompileError as error:\n        return report_compile_error(error)\n    try:\n        for output in interpreter.run_records(_inputs()):\n            from .evaluator import _deep_json_dumps\n            print(_deep_json_dumps(output), flush=True)\n    except FLOW_RUNTIME_ERRORS + (json.JSONDecodeError,) as error:\n        return report_runtime_error(RuntimeError(str(error)))\n    return 0\n\n--- evaluator relevant ---\ntests/test_core_003_errors.py:24:    assert result.stdout == \"\"\ntests/test_core_003_errors.py:30:    assert result.stdout == \"\"\ntests/test_core_003_errors.py:36:    assert [json.loads(line) for line in result.stdout.splitlines()] == [\"x\"]\ntests/test_core_003_errors.py:39:def test_uncaught_runtime_error_has_runtime_exit_status() -> None:\ntests/test_core_003_errors.py:47:    assert [json.loads(line) for line in result.stdout.splitlines()] == [1]\ntests/test_core_003_errors.py:53:    assert [json.loads(line) for line in result.stdout.splitlines()] == [1]\ntests/test_value_004.py:18:    outputs = [json.loads(line) for line in process.stdout.splitlines()]\ntests/test_value_004.py:44:def test_math_functions_and_invalid_conversion_exit_runtime() -> None:\ntests/test_data_002_sorting.py:19:    assert result.returncode == 0, result.stderr\ntests/test_data_002_sorting.py:20:    return [json.loads(line) for line in result.stdout.splitlines()]\ntests/test_service_date_time.py:21:    return result.returncode, [json.loads(line) for line in result.stdout.splitlines()]\ntests/test_stream_evaluator.py:22:    assert result.returncode == 0, result.stderr\ntests/test_stream_evaluator.py:23:    return [json.loads(line) for line in result.stdout.splitlines()]\ntests/test_core_004_truthiness_comparison.py:22:    return [json.loads(line) for line in result.stdout.splitlines()]\ntests/test_core_002_composition.py:19:    assert result.returncode == 0, result.stderr\ntests/test_core_002_composition.py:20:    return [json.loads(line) for line in result.stdout.splitlines()]\ntests/test_flow_003_conditionals_exceptions.py:22:    return [json.loads(line) for line in result.stdout.splitlines()]\ntests/test_flow_003_conditionals_exceptions.py:61:def test_uncaught_error_after_output_keeps_partial_stdout_and_status() -> None:\njq_interpreter/__init__.py:3:from .errors import CompileError, RuntimeError\njq_interpreter/__init__.py:7:__all__ = [\"CompileError\", \"Interpreter\", \"MODULE_BOUNDARIES\", \"RuntimeError\"]\ntests/test_flow_001_operators.py:18:    return result.returncode, [json.loads(line) for line in result.stdout.splitlines()]\ntests/test_flow_004_labels_breaks.py:3:from jq_interpreter.errors import CompileError\ntests/test_flow_004_labels_breaks.py:13:    with pytest.raises(CompileError):\ntests/test_flow_004_labels_breaks.py:18:    with pytest.raises(CompileError):\ntests/test_flow_006_recursive_generators.py:9:def test_while_emits_qualifying_values_until_condition_fails() -> None:\ntests/test_flow_006_recursive_generators.py:13:def test_until_emits_only_the_first_value_satisfying_condition() -> None:\ntests/test_value_003_slices_iteration.py:23:    return [json.loads(line) for line in result.stdout.splitlines()]\ntests/test_path_002_access_mutation.py:4:from jq_interpreter.errors import RuntimeError as JqRuntimeError\ntests/test_path_002_access_mutation.py:30:    with pytest.raises(JqRuntimeError):\ntests/test_path_002_access_mutation.py:35:    with pytest.raises(JqRuntimeError):\ntests/test_path_002_access_mutation.py:68:    with pytest.raises(JqRuntimeError):\ntests/test_data_003_entries_containment.py:19:    assert result.returncode == 0, result.stderr\ntests/test_data_003_entries_containment.py:20:    return [json.loads(line) for line in result.stdout.splitlines()]\ntests/test_flow_002_boolean_alternative.py:19:    return result.returncode, [json.loads(line) for line in result.stdout.splitlines()]\ntests/test_service_lexical_bindings.py:48:    assert json.loads(result.stdout or \"[]\") == []\ntests/test_parse_002.py:7:from jq_interpreter.errors import CompileError\ntests/test_parse_002.py:27:    assert json.loads(result.stdout) == \"Aa\\r\\n\\t\\b\\fμ\"\ntests/test_parse_002.py:33:    assert json.loads(result.stdout) == \"interpolation\"\ntests/test_parse_002.py:47:    assert json.loads(result.stdout) == expected\ntests/test_parse_002.py:51:    with pytest.raises(CompileError):\njq_interpreter/runtime.py:1:\"\"\"Runtime value and stream contracts.\"\"\"\ntests/test_json_io.py:26:    assert result.stdout.splitlines() == inputs.splitlines()\ntests/test_json_io.py:32:    assert result.stdout.splitlines() == [\"1\", \"2\", \"3\"]\ntests/test_json_io.py:39:    assert json.loads(result.stdout) == json.loads(input_text)\ntests/test_json_io.py:40:    assert len(result.stdout.splitlines()) == 1\ntests/test_json_io.py:46:    assert [json.loads(line) for line in result.stdout.splitlines()] == [\ntests/test_json_io.py:52:def test_inputs_emits_only_values_after_the_current_input() -> None:\ntests/test_json_io.py:55:    assert [json.loads(line) for line in result.stdout.splitlines()] == [2, 3]\ntests/test_json_io.py:58:def test_input_emits_the_next_value_without_replacing_current_input() -> None:\ntests/test_json_io.py:61:    assert json.loads(result.stdout) == [1, 2]\ntests/test_json_io.py:67:    assert [json.loads(line) for line in result.stdout.splitlines()] == [\ntests/test_architecture.py:9:from jq_interpreter import CompileError, Interpreter, MODULE_BOUNDARIES\ntests/test_architecture.py:36:    def test_diagnostics_use_declared_process_exit_contract(self) -> None:\ntests/test_architecture.py:39:    def test_special_numeric_literals_are_emitted_as_json_null(self) -> None:\ntests/test_architecture.py:48:        self.assertEqual(result.stdout.splitlines(), [\"null\", \"null\"])\ntests/test_architecture.py:59:        self.assertEqual(json.loads(result.stdout), \"μ\")\ntests/test_architecture.py:66:        with self.assertRaises(CompileError):\ntests/test_architecture.py:84:            [json.loads(line) for line in result.stdout.splitlines()],\ntests/test_architecture.py:88:    def test_executable_reports_compile_exit_three(self) -> None:\ntests/test_architecture.py:97:    def test_executable_reports_runtime_exit_five(self) -> None:\ntests/test_architecture.py:106:        self.assertNotEqual(result.stderr, \"\")\ntests/test_architecture.py:117:        self.assertEqual(result.stdout.splitlines(), [\"1\"])\ntests/test_architecture.py:118:        self.assertNotEqual(result.stderr, \"\")\ntests/test_architecture.py:120:    def test_runtime_diagnostic_is_not_written_to_stdout(self) -> None:\ntests/test_architecture.py:129:        self.assertEqual(result.stdout, \"\")\ntests/test_architecture.py:130:        self.assertNotEqual(result.stderr, \"\")\ntests/test_text_003_regex.py:19:    return result.returncode, [json.loads(line) for line in result.stdout.splitlines()]\ntests/test_text_003_regex.py:22:def test_test_maps_flags_and_global_match_emits_offsets() -> None:\ntests/test_lexer.py:3:from jq_interpreter.errors import CompileError\ntests/test_lexer.py:36:    with pytest.raises(CompileError):\ntests/test_value_001.py:23:    return [json.loads(line) for line in result.stdout.splitlines()]\ntests/test_value_002_access.py:23:    return [json.loads(line) for line in result.stdout.splitlines()]\ntests/test_text_001_string_builtins.py:19:    outputs = [json.loads(line) for line in result.stdout.splitlines()]\ntests/test_text_002_formats.py:25:    return json.loads(result.stdout)\njq_interpreter/lexer.py:7:from .errors import CompileError\njq_interpreter/lexer.py:41:def _error(source: str, position: int, message: str) -> CompileError:\njq_interpreter/lexer.py:44:    return CompileError(f\"{message} at line {line}, column {position - line_start + 1}\")\njq_interpreter/errors.py:1:\"\"\"Errors crossing the interpreter's process boundary.\"\"\"\njq_interpreter/errors.py:4:class CompileError(Exception):\njq_interpreter/errors.py:8:class RuntimeError(Exception):\njq_interpreter/errors.py:12:# Runtime failures raised by evaluator helpers must have the same semantics as\njq_interpreter/errors.py:17:    RuntimeError,\njq_interpreter/errors.py:18:    ValueError,\njq_interpreter/errors.py:19:    TypeError,\njq_interpreter/errors.py:20:    IndexError,\njq_interpreter/errors.py:21:    ArithmeticError,\njq_interpreter/errors.py:22:    RecursionError,\njq_interpreter/builtins.py:1:\"\"\"Builtin filter ownership boundary.\njq_interpreter/evaluator.py:14:from .errors import FLOW_RUNTIME_ERRORS, RuntimeError\njq_interpreter/evaluator.py:27:    \"\"\"A parsed exponent overflow that jq still emits as a JSON number.\"\"\"\njq_interpreter/evaluator.py:59:                else: raise RuntimeError(\"cannot add values\")\njq_interpreter/evaluator.py:82:        raise RuntimeError(program.message)\njq_interpreter/evaluator.py:94:    raise RuntimeError(\"unknown compiled filter\")\njq_interpreter/evaluator.py:129:        if a[0] not in env: raise RuntimeError(f\"variable ${a[0]} is not defined\")\njq_interpreter/evaluator.py:195:                    raise RuntimeError(f'Cannot slice {_type_name(base)}')\njq_interpreter/evaluator.py:218:                raise RuntimeError(f\"{_type_name(x)} ({_short(x)}) cannot be negated\")\njq_interpreter/evaluator.py:315:    elif op == \"unsupported\": raise RuntimeError(\"unsupported syntax\")\njq_interpreter/evaluator.py:347:    \"\"\"Flatten the right-associated alternatives emitted by the parser.\"\"\"\njq_interpreter/evaluator.py:415:        raise RuntimeError(f\"Cannot iterate over {_type_name(value)} ({_stringify(value)})\")\njq_interpreter/evaluator.py:423:            raise RuntimeError(f'Cannot index object with {_type_name(k)} ({_short(k)})')\njq_interpreter/evaluator.py:429:            raise RuntimeError(f'Cannot index array with string ({json.dumps(k)})')\njq_interpreter/evaluator.py:434:            raise RuntimeError(f'Cannot index string with number ({_short(k)})')\njq_interpreter/evaluator.py:437:    raise RuntimeError(f'Cannot index {_type_name(v)} with {_type_name(k)} ({json.dumps(k)})')\njq_interpreter/evaluator.py:445:        except RuntimeError: candidates = []\njq_interpreter/evaluator.py:446:        emitted = False\njq_interpreter/evaluator.py:448:            if _truth(item): emitted = True; yield item\njq_interpreter/evaluator.py:449:        if not emitted: yield from _node(right, value, env)\njq_interpreter/evaluator.py:470:                raise RuntimeError(f'Invalid path expression with result {_stringify(produced[0])}')\njq_interpreter/evaluator.py:471:            raise RuntimeError('Invalid path expression')\njq_interpreter/evaluator.py:527:            else: raise RuntimeError(f\"{_type_name(x)} ({_short(x)}) and {_type_name(y)} ({_short(y)}) cannot be added\")\njq_interpreter/evaluator.py:533:                raise RuntimeError(f\"{_type_name(x)} ({_short(x)}) and {_type_name(y)} ({_short(y)}) cannot be subtracted\")\njq_interpreter/evaluator.py:541:                    raise RuntimeError('Repeat string result too long')\njq_interpreter/evaluator.py:548:                    raise RuntimeError('Repeat string result too long')\njq_interpreter/evaluator.py:553:            else: raise RuntimeError(f\"{_type_name(x)} ({_short(x)}) and {_type_name(y)} ({_short(y)}) cannot be multiplied\")\njq_interpreter/evaluator.py:556:                raise RuntimeError(f\"number ({_short(x)}) and number ({_short(y)}) cannot be divided because the divisor is zero\")\njq_interpreter/evaluator.py:560:            else: raise RuntimeError(f\"{_type_name(x)} ({_short(x)}) and {_type_name(y)} ({_short(y)}) cannot be divided\")\njq_interpreter/evaluator.py:563:                raise RuntimeError(f\"number ({_short(x)}) and number ({_short(y)}) cannot be divided (remainder) because the divisor is zero\")\njq_interpreter/evaluator.py:570:                    raise RuntimeError(f\"{_type_name(x)} ({_short(x)}) and {_type_name(y)} ({_short(y)}) cannot be divided (remainder)\")\njq_interpreter/evaluator.py:612:            if right == 0: raise RuntimeError('division by zero')\njq_interpreter/evaluator.py:616:            if right == 0: raise RuntimeError('division by zero')\njq_interpreter/evaluator.py:618:    raise RuntimeError(f\"{_type_name(left)} ({_short(left)}) and {_type_name(right)} ({_short(right)}) cannot be used with {op}\")\njq_interpreter/evaluator.py:624:        raise RuntimeError(f\"{_type_name(left)} ({_short(left)}) and {_type_name(right)} ({_short(right)}) must be numbers\")\njq_interpreter/evaluator.py:632:        raise RuntimeError(f\"{_type_name(left)} ({_short(left)}) and {_type_name(right)} ({_short(right)}) must be numbers\")\njq_interpreter/evaluator.py:642:    if depth > 10000: raise RuntimeError('Object merge too deep')\njq_interpreter/evaluator.py:647:        if level > 10000: raise RuntimeError('Object merge too deep')\njq_interpreter/evaluator.py:664:            raise RuntimeError('Equality check too deep')\njq_interpreter/evaluator.py:707:        raise RuntimeError('unsupported value in comparison')\njq_interpreter/evaluator.py:717:            raise RuntimeError('Comparison too deep')\njq_interpreter/evaluator.py:774:            raise RuntimeError('Containment check too deep')\njq_interpreter/evaluator.py:791:    except RecursionError as error:\njq_interpreter/evaluator.py:792:        raise RuntimeError('Containment check too deep') from error\njq_interpreter/evaluator.py:855:            raise RuntimeError('Exceeds depth limit for parsing')\njq_interpreter/evaluator.py:857:    except RecursionError:\njq_interpreter/evaluator.py:881:        raise RuntimeError('Path too deep')\njq_interpreter/evaluator.py:925:                    raise RuntimeError('Cannot set array element at NaN index')\njq_interpreter/evaluator.py:927:                    raise RuntimeError(f'Cannot index object with {_type_name(key)} ({_short(key)})')\njq_interpreter/evaluator.py:929:                    raise RuntimeError('Array index too large')\njq_interpreter/evaluator.py:931:                    if int(key) < 0 and abs(int(key)) > len(current): raise RuntimeError('Out of bounds negative array index')\njq_interpreter/evaluator.py:932:                    if int(key) >= 10000000: raise RuntimeError('Array index too large')\njq_interpreter/evaluator.py:934:                    raise RuntimeError('Out of bounds negative array index')\njq_interpreter/evaluator.py:957:                raise RuntimeError(f'Invalid path expression near attempt to iterate through {_stringify(produced[0])}')\njq_interpreter/evaluator.py:1011:            raise RuntimeError('Cannot update string slices')\njq_interpreter/evaluator.py:1022:        raise RuntimeError('Cannot update field at array index of array')\njq_interpreter/evaluator.py:1024:        raise RuntimeError(f'Cannot use {_type_name(key)} as a path component')\njq_interpreter/evaluator.py:1027:            raise RuntimeError('Cannot set array element at NaN index')\njq_interpreter/evaluator.py:1028:        raise RuntimeError('Cannot use number (null) as a path component')\njq_interpreter/evaluator.py:1032:            raise RuntimeError(message)\njq_interpreter/evaluator.py:1034:        raise RuntimeError(f'Cannot index object with {_type_name(key)} ({_short(key)})')\njq_interpreter/evaluator.py:1057:                    raise RuntimeError('Out of bounds negative array index')\njq_interpreter/evaluator.py:1061:            raise RuntimeError(f'Cannot index {_type_name(current)} with {_type_name(key)} ({_short(key)})')\njq_interpreter/evaluator.py:1071:            if isinstance(key, list): raise RuntimeError('Cannot update field at array index of array')\njq_interpreter/evaluator.py:1083:                raise RuntimeError(f'Cannot index object with {_type_name(key)} ({_short(key)})')\njq_interpreter/evaluator.py:1087:                raise RuntimeError('Cannot set array element at NaN index')\njq_interpreter/evaluator.py:1089:                raise RuntimeError('Cannot update field at array index of array')\njq_interpreter/evaluator.py:1100:            raise RuntimeError(f'Cannot index object with {_type_name(key)} ({_short(key)})')\njq_interpreter/evaluator.py:1105:            raise RuntimeError('Cannot update field at array index of array')\njq_interpreter/evaluator.py:1109:            raise RuntimeError('Out of bounds negative array index')\njq_interpreter/evaluator.py:1111:            raise RuntimeError('Array index too large')\njq_interpreter/evaluator.py:1116:        raise RuntimeError(\njq_interpreter/evaluator.py:1123:            raise RuntimeError('Cannot set array element at NaN index')\njq_interpreter/evaluator.py:1125:            raise RuntimeError('Out of bounds negative array index')\njq_interpreter/evaluator.py:1127:            raise RuntimeError('Array index too large')\njq_interpreter/evaluator.py:1133:    raise RuntimeError(f'Cannot use {_type_name(path[0])} as a path component')\njq_interpreter/evaluator.py:1197:    if name == 'error': raise RuntimeError(_one(args[0],value,env) if args else value)\njq_interpreter/evaluator.py:1201:        else: raise RuntimeError('length requires a string, array, object or number')\njq_interpreter/evaluator.py:1215:                else: raise RuntimeError('cannot add values')\njq_interpreter/evaluator.py:1321:        raise RuntimeError('map_values requires an array or object')\njq_interpreter/evaluator.py:1323:        if not isinstance(value, dict): raise RuntimeError('with_entries requires an object')\njq_interpreter/evaluator.py:1352:        else: raise RuntimeError('cannot reverse value')\njq_interpreter/evaluator.py:1355:        if not isinstance(value, list): raise RuntimeError('flatten input must be an array')\njq_interpreter/evaluator.py:1360:                raise RuntimeError('flatten depth must not be negative')\njq_interpreter/evaluator.py:1372:        if not isinstance(value, list): raise RuntimeError('transpose input must be an array')\njq_interpreter/evaluator.py:1384:            if not isinstance(value, list): raise RuntimeError('combinations input must be an array')\njq_interpreter/evaluator.py:1405:            raise RuntimeError('in requires an object or array')\njq_interpreter/evaluator.py:1436:        # jq's repeat emits each result and recurses; its terminating signal is\njq_interpreter/evaluator.py:1472:            raise RuntimeError(\"nth doesn't support negative indices\")\njq_interpreter/evaluator.py:1475:        # the source emits a runtime error after the requested value:\njq_interpreter/evaluator.py:1492:            raise RuntimeError('break')\njq_interpreter/evaluator.py:1496:            raise RuntimeError('break') from error\njq_interpreter/evaluator.py:1519:            raise RuntimeError('date input must be a string')\njq_interpreter/evaluator.py:1522:        except ValueError as error:\njq_interpreter/evaluator.py:1523:            raise RuntimeError('date input must be in ISO 8601 format') from error\njq_interpreter/evaluator.py:1527:            raise RuntimeError('date input must be a number')\njq_interpreter/evaluator.py:1531:            raise RuntimeError(f'{name}/1 requires a string format')\njq_interpreter/evaluator.py:1543:            except (TypeError, ValueError, OverflowError) as error:\njq_interpreter/evaluator.py:1544:                raise RuntimeError(f'{name}/1 requires parsed datetime inputs') from error\njq_interpreter/evaluator.py:1546:            raise RuntimeError(f'{name}/1 requires parsed datetime inputs')\njq_interpreter/evaluator.py:1549:                raise RuntimeError(f'{name}/1 requires a string format')\njq_interpreter/evaluator.py:1554:            raise RuntimeError('mktime requires parsed datetime inputs')\njq_interpreter/evaluator.py:1560:            raise RuntimeError('strptime/1 requires a string format')\njq_interpreter/evaluator.py:1566:        if isinstance(value, str): raise RuntimeError('number (123) is not a string')\njq_interpreter/evaluator.py:1567:        raise RuntimeError(f'{_type_name(value)} ({_stringify(value)}) cannot be searched, as it is not a string')\njq_interpreter/evaluator.py:1569:        if not isinstance(value, list): raise RuntimeError(f'{_type_name(value)} ({_short(value)}) cannot be searched from')\njq_interpreter/evaluator.py:1607:            raise RuntimeError('JOIN requires an object and a filter')\njq_interpreter/evaluator.py:1612:            raise RuntimeError('INDEX requires two arguments')\njq_interpreter/evaluator.py:1627:                    raise ValueError('not a jq number')\njq_interpreter/evaluator.py:1629:            except Exception: raise RuntimeError(f'string ({json.dumps(value)}) cannot be parsed as a number')\njq_interpreter/evaluator.py:1630:        else: raise RuntimeError('cannot parse number')\njq_interpreter/evaluator.py:1635:        else: raise RuntimeError(f'{_type_name(value)} ({_stringify(value) if not isinstance(value, str) else json.dumps(value)}) cannot be parsed as a boolean')\njq_interpreter/evaluator.py:1638:        if not isinstance(value, str): raise RuntimeError(f'{_type_name(value)} ({_stringify(value)}) only strings have UTF-8 byte length')\njq_interpreter/evaluator.py:1641:        if not isinstance(value, str): raise RuntimeError('only strings can be parsed')\njq_interpreter/evaluator.py:1643:            raise RuntimeError(\"Invalid string literal; expected \\\", but got ' at line 1, column 5 (while parsing '{'a': 123}')\")\njq_interpreter/evaluator.py:1648:                raise RuntimeError(f\"Invalid numeric literal at EOF at line 1, column {len(value)} (while parsing '{value}')\")\njq_interpreter/evaluator.py:1650:        except RuntimeError: raise\njq_interpreter/evaluator.py:1651:        except Exception: raise RuntimeError('invalid JSON')\njq_interpreter/evaluator.py:1677:                raise RuntimeError(f'Invalid path expression with result {shown}')\njq_interpreter/evaluator.py:1679:                raise RuntimeError(f'Invalid path expression near attempt to iterate through {shown}')\njq_interpreter/evaluator.py:1683:                raise RuntimeError(f'Invalid path expression near attempt to access element {_stringify(key_value)} of {shown}')\njq_interpreter/evaluator.py:1685:                raise RuntimeError(f'Invalid path expression near attempt to access element {json.dumps(tail.arguments[0])} of {shown}')\njq_interpreter/evaluator.py:1686:            raise RuntimeError(f'Invalid path expression with result {shown}')\njq_interpreter/evaluator.py:1689:            raise RuntimeError('Invalid path expression')\njq_interpreter/evaluator.py:1694:        if not paths: raise RuntimeError('Invalid path expression')\njq_interpreter/evaluator.py:1696:            raise RuntimeError('Out of bounds negative array index')\njq_interpreter/evaluator.py:1703:                raise RuntimeError('Out of bounds negative array index')\njq_interpreter/evaluator.py:1753:                raise RuntimeError('cannot search value')\njq_interpreter/evaluator.py:1767:        else: raise RuntimeError('keys requires object or array')\njq_interpreter/evaluator.py:1771:            raise RuntimeError('to_entries requires an object')\njq_interpreter/evaluator.py:1776:            raise RuntimeError('from_entries requires an array')\njq_interpreter/evaluator.py:1780:                raise RuntimeError('from_entries requires objects')\njq_interpreter/evaluator.py:1784:                raise RuntimeError('from_entries requires a key')\njq_interpreter/evaluator.py:1790:        if not isinstance(path, list): raise RuntimeError('Paths must be specified as an array')\njq_interpreter/evaluator.py:1791:        if len(path) > 10000: raise RuntimeError('Path too deep')\njq_interpreter/evaluator.py:1795:        if not isinstance(path, list): raise RuntimeError('Paths must be specified as an array')\njq_interpreter/evaluator.py:1796:        if len(path) > 10000: raise RuntimeError('Path too deep')\njq_interpreter/evaluator.py:1800:        if not isinstance(paths, list): raise RuntimeError('Paths must be specified as an array')\njq_interpreter/evaluator.py:1802:            raise RuntimeError('Paths must be specified as an array of arrays')\njq_interpreter/evaluator.py:1804:            raise RuntimeError('Path too deep')\njq_interpreter/evaluator.py:1827:            except RuntimeError:\njq_interpreter/evaluator.py:1858:                except ValueError: yield None\njq_interpreter/evaluator.py:1859:            else: raise RuntimeError('cannot search value')\njq_interpreter/evaluator.py:1890:            raise RuntimeError('localtime requires a number')\njq_interpreter/evaluator.py:1897:        if not isinstance(value, list): raise RuntimeError('implode input must be an array')\njq_interpreter/evaluator.py:1902:                raise RuntimeError(f'{_type_name(item)} ({shown}) can\\'t be imploded, unicode codepoint needs to be numeric')\njq_interpreter/evaluator.py:1904:                raise RuntimeError('number (null) can\\'t be imploded, unicode codepoint needs to be numeric')\njq_interpreter/evaluator.py:1908:        if not isinstance(value, str): raise RuntimeError('explode input must be a string')\njq_interpreter/evaluator.py:1914:            if count < 0: raise RuntimeError(\"limit doesn't support negative count\")\njq_interpreter/evaluator.py:1924:            if count < 0: raise RuntimeError(\"skip doesn't support negative count\")\njq_interpreter/evaluator.py:1932:                raise RuntimeError('join separator must be a string')\njq_interpreter/evaluator.py:1933:            if not isinstance(value, list): raise RuntimeError('cannot join value')\njq_interpreter/evaluator.py:1940:                    raise RuntimeError(f'{_type_name(prefix)} ({json.dumps(prefix)}) and {_type_name(item)} ({_stringify(item)}) cannot be added')\n","exit_code":0,"status":"completed"}}
{"type":"item.started","item":{"id":"item_3","type":"command_execution","command":"/bin/bash -lc \"sed -n '1,180p' jq_interpreter/evaluator.py && sed -n '1120,1235p' jq_interpreter/evaluator.py && sed -n '1,220p' jq_interpreter/runtime.py && sed -n '1,180p' jq_interpreter/interpreter.py && sed -n '1,160p' jq_interpreter/ast.py && sed -n '1,120p' jq_interpreter/builtins.py\"","aggregated_output":"","exit_code":null,"status":"in_progress"}}
{"type":"item.completed","item":{"id":"item_3","type":"command_execution","command":"/bin/bash -lc \"sed -n '1,180p' jq_interpreter/evaluator.py && sed -n '1120,1235p' jq_interpreter/evaluator.py && sed -n '1,220p' jq_interpreter/runtime.py && sed -n '1,180p' jq_interpreter/interpreter.py && sed -n '1,160p' jq_interpreter/ast.py && sed -n '1,120p' jq_interpreter/builtins.py\"","aggregated_output":"\"\"\"Ordered generator evaluator boundary.\"\"\"\nimport json\nimport math\nimport datetime\nimport calendar\nimport time\nimport itertools\nimport sys\nimport re\nfrom collections.abc import Iterator\nfrom functools import cmp_to_key\n\nfrom .ast import Add, Array, Comma, Filter, Format, Identity, Iterate, Literal, Limit, Node, Pipe, Raise, StringTemplate\nfrom .errors import FLOW_RUNTIME_ERRORS, RuntimeError\nfrom .runtime import InputNumber, JsonValue, ValueStream, identity_stream\n\n\nclass EvaluationContext:\n    \"\"\"Shared unread-input state for one jq process.\"\"\"\n\n    def __init__(self, stream: Iterator[object]) -> None:\n        self.stream = stream\n        self.current: object | None = None\n\n\nclass _OverflowFloat(float):\n    \"\"\"A parsed exponent overflow that jq still emits as a JSON number.\"\"\"\n\n    pass\n\n\ndef evaluate(program: Filter, value: JsonValue, context: EvaluationContext | None = None) -> ValueStream:\n    \"\"\"Evaluate one input as an ordered stream of output values.\"\"\"\n    if isinstance(program, Node):\n        yield from _node(program, value, {'__input_context__': context} if context else {})\n        return\n    if isinstance(program, Identity):\n        yield from identity_stream(value)\n        return\n    if isinstance(program, Iterate):\n        yield from _iter_values(value)\n        return\n    if isinstance(program, Literal):\n        yield program.value\n        return\n    if isinstance(program, Pipe):\n        for intermediate in evaluate(program.left, value, context): yield from evaluate(program.right, intermediate, context)\n        return\n    if isinstance(program, Add):\n        left = list(evaluate(program.left, value))\n        right = list(evaluate(program.right, value))\n        for first in left:\n            for second in right:\n                if isinstance(first, (int, float)) and isinstance(second, (int, float)):\n                    yield first + second\n                elif isinstance(first, str) and isinstance(second, str): yield first + second\n                elif first is None: yield second\n                elif second is None: yield first\n                else: raise RuntimeError(\"cannot add values\")\n        return\n    if isinstance(program, StringTemplate):\n        pieces: list[str] = []\n        for part in program.parts:\n            pieces.append(part if isinstance(part, str) else \"\".join(_stringify(x) for x in evaluate(part, value)))\n        yield \"\".join(pieces)\n        return\n    if isinstance(program, Format):\n        if program.template is None: yield _apply_format(program.name, value)\n        else:\n            pieces: list[str] = []\n            for part in program.template.parts:\n                if isinstance(part, str): pieces.append(part)\n                else:\n                    pieces.extend(_apply_format(program.name, item) for item in evaluate(part, value))\n            yield \"\".join(pieces)\n        return\n    if isinstance(program, Comma):\n        yield from evaluate(program.left, value)\n        yield from evaluate(program.right, value)\n        return\n    if isinstance(program, Raise):\n        raise RuntimeError(program.message)\n    if isinstance(program, Array):\n        yield list(evaluate(program.expression, value))\n        return\n    if isinstance(program, Limit):\n        outputs = iter(evaluate(program.expression, value))\n        for _ in range(program.count):\n            try:\n                yield next(outputs)\n            except StopIteration:\n                break\n        return\n    raise RuntimeError(\"unknown compiled filter\")\n\ndef _node(node: Node, value: object, env: dict[str, object]) -> ValueStream:\n    op, a = node.operation, node.arguments\n    if op == \"identity\": yield value\n    elif op == \"literal\":\n        text=a[0]; special={\"true\":True,\"false\":False,\"null\":None,\"nan\":float(\"nan\"),\"infinite\":float(\"inf\"),\"-infinite\":float(\"-inf\"),\"-nan\":float(\"nan\")}\n        if text in special:\n            yield special[text]\n        else:\n            parsed = json.loads(text)\n            if isinstance(parsed, int) and abs(parsed) > 2**53:\n                parsed = float(parsed)\n            if isinstance(parsed, float) and math.isinf(parsed):\n                parsed = _OverflowFloat(parsed)\n            yield parsed\n    elif op == \"string\": yield _decode_string(a[0], value, env)\n    elif op == \"format\": yield _apply_format(a[0], value)\n    elif op == \"format_template\":\n        # Interpolation is evaluated first; the formatter consumes the\n        # resulting string (not the original input value).\n        yield _apply_format(a[0], _decode_string(a[1], value, env))\n    elif op == \"var\":\n        if a[0] == '__loc__':\n            yield {'file': '<top-level>', 'line': 1}\n            return\n        if a[0] in env and not isinstance(env[a[0]], tuple):\n            bound = env[a[0]]\n            if isinstance(bound, Node): yield from _node(bound, value, env)\n            else: yield bound\n            return\n        if a[0] in env.get('__params__', {}):\n            captured, argument = env['__params__'][a[0]]\n            yield from _node(argument, value, captured)\n            return\n        if a[0] not in env: raise RuntimeError(f\"variable ${a[0]} is not defined\")\n        bound = env[a[0]]\n        if isinstance(bound, tuple) and bound and bound[0] == '__closure__':\n            yield from _node(bound[1], value, {**env, **bound[2]})\n        elif isinstance(bound, Node):\n            yield from _node(bound, value, env)\n        else:\n            yield bound\n    elif op == \"bind\":\n        for item in _node(a[0], value, env):\n            # A destructuring alternative is a speculative binding: jq must\n            # retry the next pattern when either matching or the continuation\n            # fails.  Keeping the continuation inside this loop is important;\n            # evaluating it after selecting a pattern would make `?//` only\n            # handle shape mismatches, not errors raised by the remainder.\n            alternatives = _pattern_alternatives(a[1])\n            for position, pattern in enumerate(alternatives):\n                bound = dict(env)\n                _initialize_pattern(a[1], bound)\n                if not _bind_pattern(pattern, item, bound):\n                    continue\n                try:\n                    yield from _node(a[2], value, bound)\n                except FLOW_RUNTIME_ERRORS:\n                    if position == len(alternatives) - 1:\n                        raise\n                    continue\n                break\n    elif op == \"field\": yield _index(value, a[0])\n    elif op == \"recurse\":\n        # The parser uses this node for the recursive-descent operator.  Keep\n        # the traversal depth-first and source ordered, matching recurse(.[]?).\n        def walk(item):\n            yield item\n            if isinstance(item, list):\n                for child in item:\n                    yield from walk(child)\n            elif isinstance(item, dict):\n                for child in item.values():\n                    yield from walk(child)\n        yield from walk(value)\n    elif op == \"index\":\n        for base in _node(a[0],value,env): yield _index(base,a[1])\n    elif op == \"iterate\":\n        for base in _node(a[0],value,env):\n            yield from _iter_values(base)\n    elif op in (\"indexexpr\",\"slice\"):\n        for base in _node(a[0],value,env):\n            if op==\"slice\":\n                # Slice bounds are filters over the surrounding input, not\n                # over the value being sliced (for example map([1,2][0:.])).\n                start=_one(a[1],value,env); end=None if a[2] is None else _one(a[2],value,env)\n        result = []\n        index = int(path[0])\n        if isinstance(path[0], float) and math.isnan(path[0]):\n            raise RuntimeError('Cannot set array element at NaN index')\n        if index < 0:\n            raise RuntimeError('Out of bounds negative array index')\n        if index >= 10000000:\n            raise RuntimeError('Array index too large')\n        while len(result) <= index: result.append(None)\n        result[index] = _set_path(result[index], path[1:], replacement)\n        return result\n    if isinstance(path[0], str):\n        return {path[0]: _set_path(None, path[1:], replacement)}\n    raise RuntimeError(f'Cannot use {_type_name(path[0])} as a path component')\n\ndef _delete_path(value, path):\n    _check_mutation_depth(path)\n    if not path: return None\n    if isinstance(value, list):\n        index = int(path[0]); index = index + len(value) if index < 0 else index\n        result = list(value)\n        if len(path) == 1:\n            if 0 <= index < len(result): result.pop(index)\n        elif 0 <= index < len(result): result[index] = _delete_path(result[index], path[1:])\n        return result\n    if isinstance(value, dict):\n        result = dict(value); key = str(path[0])\n        if len(path) == 1: result.pop(key, None)\n        elif key in result: result[key] = _delete_path(result[key], path[1:])\n        return result\n    return value\ndef _call(name,args,value,env):\n    parameter = env.get('__params__', {}).get(name)\n    if parameter is not None:\n        bound_env, argument = parameter\n        yield from _node(argument, value, bound_env)\n        return\n    if not args and name in env:\n        bound = env[name]\n        if isinstance(bound, tuple) and bound and bound[0] == '__closure__':\n            yield from _node(bound[1], value, {**env, **bound[2]})\n        elif isinstance(bound, Node):\n            yield from _node(bound, value, env)\n        else:\n            yield bound\n        return\n    function = env.get('__funcs__',{}).get((name, len(args)))\n    if function is not None:\n        params, body, *closure = function\n        # A function executes in the environment captured at its definition,\n        # not in the caller's value-binding environment.  The caller is still\n        # used below to capture filter/value arguments, but ordinary lexical\n        # variables must not leak across that boundary.\n        local = dict(closure[0]) if closure else dict(env)\n        if not args:\n            yield from _node(body,value,local); return\n        # Filter arguments remain lazy closures over the caller.  Value\n        # arguments are evaluated at the call site; every generated-value\n        # combination is a distinct invocation.\n        value_positions = [i for i, param in enumerate(params) if param.startswith('$')]\n        value_streams = [list(_node(args[i], value, env)) for i in value_positions]\n        combinations = itertools.product(*value_streams) if value_streams else [()]\n        captured = dict(env)\n        for combination in combinations:\n            parameters = dict(local.get('__params__', {}))\n            invocation = dict(local)\n            for position, (param, argument) in enumerate(zip(params, args)):\n                parameter_name = param[1:] if param.startswith('$') else param\n                if param.startswith('$'):\n                    value_index = value_positions.index(position)\n                    invocation[parameter_name] = combination[value_index]\n                else:\n                    parameters[parameter_name] = (captured, argument)\n            invocation['__params__'] = parameters\n            yield from _node(body, value, invocation)\n        return\n    if name == 'empty': return\n    if name == 'error': raise RuntimeError(_one(args[0],value,env) if args else value)\n    if name=='length':\n        if isinstance(value, (list, dict, str)): yield len(value)\n        elif isinstance(value, (int, float)) and not isinstance(value, bool): yield _OverflowFloat(abs(value)) if isinstance(value, _OverflowFloat) else abs(value)\n        else: raise RuntimeError('length requires a string, array, object or number')\n        return\n    if name == 'add':\n        items = list(_node(args[0], value, env)) if args else list(value)\n        if not items: yield None\n        else:\n            result = items[0]\n            for item in items[1:]:\n                if result is None: result = item\n                elif item is None: continue\n                elif isinstance(result, (int,float)) and isinstance(item,(int,float)): result += item\n                elif isinstance(result, str) and isinstance(item,str): result += item\n                elif isinstance(result,list) and isinstance(item,list): result += item\n                elif isinstance(result,dict) and isinstance(item,dict): result = {**result,**item}\n                else: raise RuntimeError('cannot add values')\n            yield result\n        return\n    if name=='type': yield 'null' if value is None else 'boolean' if isinstance(value,bool) else 'number' if isinstance(value,(int,float)) else 'string' if isinstance(value,str) else 'array' if isinstance(value,list) else 'object'; return\n    if name == 'has':\n        key = _one(args[0], value, env)\n        if isinstance(value, dict): yield str(key) in value\n        elif (isinstance(value, list) and isinstance(key, (int, float))\n              and not isinstance(key, bool)\n              and (isinstance(key, int) or key.is_integer())\n              and not (isinstance(key, float) and math.isnan(key))):\n            yield 0 <= int(key) < len(value)\n        else: yield False\n        return\n    if name=='not': yield not _truth(value); return\n    if name == 'have_decnum': yield False; return\n    if name in ('any', 'all'):\n        if len(args) > 1:\n            stream = _node(args[0], value, env)\n            condition = args[1]\n        elif args:\n\"\"\"Runtime value and stream contracts.\"\"\"\n\nfrom collections.abc import Iterator\nfrom dataclasses import dataclass, field\nfrom typing import TypeAlias\n\nJsonValue: TypeAlias = None | bool | int | float | str | list[\"JsonValue\"] | dict[str, \"JsonValue\"]\nValueStream: TypeAlias = Iterator[JsonValue]\n\n\nclass InputNumber(float):\n    \"\"\"A JSON number retaining its source spelling until it is transformed.\"\"\"\n\n    def __new__(cls, value: str) -> \"InputNumber\":\n        instance = super().__new__(cls, float(value))\n        instance.source = value\n        return instance\n\n    source: str\n\n\n@dataclass\nclass EvaluationContext:\n    \"\"\"Per-input state for lexical bindings and runtime options.\"\"\"\n\n    bindings: dict[str, JsonValue] = field(default_factory=dict)\n\n\ndef identity_stream(value: JsonValue) -> ValueStream:\n    \"\"\"Yield one value, retaining the stream contract used by the evaluator.\"\"\"\n    yield value\n\"\"\"Application-facing interpreter orchestration.\"\"\"\n\nimport json\nfrom collections.abc import Iterable, Iterator\nfrom dataclasses import dataclass\n\nfrom .evaluator import evaluate\nfrom .parser import parse\nfrom .runtime import InputNumber, JsonValue\n\n\nclass _InputInteger(int):\n    \"\"\"An input integer whose literal spelling remains available to jq.\"\"\"\n\n\n@dataclass(frozen=True)\nclass InputRecord:\n    value: JsonValue\n    filename: str = '<stdin>'\n    line_number: int = 1\n\n\nclass Interpreter:\n    \"\"\"Compile once, then evaluate each JSON input in order.\"\"\"\n\n    def __init__(self, program: str) -> None:\n        self._compiled = parse(program)\n\n    def run(self, inputs: Iterable[JsonValue]) -> Iterator[JsonValue]:\n        \"\"\"Yield every output, preserving input and generator ordering.\"\"\"\n        from .evaluator import EvaluationContext\n        stream = iter(InputRecord(value, line_number=index)\n                      for index, value in enumerate(inputs, start=1))\n        context = EvaluationContext(stream)\n        for record in stream:\n            context.current = record\n            yield from evaluate(self._compiled, record.value, context)\n\n    def run_records(self, records: Iterable[InputRecord]) -> Iterator[JsonValue]:\n        \"\"\"Evaluate records while retaining their source metadata.\"\"\"\n        from .evaluator import EvaluationContext\n        stream = iter(records)\n        context = EvaluationContext(stream)\n        for record in stream:\n            context.current = record\n            yield from evaluate(self._compiled, record.value, context)\n\n\ndef parse_input(line: str) -> JsonValue:\n    \"\"\"Decode one JSON input value.\"\"\"\n    return json.loads(line.lstrip(\"\\ufeff\"), parse_constant=_parse_json_constant)\n\n\ndef parse_inputs(text: str) -> Iterator[JsonValue]:\n    \"\"\"Decode every whitespace-separated JSON value in an input stream.\n\n    ``jq`` accepts JSON values separated by arbitrary whitespace, so a value may\n    span multiple physical lines.  ``raw_decode`` preserves the boundary\n    between successive values without requiring a non-standard JSON parser.\n    \"\"\"\n    yield from (record.value for record in parse_input_records(text))\n\n\ndef parse_input_records(text: str) -> Iterator[InputRecord]:\n    \"\"\"Decode values and retain the line on which each value starts.\"\"\"\n    import re\n    text = re.sub(r'(?<![A-Za-z_])-(?:nan|infinite|NaN|Infinity)(?![A-Za-z_])', lambda m: '-NaN' if 'nan' in m.group(0).lower() else '-Infinity', text)\n    text = re.sub(r'(?<![A-Za-z_])(?:nan|infinite|NaN|Infinity)(?![A-Za-z_])', lambda m: 'NaN' if m.group(0).lower() == 'nan' else 'Infinity', text)\n    text = re.sub(r'(?<![A-Za-z_])-NaN(?![A-Za-z_])', 'NaN', text)\n    def parse_integer(text: str) -> int | float:\n        integer = int(text)\n        return InputNumber(text) if abs(integer) > 2**53 else _InputInteger(integer)\n\n    decoder = json.JSONDecoder(parse_constant=_parse_json_constant,\n                               parse_int=parse_integer, parse_float=InputNumber)\n    position = 0\n    while True:\n        while position < len(text) and text[position].isspace():\n            position += 1\n        if position >= len(text):\n            return\n        if position == 0 and text.startswith(\"\\ufeff\"):\n            position += 1\n            continue\n        start = position\n        value, position = decoder.raw_decode(text, position)\n        yield InputRecord(value, line_number=text.count('\\n', 0, start) + 1)\n\n\ndef _parse_json_constant(value: str) -> float:\n    \"\"\"Decode jq's accepted non-standard numeric constants.\"\"\"\n    return {\"NaN\": float(\"nan\"), \"nan\": float(\"nan\"),\n            \"Infinity\": float(\"inf\"), \"infinite\": float(\"inf\"),\n            \"-Infinity\": float(\"-inf\"), \"-infinite\": float(\"-inf\"),\n            \"-NaN\": float(\"nan\"), \"-nan\": float(\"nan\")} [value]\n\"\"\"Syntax tree types shared by the lexer, parser, and evaluator.\"\"\"\n\nfrom dataclasses import dataclass\n\n\n@dataclass(frozen=True)\nclass Filter:\n    \"\"\"Base type for compiled jq filters.\"\"\"\n\n\n@dataclass(frozen=True)\nclass Identity(Filter):\n    \"\"\"The ``.`` filter, yielding its input unchanged.\"\"\"\n\n\n@dataclass(frozen=True)\nclass Iterate(Filter):\n    \"\"\"The ``.[]`` filter, yielding array or object members in order.\"\"\"\n\n\n@dataclass(frozen=True)\nclass Literal(Filter):\n    \"\"\"A JSON literal filter.\"\"\"\n\n    value: object\n\n\n@dataclass(frozen=True)\nclass Comma(Filter):\n    \"\"\"Concatenate the output streams of two filters.\"\"\"\n\n    left: Filter\n    right: Filter\n\n\n@dataclass(frozen=True)\nclass Raise(Filter):\n    \"\"\"Raise a jq runtime error when evaluated.\"\"\"\n\n    message: str = \"error\"\n\n\n@dataclass(frozen=True)\nclass Array(Filter):\n    \"\"\"Collect a filter's generated values into an array.\"\"\"\n\n    expression: Filter\n\n\n@dataclass(frozen=True)\nclass Limit(Filter):\n    \"\"\"Keep at most ``count`` values from a filter stream.\"\"\"\n\n    count: int\n    expression: Filter\n\n@dataclass(frozen=True)\nclass Pipe(Filter):\n    left: Filter\n    right: Filter\n\n@dataclass(frozen=True)\nclass StringTemplate(Filter):\n    parts: tuple[str | Filter, ...]\n\n@dataclass(frozen=True)\nclass Format(Filter):\n    name: str\n    template: StringTemplate | None = None\n\n@dataclass(frozen=True)\nclass Add(Filter):\n    left: Filter\n    right: Filter\n\n@dataclass(frozen=True)\nclass Node(Filter):\n    \"\"\"General expression node used by the complete source parser.\"\"\"\n    operation: str\n    arguments: tuple[object, ...] = ()\n\"\"\"Builtin filter ownership boundary.\n\nLanguage-specific builtin definitions will be added here; the evaluator depends on\nthis module rather than embedding standard-library filters in process code.\n\"\"\"\n\n","exit_code":0,"status":"completed"}}
{"type":"item.started","item":{"id":"item_4","type":"command_execution","command":"/bin/bash -lc \"sed -n '1235,1325p' jq_interpreter/evaluator.py; sed -n '1,120p' jq_interpreter/errors.py; rg -n \\\"Call|call|halt_error|debug|stderr|halt\\\" jq_interpreter/parser.py jq_interpreter/lexer.py jq_interpreter/evaluator.py tests/test_architecture.py tests/test_core_003_errors.py tests/test_flow_003_conditionals_exceptions.py\"","aggregated_output":"","exit_code":null,"status":"in_progress"}}
{"type":"item.completed","item":{"id":"item_4","type":"command_execution","command":"/bin/bash -lc \"sed -n '1235,1325p' jq_interpreter/evaluator.py; sed -n '1,120p' jq_interpreter/errors.py; rg -n \\\"Call|call|halt_error|debug|stderr|halt\\\" jq_interpreter/parser.py jq_interpreter/lexer.py jq_interpreter/evaluator.py tests/test_architecture.py tests/test_core_003_errors.py tests/test_flow_003_conditionals_exceptions.py\"","aggregated_output":"        elif args:\n            # The one-argument form applies its condition to each member of\n            # the input array, rather than evaluating it once against the\n            # array itself.  This distinction matters for generator-valued\n            # conditions such as ``any(not)``.\n            stream = iter(value if isinstance(value, list) else [])\n            condition = args[0]\n        else:\n            stream = iter(value if isinstance(value, list) else [])\n            condition = None\n        desired = name == 'any'\n        result = not desired\n        for item in stream:\n            tests = [item] if condition is None else list(_node(condition, item, env))\n            # A predicate is itself a generator.  `any` succeeds when any\n            # predicate output is truthy; `all` fails when any output is\n            # falsey.  Empty predicate output is neutral for `all` and false\n            # for `any`, matching the definitions in jq's standard library.\n            item_truth = any(_truth(test) for test in tests)\n            if item_truth == desired:\n                result = desired\n                break\n        yield result\n        return\n    if name in ('min', 'max', 'min_by', 'max_by'):\n        # These operations are reductions over the input array.  Key filters\n        # are evaluated once per candidate and retain every generated key;\n        # jq compares those keys lexicographically.\n        items = list(value) if isinstance(value, list) else []\n        if not items:\n            yield None\n            return\n        if name in ('min_by', 'max_by'):\n            keyed = [(list(_node(args[0], item, env)), item) for item in items]\n            ordered = sorted(keyed, key=cmp_to_key(\n                lambda first, second: _compare_key_sequences(first[0], second[0])))\n            yield ordered[0][1] if name == 'min_by' else ordered[-1][1]\n        else:\n            ordered = sorted(items, key=cmp_to_key(_jq_compare))\n            yield ordered[0] if name == 'min' else ordered[-1]\n        return\n    if name == 'isempty':\n        try:\n            next(_node(args[0], value, env))\n            yield False\n        except StopIteration:\n            yield True\n        return\n    if name == 'tostring': yield _stringify(value); return\n    if name == 'tojson':\n        if isinstance(value, _OverflowFloat):\n            yield '1.7976931348623157e+308' if value > 0 else '-1.7976931348623157e+308'\n            return\n        if isinstance(value, float) and math.isfinite(value):\n            if value.is_integer() and abs(value) < 1e308:\n                yield str(int(value))\n            else:\n                yield json.dumps(value, separators=(',', ':'), ensure_ascii=False)\n        else:\n            yield _deep_json_dumps(value)\n        return\n    if name=='abs':\n        if isinstance(value, InputNumber) and value >= 0:\n            yield value\n        else:\n            yield _OverflowFloat(abs(value)) if isinstance(value, _OverflowFloat) else abs(value)\n        return\n    if name=='fabs': yield math.fabs(value); return\n    if name=='floor': yield math.floor(value); return\n    if name=='ceil': yield math.ceil(value); return\n    if name=='map':\n        result=[]\n        for x in value:\n            result.extend(_node(args[0], x, env))\n        yield result; return\n    if name == 'map_values':\n        if isinstance(value, list):\n            result=[]\n            for item in value: result.extend(_node(args[0], item, env))\n            yield result; return\n        if isinstance(value, dict):\n            result={}\n            for key, item in value.items():\n                outputs=list(_node(args[0], item, env))\n                if outputs: result[key]=outputs[0]\n            yield result; return\n        raise RuntimeError('map_values requires an array or object')\n    if name == 'with_entries':\n        if not isinstance(value, dict): raise RuntimeError('with_entries requires an object')\n        entries = [{'key': key, 'value': item} for key, item in value.items()]\n        transformed = []\n\"\"\"Errors crossing the interpreter's process boundary.\"\"\"\n\n\nclass CompileError(Exception):\n    \"\"\"The jq program could not be parsed or statically validated.\"\"\"\n\n\nclass RuntimeError(Exception):\n    \"\"\"Evaluation failed after the program was compiled.\"\"\"\n\n\n# Runtime failures raised by evaluator helpers must have the same semantics as\n# jq errors when they cross a flow operator.  Keep this tuple shared by the\n# evaluator and the CLI so try/optional do not accidentally miss a Python\n# arithmetic or recursion failure.\nFLOW_RUNTIME_ERRORS = (\n    RuntimeError,\n    ValueError,\n    TypeError,\n    IndexError,\n    ArithmeticError,\n    RecursionError,\n)\ntests/test_architecture.py:106:        self.assertNotEqual(result.stderr, \"\")\ntests/test_architecture.py:118:        self.assertNotEqual(result.stderr, \"\")\ntests/test_architecture.py:130:        self.assertNotEqual(result.stderr, \"\")\njq_interpreter/parser.py:115:        return self.post(Node('call',(t,())))\njq_interpreter/parser.py:135:            if self.p()=='(' and isinstance(x,Node) and x.operation=='call':\njq_interpreter/parser.py:142:                self.take(')'); x=Node('call',(name,tuple(args))); continue\njq_interpreter/parser.py:298:    # Bare calls are valid jq builtins as well as user definitions supplied by\njq_interpreter/parser.py:301:    known = set('empty error length type utf8bytelength not tonumber toboolean tostring tojson abs fabs floor ceil round trunc sin cos tan asin acos atan sinh cosh tanh asinh acosh atanh log log10 log1p log2 logb exp exp2 exp10 expm1 pow cbrt gamma lgamma tgamma erf erfc j0 j1 y0 y1 atan2 copysign drem fdim fmax fmin fmod frexp hypot jn ldexp modf nextafter nexttoward remainder scalb scalbln yn fma infinite nan isinfinite isnan isfinite isnormal keys keys_unsorted has in inside contains to_entries from_entries with_entries sort add min max min_by max_by any all arrays objects iterables booleans numbers normals finites strings nulls values scalars unique reverse paths path indices builtins modulemeta input inputs input_filename input_line_number debug implode explode trim ltrim rtrim trimstr ltrimstr rtrimstr ascii_downcase ascii_upcase startswith endswith split splits join isempty have_decnum fromdate todate fromdateiso8601 todateiso8601 strftime strflocaltime strptime gmtime localtime mktime map map_values select flatten transpose combinations walk test match capture scan sub gsub'.split())\njq_interpreter/parser.py:302:    if isinstance(result, Node) and result.operation == 'call' and not result.arguments[1] and result.arguments[0] not in known:\njq_interpreter/parser.py:399:    \"\"\"Reject breaks whose label is not lexically visible at the break.\njq_interpreter/evaluator.py:290:    elif op == \"call\": yield from _call(a[0],a[1],value,env)\njq_interpreter/evaluator.py:304:        # defined under ``1 as $x`` must keep seeing 1 when called beneath a\njq_interpreter/evaluator.py:306:        # definitions and calls, but do not retroactively change an earlier\njq_interpreter/evaluator.py:696:    objects), then compares values within a type lexicographically.  The\njq_interpreter/evaluator.py:765:    runtime error.  A Python call-stack overflow is not equivalent: it escapes\njq_interpreter/evaluator.py:896:    if op == 'call' and len(args) == 2 and not args[1] and node.arguments[0] in env.get('__params__', {}):\njq_interpreter/evaluator.py:954:        if not result and args[0].operation == 'call' and args[0].arguments[0] == 'map':\njq_interpreter/evaluator.py:963:        # the left side of an update, its caller-supplied filter supplies the\njq_interpreter/evaluator.py:973:    if op == 'call' and not args[1] and (args[0], 0) in env.get('__funcs__', {}):\njq_interpreter/evaluator.py:979:    if op == 'call' and not args[1] and args[0] in env:\njq_interpreter/evaluator.py:983:    if op == 'call' and args[0] == 'getpath' and args[1]:\njq_interpreter/evaluator.py:987:    if op == 'call' and args[0] == 'select' and args[1]:\njq_interpreter/evaluator.py:989:    if op == 'call' and not args[1] and args[0] == 'first':\njq_interpreter/evaluator.py:996:    if op == 'call' and not args[1] and args[0] == 'last':\njq_interpreter/evaluator.py:1151:def _call(name,args,value,env):\njq_interpreter/evaluator.py:1170:        # not in the caller's value-binding environment.  The caller is still\njq_interpreter/evaluator.py:1176:        # Filter arguments remain lazy closures over the caller.  Value\njq_interpreter/evaluator.py:1177:        # arguments are evaluated at the call site; every generated-value\njq_interpreter/evaluator.py:1262:        # jq compares those keys lexicographically.\njq_interpreter/evaluator.py:1570:        # Commas inside a call are generator values, not separate function\njq_interpreter/evaluator.py:1660:            if expression.arguments[2].operation == 'call' and expression.arguments[2].arguments[0] == 'map':\njq_interpreter/evaluator.py:1664:                  and expression.arguments[1].arguments[2].operation == 'call'\njq_interpreter/evaluator.py:2026:        yield from _regex_call(name, args, value, env)\njq_interpreter/evaluator.py:2113:def _regex_call(name: str, args: tuple[object, ...], value: object, env: dict[str, object]) -> ValueStream:\n","exit_code":0,"status":"completed"}}
{"type":"item.started","item":{"id":"item_5","type":"command_execution","command":"/bin/bash -lc \"sed -n '260,325p' jq_interpreter/evaluator.py; sed -n '1980,2045p' jq_interpreter/evaluator.py; sed -n '1,150p' tests/test_architecture.py; sed -n '1,90p' tests/conftest.py; sed -n '285,310p' jq_interpreter/parser.py\"","aggregated_output":"","exit_code":null,"status":"in_progress"}}
{"type":"item.completed","item":{"id":"item_5","type":"command_execution","command":"/bin/bash -lc \"sed -n '260,325p' jq_interpreter/evaluator.py; sed -n '1980,2045p' jq_interpreter/evaluator.py; sed -n '1,150p' tests/test_architecture.py; sed -n '1,90p' tests/conftest.py; sed -n '285,310p' jq_interpreter/parser.py\"","aggregated_output":"            states = [x / y for y in right for x in left]\n        initial=list(_node(a[2], value, env))\n        if op == 'foreach':\n            for start in initial:\n                current = start\n                for item in states:\n                    bound=dict(env)\n                    if not _bind_pattern(a[1], item, bound): continue\n                    outputs=list(_node(a[3], current, bound))\n                    for result in outputs:\n                        current = result\n                        if a[4] is None: yield result\n                        else: yield from _node(a[4], result, bound)\n            return\n        currents=initial\n        for item in states:\n            next_currents=[]\n            for current in currents:\n                bound=dict(env)\n                _initialize_pattern(a[1], bound)\n                if not _bind_pattern(a[1], item, bound):\n                    continue\n                next_currents.extend(_node(a[3], current, bound))\n            currents=next_currents\n            if op == \"foreach\":\n                if a[4] is None:\n                    yield from currents\n                else:\n                    for result in currents: yield from _node(a[4], result, env)\n        if op==\"reduce\": yield from currents\n    elif op == \"call\": yield from _call(a[0],a[1],value,env)\n    elif op == \"def\":\n        env.setdefault('__funcs__',{})[(a[0], len(a[1]))]=(a[1],a[2])\n        yield value\n    elif op == \"defprog\":\n        funcs=dict(env.get('__funcs__',{}))\n        definitions=[]\n        program: Node = node\n        while program.operation == 'defprog':\n            definitions.append(program.arguments[0].arguments)\n            program = program.arguments[1]\n        # Each definition captures the complete lexical environment visible\n        # at its point of declaration, including the overload set visible at\n        # that point.  Capturing only ``funcs`` is subtly wrong: a function\n        # defined under ``1 as $x`` must keep seeing 1 when called beneath a\n        # shadowing ``2 as $x``.  Later redefinitions affect subsequent\n        # definitions and calls, but do not retroactively change an earlier\n        # function's closure.\n        for name, params, body in definitions:\n            closure = dict(env)\n            closure['__funcs__'] = dict(funcs)\n            function = (params, body, closure)\n            closure['__funcs__'][(name, len(params))] = function  # permit recursion\n            funcs[(name, len(params))] = function\n        yield from _node(program, value, {**env, '__funcs__': funcs})\n    elif op == \"unsupported\": raise RuntimeError(\"unsupported syntax\")\n\nclass _Break(Exception):\n    def __init__(self, name): self.name=name\n\ndef _bind_pattern(pattern, value, env):\n    op, args=pattern.operation, pattern.arguments\n    if op=='pattern_alt':\n        first, second=args\n        trial=dict(env)\n        if _bind_pattern(first,value,trial): env.update(trial); return True\n            yield function(int(first), second)\n        return\n    if name == 'fma':\n        function = getattr(math, name, None)\n        if function is None: raise RuntimeError('fma is not available')\n        for first, second, third in _cartesian_arguments(args, value, env):\n            yield function(first, second, third)\n        return\n    if name in ('round','ceil','floor','fabs'):\n        if name == 'round': yield math.floor(value + 0.5)\n        else: yield getattr(math, name)(value)\n        return\n    if name in ('ltrimstr','rtrimstr','trimstr'):\n        needle = _one(args[0], value, env)\n        if not isinstance(value, str) or not isinstance(needle, str):\n            raise RuntimeError(('startswith()' if name == 'ltrimstr' else 'endswith()') + ' requires string inputs')\n        if name == 'ltrimstr': yield value[len(needle):] if value.startswith(needle) else value\n        elif name == 'rtrimstr': yield value[:-len(needle)] if needle and value.endswith(needle) else value\n        else:\n            result = value\n            if needle and result.startswith(needle): result = result[len(needle):]\n            if needle and result.endswith(needle): result = result[:-len(needle)]\n            yield result\n        return\n    if name in ('trim','ltrim','rtrim'):\n        if not isinstance(value, str): raise RuntimeError('trim input must be a string')\n        yield value.strip() if name == 'trim' else value.lstrip() if name == 'ltrim' else value.rstrip(); return\n    if name in ('ascii_downcase', 'ascii_upcase'):\n        if not isinstance(value, str):\n            raise RuntimeError(f'{name} input must be a string')\n        if name == 'ascii_downcase':\n            yield ''.join(chr(ord(char) + 32) if 'A' <= char <= 'Z' else char for char in value)\n        else:\n            yield ''.join(chr(ord(char) - 32) if 'a' <= char <= 'z' else char for char in value)\n        return\n    if name == 'startswith':\n        needle = _one(args[0], value, env)\n        if not isinstance(value, str) or not isinstance(needle, str):\n            raise RuntimeError('startswith() requires string inputs')\n        yield value.startswith(needle); return\n    if name == 'endswith':\n        needle = _one(args[0], value, env)\n        if not isinstance(value, str) or not isinstance(needle, str):\n            raise RuntimeError('endswith() requires string inputs')\n        yield value.endswith(needle); return\n    if name in ('test', 'match', 'capture', 'scan', 'split', 'splits', 'sub', 'gsub'):\n        yield from _regex_call(name, args, value, env)\n        return\n    if name in ('sort', 'unique'):\n        if not isinstance(value, list):\n            raise RuntimeError('cannot sort value')\n        ordered = sorted(value, key=cmp_to_key(_jq_compare))\n        if name == 'unique':\n            ordered = _dedupe_sorted(ordered)\n        yield ordered\n        return\n    if name in ('sort_by', 'group_by'):\n        if not isinstance(value, list): raise RuntimeError('cannot sort value')\n        key_filter = args[0]\n        keyed = [(item, list(_node(key_filter, item, env))) for item in value]\n        keyed.sort(key=cmp_to_key(\n            lambda first, second: _compare_key_sequences(first[1], second[1])))\n        ordered = [item for item, _ in keyed]\n        if name == 'group_by':\n            groups=[]\n            for item, key in keyed:\n\"\"\"Boundary tests for the foundational interpreter architecture.\"\"\"\n\nimport json\nimport subprocess\nimport sys\nimport unittest\nfrom pathlib import Path\n\nfrom jq_interpreter import CompileError, Interpreter, MODULE_BOUNDARIES\nfrom jq_interpreter.architecture import COMPILE_EXIT, RUNTIME_EXIT\nfrom jq_interpreter.runtime import EvaluationContext\nfrom jq_interpreter.paths import Path as JsonPath, get_path\n\nROOT = Path(__file__).parents[1]\nEXECUTABLE = ROOT / \"jq\"\n\n\nclass ArchitectureTests(unittest.TestCase):\n    def test_module_boundaries_name_each_foundational_subsystem(self) -> None:\n        modules = {boundary.module for boundary in MODULE_BOUNDARIES}\n        self.assertTrue({\n            \"jq\",\n            \"jq_interpreter.lexer\",\n            \"jq_interpreter.parser\",\n            \"jq_interpreter.evaluator\",\n            \"jq_interpreter.runtime\",\n            \"jq_interpreter.builtins\",\n        } <= modules)\n\n    def test_each_input_gets_isolated_evaluation_context(self) -> None:\n        first = EvaluationContext()\n        second = EvaluationContext()\n        first.bindings[\"answer\"] = 42\n        self.assertEqual(second.bindings, {})\n\n    def test_diagnostics_use_declared_process_exit_contract(self) -> None:\n        self.assertEqual((COMPILE_EXIT, RUNTIME_EXIT), (3, 5))\n\n    def test_special_numeric_literals_are_emitted_as_json_null(self) -> None:\n        result = subprocess.run(\n            [sys.executable, str(EXECUTABLE), \"-c\", \"nan, infinite\"],\n            input=\"null\\n\",\n            capture_output=True,\n            text=True,\n            check=False,\n        )\n        self.assertEqual(result.returncode, 0)\n        self.assertEqual(result.stdout.splitlines(), [\"null\", \"null\"])\n\n    def test_unicode_is_decoded_and_compactly_reencoded(self) -> None:\n        result = subprocess.run(\n            [sys.executable, str(EXECUTABLE), \"-c\", \".\"],\n            input='\"\\\\u03bc\"\\n',\n            capture_output=True,\n            text=True,\n            check=False,\n        )\n        self.assertEqual(result.returncode, 0)\n        self.assertEqual(json.loads(result.stdout), \"μ\")\n\n    def test_identity_preserves_order_and_multiplicity(self) -> None:\n        outputs = list(Interpreter(\".\").run([1, 2, 2]))\n        self.assertEqual(outputs, [1, 2, 2])\n\n    def test_compile_failure_is_distinct(self) -> None:\n        with self.assertRaises(CompileError):\n            Interpreter(\"not-a-filter\")\n\n    def test_path_read_does_not_mutate_value(self) -> None:\n        value = {\"nested\": {\"answer\": 42}}\n        self.assertEqual(get_path(value, JsonPath((\"nested\", \"answer\"))), 42)\n        self.assertEqual(value, {\"nested\": {\"answer\": 42}})\n\n    def test_executable_streams_compact_json_lines(self) -> None:\n        result = subprocess.run(\n            [sys.executable, str(EXECUTABLE), \"-c\", \".\"],\n            input='{\"a\": 1}\\n[2, 3]\\n',\n            capture_output=True,\n            text=True,\n            check=False,\n        )\n        self.assertEqual(result.returncode, 0)\n        self.assertEqual(\n            [json.loads(line) for line in result.stdout.splitlines()],\n            [{\"a\": 1}, [2, 3]],\n        )\n\n    def test_executable_reports_compile_exit_three(self) -> None:\n        result = subprocess.run(\n            [sys.executable, str(EXECUTABLE), \"-c\", \"x\"],\n            capture_output=True,\n            text=True,\n            check=False,\n        )\n        self.assertEqual(result.returncode, 3)\n\n    def test_executable_reports_runtime_exit_five(self) -> None:\n        result = subprocess.run(\n            [sys.executable, str(EXECUTABLE), \"-c\", \"error\"],\n            input=\"null\\n\",\n            capture_output=True,\n            text=True,\n            check=False,\n        )\n        self.assertEqual(result.returncode, 5)\n        self.assertNotEqual(result.stderr, \"\")\n\n    def test_runtime_failure_keeps_prior_generator_output(self) -> None:\n        result = subprocess.run(\n            [sys.executable, str(EXECUTABLE), \"-c\", \"1, error\"],\n            input=\"null\\n\",\n            capture_output=True,\n            text=True,\n            check=False,\n        )\n        self.assertEqual(result.returncode, 5)\n        self.assertEqual(result.stdout.splitlines(), [\"1\"])\n        self.assertNotEqual(result.stderr, \"\")\n\n    def test_runtime_diagnostic_is_not_written_to_stdout(self) -> None:\n        result = subprocess.run(\n            [sys.executable, str(EXECUTABLE), \"-c\", \"error\"],\n            input=\"null\\n\",\n            capture_output=True,\n            text=True,\n            check=False,\n        )\n        self.assertEqual(result.returncode, 5)\n        self.assertEqual(result.stdout, \"\")\n        self.assertNotEqual(result.stderr, \"\")\n\n\nif __name__ == \"__main__\":\n    unittest.main()\nimport sys\nfrom pathlib import Path\n\nROOT = Path(__file__).parents[1]\nif str(ROOT) not in sys.path:\n    sys.path.insert(0, str(ROOT))\n                elif stripped[cursor]==')': depth-=1\n                cursor+=1\n            parts.append(parse(stripped[mark+2:cursor-1])); pos=cursor\n        return StringTemplate(tuple(parts))\n    if stripped.startswith('@') and ' \"' in stripped:\n        name, template=stripped.split(None,1); inner=parse(template)\n        return Format(name[1:], inner if isinstance(inner,StringTemplate) else StringTemplate((inner,)))\n    try:\n        result=Parser(source).parse()\n    except (IndexError, ValueError) as error:\n        raise CompileError('syntax error') from error\n    _validate_labels(result)\n    _validate_variables(result)\n    # Bare calls are valid jq builtins as well as user definitions supplied by\n    # the builtin library.  Retain compile-time rejection for an unknown bare\n    # identifier while registering the standard library's zero-argument names.\n    known = set('empty error length type utf8bytelength not tonumber toboolean tostring tojson abs fabs floor ceil round trunc sin cos tan asin acos atan sinh cosh tanh asinh acosh atanh log log10 log1p log2 logb exp exp2 exp10 expm1 pow cbrt gamma lgamma tgamma erf erfc j0 j1 y0 y1 atan2 copysign drem fdim fmax fmin fmod frexp hypot jn ldexp modf nextafter nexttoward remainder scalb scalbln yn fma infinite nan isinfinite isnan isfinite isnormal keys keys_unsorted has in inside contains to_entries from_entries with_entries sort add min max min_by max_by any all arrays objects iterables booleans numbers normals finites strings nulls values scalars unique reverse paths path indices builtins modulemeta input inputs input_filename input_line_number debug implode explode trim ltrim rtrim trimstr ltrimstr rtrimstr ascii_downcase ascii_upcase startswith endswith split splits join isempty have_decnum fromdate todate fromdateiso8601 todateiso8601 strftime strflocaltime strptime gmtime localtime mktime map map_values select flatten transpose combinations walk test match capture scan sub gsub'.split())\n    if isinstance(result, Node) and result.operation == 'call' and not result.arguments[1] and result.arguments[0] not in known:\n        raise CompileError('unknown filter')\n    return result\n\n\n_PREDEFINED_VARIABLES = {'ENV', 'JQ_BUILD_CONFIGURATION', 'ARGS', '__loc__'}\n\n\ndef _validate_variables(node: Filter, visible: frozenset[str] = frozenset()) -> None:\n","exit_code":0,"status":"completed"}}
{"type":"item.started","item":{"id":"item_6","type":"command_execution","command":"/bin/bash -lc \"rg -n -C 3 '(\"'^|[|,( ])(debug|stderr|halt_error)'\"' sources/jq.test\"","aggregated_output":"","exit_code":null,"status":"in_progress"}}
{"type":"item.completed","item":{"id":"item_6","type":"command_execution","command":"/bin/bash -lc \"rg -n -C 3 '(\"'^|[|,( ])(debug|stderr|halt_error)'\"' sources/jq.test\"","aggregated_output":"2332-\"Invalid numeric literal at EOF at line 1, column 8 (while parsing 'NaN10000')\"\n2333-\"Invalid numeric literal at EOF at line 1, column 9 (while parsing 'NaN100000')\"\n2334-\n2335:# calling input/0, or debug/0 in a test doesn't crash jq\n2336-\n2337-try input catch .\n2338-null\n2339-\"break\"\n2340-\n2341:debug\n2342-1\n2343-1\n2344-\n","exit_code":0,"status":"completed"}}
{"type":"item.started","item":{"id":"item_7","type":"command_execution","command":"/bin/bash -lc \"rg -n 'debug|stderr|halt_error' sources/jq.test sources/jq-manual.txt\"","aggregated_output":"","exit_code":null,"status":"in_progress"}}
{"type":"item.completed","item":{"id":"item_7","type":"command_execution","command":"/bin/bash -lc \"rg -n 'debug|stderr|halt_error' sources/jq.test sources/jq-manual.txt\"","aggregated_output":"sources/jq.test:2335:# calling input/0, or debug/0 in a test doesn't crash jq\nsources/jq.test:2341:debug\nsources/jq-manual.txt:1063:`halt_error`, `halt_error(exit_code)`\nsources/jq-manual.txt:1067:be printed on `stderr` as raw output (i.e., strings will not\nsources/jq-manual.txt:1073:For example, `\"Error: something went wrong\\n\"|halt_error(1)`.\nsources/jq-manual.txt:3317:Two builtins provide minimal output capabilities, `debug`, and\nsources/jq-manual.txt:3318:`stderr`.  (Recall that a jq program's output values are always\nsources/jq-manual.txt:3319:output as JSON texts on `stdout`.) The `debug` builtin can have\nsources/jq-manual.txt:3321:the libjq C API but aren't the jq executable itself.  The `stderr`\nsources/jq-manual.txt:3322:builtin outputs its input in raw mode to stderr with no additional\nsources/jq-manual.txt:3358:`debug`, `debug(msgs)`\nsources/jq-manual.txt:3362:production of one or more messages on stderr.\nsources/jq-manual.txt:3364:The message produced by the `debug` filter has the form\nsources/jq-manual.txt:3371:The `debug(msgs)` filter is defined as `(msgs | debug | empty), .`\nsources/jq-manual.txt:3373:while also allowing multi-line debugging statements to be created.\nsources/jq-manual.txt:3377:    1 as $x | 2 | debug(\"Entering function foo with $x == \\($x)\", .) | (.+1)\nsources/jq-manual.txt:3380:being written to stderr:\nsources/jq-manual.txt:3387:`stderr`\nsources/jq-manual.txt:3390:Prints its input in raw and compact mode to stderr with no\nsources/jq-manual.txt:3709:        @json \"total: Invalid number \\($dot).\\n\" | halt_error(1)\n","exit_code":0,"status":"completed"}}
{"type":"item.started","item":{"id":"item_8","type":"command_execution","command":"/bin/bash -lc \"rg -n '\"'^def _deep_json_dumps|def _stringify|def _one|op == .try|try:'\"' jq_interpreter/evaluator.py | head -30 && sed -n '760,820p' jq_interpreter/evaluator.py && sed -n '2010,2035p' jq_interpreter/evaluator.py && sed -n '1,80p' jq_interpreter/architecture.py\"","aggregated_output":"","exit_code":null,"status":"in_progress"}}
{"type":"item.completed","item":{"id":"item_8","type":"command_execution","command":"/bin/bash -lc \"rg -n '\"'^def _deep_json_dumps|def _stringify|def _one|op == .try|try:'\"' jq_interpreter/evaluator.py | head -30 && sed -n '760,820p' jq_interpreter/evaluator.py && sed -n '2010,2035p' jq_interpreter/evaluator.py && sed -n '1,80p' jq_interpreter/architecture.py\"","aggregated_output":"        if name == 'ascii_downcase':\n            yield ''.join(chr(ord(char) + 32) if 'A' <= char <= 'Z' else char for char in value)\n        else:\n            yield ''.join(chr(ord(char) - 32) if 'a' <= char <= 'z' else char for char in value)\n        return\n    if name == 'startswith':\n        needle = _one(args[0], value, env)\n        if not isinstance(value, str) or not isinstance(needle, str):\n            raise RuntimeError('startswith() requires string inputs')\n        yield value.startswith(needle); return\n    if name == 'endswith':\n        needle = _one(args[0], value, env)\n        if not isinstance(value, str) or not isinstance(needle, str):\n            raise RuntimeError('endswith() requires string inputs')\n        yield value.endswith(needle); return\n    if name in ('test', 'match', 'capture', 'scan', 'split', 'splits', 'sub', 'gsub'):\n        yield from _regex_call(name, args, value, env)\n        return\n    if name in ('sort', 'unique'):\n        if not isinstance(value, list):\n            raise RuntimeError('cannot sort value')\n        ordered = sorted(value, key=cmp_to_key(_jq_compare))\n        if name == 'unique':\n            ordered = _dedupe_sorted(ordered)\n        yield ordered\n        return\n\"\"\"Stable ownership map for the standalone interpreter.\n\nThis module contains only architectural metadata and process-level constants.\nFeature implementations belong in the modules named by ``MODULE_BOUNDARIES``.\n\"\"\"\n\nfrom dataclasses import dataclass\n\n\n@dataclass(frozen=True)\nclass ModuleBoundary:\n    \"\"\"Name and responsibility of one interpreter subsystem.\"\"\"\n\n    module: str\n    responsibility: str\n\n\nMODULE_BOUNDARIES: tuple[ModuleBoundary, ...] = (\n    ModuleBoundary(\"jq\", \"executable entry point and command-line validation\"),\n    ModuleBoundary(\"jq_interpreter.lexer\", \"source text to positioned tokens\"),\n    ModuleBoundary(\"jq_interpreter.parser\", \"tokens to immutable filter AST\"),\n    ModuleBoundary(\"jq_interpreter.ast\", \"immutable syntax and compiled filter nodes\"),\n    ModuleBoundary(\"jq_interpreter.evaluator\", \"ordered generator evaluation and control flow\"),\n    ModuleBoundary(\"jq_interpreter.runtime\", \"JSON values, streams, and evaluation context\"),\n    ModuleBoundary(\"jq_interpreter.paths\", \"immutable path reads and updates\"),\n    ModuleBoundary(\"jq_interpreter.builtins\", \"jq standard-library filter implementations\"),\n    ModuleBoundary(\"jq_interpreter.diagnostics\", \"diagnostics and process exit policy\"),\n)\n\nCOMPILE_EXIT = 3\nRUNTIME_EXIT = 5\n","exit_code":0,"status":"completed"}}
{"type":"item.started","item":{"id":"item_9","type":"command_execution","command":"/bin/bash -lc \"sed -n '2250,2295p' jq_interpreter/evaluator.py; sed -n '228,255p' jq_interpreter/evaluator.py; sed -n '379,390p' jq_interpreter/evaluator.py; sed -n '80,120p' jq_interpreter/evaluator.py\"","aggregated_output":"","exit_code":null,"status":"in_progress"}}
{"type":"item.completed","item":{"id":"item_9","type":"command_execution","command":"/bin/bash -lc \"sed -n '2250,2295p' jq_interpreter/evaluator.py; sed -n '228,255p' jq_interpreter/evaluator.py; sed -n '379,390p' jq_interpreter/evaluator.py; sed -n '80,120p' jq_interpreter/evaluator.py\"","aggregated_output":"    return type(value).__name__\n\n\ndef _raise_unavailable(name: str) -> float:\n    raise RuntimeError(f'{name} is not available')\n\ndef _stringify(value: object) -> str:\n    if isinstance(value, InputNumber):\n        # This build uses the ordinary IEEE-754 numeric backend.  Input\n        # literals therefore stringify after conversion, matching jq's\n        # have_decnum=false behavior; _deep_json_dumps still preserves the\n        # source spelling for values that remain literal numbers internally.\n        value = float(value)\n    if isinstance(value, float) and math.isfinite(value) and value.is_integer():\n        if abs(value) >= 1e16:\n            from decimal import Decimal\n            return format(Decimal(str(value)), '.0f')\n        return str(int(value))\n    return value if isinstance(value, str) else _deep_json_dumps(value)\n\ndef _apply_format(name: str, value: object, template: bool = False) -> str:\n    import base64, html, urllib.parse\n    if name == \"text\": return _stringify(value)\n    if name == \"json\": return _deep_json_dumps(value)\n    if name == \"html\": return html.escape(_stringify(value), quote=True).replace(\"&#x27;\", \"&apos;\")\n    if name == \"uri\": return urllib.parse.quote(_stringify(value), safe=\"-_.~\")\n    if name == \"urid\": return urllib.parse.unquote(_stringify(value))\n    if name in (\"base64\", \"base64d\"):\n        if not isinstance(value, str):\n            raise RuntimeError(f\"{name}/0 requires a string\")\n        try:\n            if name == \"base64\":\n                return base64.b64encode(value.encode(\"utf-8\")).decode(\"ascii\")\n            return base64.b64decode(value.encode(\"ascii\"), validate=True).decode(\"utf-8\")\n        except (UnicodeDecodeError, ValueError, base64.binascii.Error) as error:\n            raise RuntimeError(\"invalid base64 data\") from error\n    if name == \"csv\":\n        if not isinstance(value, list): raise RuntimeError(\"@csv requires an array\")\n        return \",\".join(_csv_field(item) for item in value)\n    if name == \"tsv\":\n        if not isinstance(value, list): raise RuntimeError(\"@tsv requires an array\")\n        return \"\\t\".join(_tsv_field(item) for item in value)\n    if name == \"sh\":\n        fields = value if isinstance(value, list) else [value]\n        return \" \".join(\"'\" + _format_field(item).replace(\"'\", \"'\\\\''\") + \"'\" for item in fields)\n    raise RuntimeError(f\"unknown format @{name}\")\n                return\n    elif op == \"if\":\n        # The condition is a filter, not a scalar expression.  jq evaluates\n        # each condition result independently and therefore may select both\n        # branches for one input.\n        for condition in _node(a[0], value, env):\n            branch = a[1] if _truth(condition) else a[2]\n            yield from _node(branch, value, env)\n    elif op == \"try\":\n        try: yield from _node(a[0],value,env)\n        except FLOW_RUNTIME_ERRORS as error:\n            if a[1] is not None:\n                caught = error.args[0] if error.args else str(error)\n                yield from _node(a[1],caught,env)\n    elif op == \"label\":\n        try: yield from _node(a[1], value, {**env, '__label__': a[0]})\n        except _Break as exc:\n            if exc.name != a[0]: raise\n    elif op == \"break\":\n        raise _Break(a[0])\n    elif op in (\"reduce\", \"foreach\"):\n        states=list(_node(a[0], value, env))\n        # Binary filters in jq are generator products whose divisor-side\n        # stream is advanced outermost.  This matters for reductions and\n        # foreach because their state observes the ordering, even though the\n        # resulting multiset is unchanged.\n        source = a[0]\n        if (source.operation == 'binary' and source.arguments[0] == '/'\ndef _one(node, value, env):\n    vals=list(_node(node,value,env)); return vals[0] if vals else None\n\n\ndef _cartesian_arguments(args, value, env):\n    \"\"\"Evaluate filter arguments and yield their ordered Cartesian product.\n\n    jq arguments are filters rather than already-evaluated scalar values.  A\n    filter can therefore produce zero, one, or many values.  The leftmost\n    argument is the outermost dimension, matching jq's generator ordering.\n    Materializing each individual stream is intentional: every combination\n    must reuse the complete stream for each argument.\n        return\n    if isinstance(program, Raise):\n        raise RuntimeError(program.message)\n    if isinstance(program, Array):\n        yield list(evaluate(program.expression, value))\n        return\n    if isinstance(program, Limit):\n        outputs = iter(evaluate(program.expression, value))\n        for _ in range(program.count):\n            try:\n                yield next(outputs)\n            except StopIteration:\n                break\n        return\n    raise RuntimeError(\"unknown compiled filter\")\n\ndef _node(node: Node, value: object, env: dict[str, object]) -> ValueStream:\n    op, a = node.operation, node.arguments\n    if op == \"identity\": yield value\n    elif op == \"literal\":\n        text=a[0]; special={\"true\":True,\"false\":False,\"null\":None,\"nan\":float(\"nan\"),\"infinite\":float(\"inf\"),\"-infinite\":float(\"-inf\"),\"-nan\":float(\"nan\")}\n        if text in special:\n            yield special[text]\n        else:\n            parsed = json.loads(text)\n            if isinstance(parsed, int) and abs(parsed) > 2**53:\n                parsed = float(parsed)\n            if isinstance(parsed, float) and math.isinf(parsed):\n                parsed = _OverflowFloat(parsed)\n            yield parsed\n    elif op == \"string\": yield _decode_string(a[0], value, env)\n    elif op == \"format\": yield _apply_format(a[0], value)\n    elif op == \"format_template\":\n        # Interpolation is evaluated first; the formatter consumes the\n        # resulting string (not the original input value).\n        yield _apply_format(a[0], _decode_string(a[1], value, env))\n    elif op == \"var\":\n        if a[0] == '__loc__':\n            yield {'file': '<top-level>', 'line': 1}\n            return\n        if a[0] in env and not isinstance(env[a[0]], tuple):\n","exit_code":0,"status":"completed"}}
{"type":"item.completed","item":{"id":"item_10","type":"agent_message","text":"The interpreter already has generic builtin-call dispatch and a clean CLI boundary, but diagnostics are currently absent from the builtin table. I’m adding a dedicated non-catchable halt signal so `halt_error` can stop evaluation with its requested status while ordinary `try/catch` behavior remains unchanged; `debug` and `stderr` will write only to the process’s stderr and still yield the input value."}}
{"type":"item.started","item":{"id":"item_11","type":"file_change","changes":[{"path":"/mnt/c/Users/barlo/projects/drydock/uat/jq/runs/20260822.044627/build/jq/jq_interpreter/__init__.py","kind":"update"},{"path":"/mnt/c/Users/barlo/projects/drydock/uat/jq/runs/20260822.044627/build/jq/jq_interpreter/cli.py","kind":"update"},{"path":"/mnt/c/Users/barlo/projects/drydock/uat/jq/runs/20260822.044627/build/jq/jq_interpreter/errors.py","kind":"update"},{"path":"/mnt/c/Users/barlo/projects/drydock/uat/jq/runs/20260822.044627/build/jq/jq_interpreter/evaluator.py","kind":"update"},{"path":"/mnt/c/Users/barlo/projects/drydock/uat/jq/runs/20260822.044627/build/jq/jq_interpreter/parser.py","kind":"update"},{"path":"/mnt/c/Users/barlo/projects/drydock/uat/jq/runs/20260822.044627/build/jq/tests/test_io_002_diagnostics.py","kind":"add"}],"status":"in_progress"}}
{"type":"item.completed","item":{"id":"item_11","type":"file_change","changes":[{"path":"/mnt/c/Users/barlo/projects/drydock/uat/jq/runs/20260822.044627/build/jq/jq_interpreter/__init__.py","kind":"update"},{"path":"/mnt/c/Users/barlo/projects/drydock/uat/jq/runs/20260822.044627/build/jq/jq_interpreter/cli.py","kind":"update"},{"path":"/mnt/c/Users/barlo/projects/drydock/uat/jq/runs/20260822.044627/build/jq/jq_interpreter/errors.py","kind":"update"},{"path":"/mnt/c/Users/barlo/projects/drydock/uat/jq/runs/20260822.044627/build/jq/jq_interpreter/evaluator.py","kind":"update"},{"path":"/mnt/c/Users/barlo/projects/drydock/uat/jq/runs/20260822.044627/build/jq/jq_interpreter/parser.py","kind":"update"},{"path":"/mnt/c/Users/barlo/projects/drydock/uat/jq/runs/20260822.044627/build/jq/tests/test_io_002_diagnostics.py","kind":"add"}],"status":"completed"}}
{"type":"item.started","item":{"id":"item_12","type":"command_execution","command":"/bin/bash -lc 'pytest -q tests/test_io_002_diagnostics.py tests/test_architecture.py tests/test_core_003_errors.py'","aggregated_output":"","exit_code":null,"status":"in_progress"}}
{"type":"item.completed","item":{"id":"item_12","type":"command_execution","command":"/bin/bash -lc 'pytest -q tests/test_io_002_diagnostics.py tests/test_architecture.py tests/test_core_003_errors.py'","aggregated_output":"...F...................                                                  [100%]\n=================================== FAILURES ===================================\n________ test_halt_error_emits_raw_value_and_stops_after_partial_output ________\n\n    def test_halt_error_emits_raw_value_and_stops_after_partial_output() -> None:\n        result = run('1, \"failed\" | halt_error(7)')\n    \n        assert result.returncode == 7\n>       assert [json.loads(line) for line in result.stdout.splitlines()] == [1]\nE       assert [] == [1]\nE         \nE         Right contains one more item: 1\nE         Use -v to get more diff\n\ntests/test_io_002_diagnostics.py:44: AssertionError\n=========================== short test summary info ============================\nFAILED tests/test_io_002_diagnostics.py::test_halt_error_emits_raw_value_and_stops_after_partial_output\n1 failed, 22 passed in 3.64s\n","exit_code":1,"status":"failed"}}
{"type":"item.completed","item":{"id":"item_13","type":"agent_message","text":"The focused suite found one issue in the new test scenario, not the implementation: the test piped both generated values into `halt_error`, so no value was supposed to reach stdout. I’m correcting the test to model jq’s partial-output contract (`1` first, then halt), then I’ll run the scoped authoritative harness."}}
{"type":"item.started","item":{"id":"item_14","type":"file_change","changes":[{"path":"/mnt/c/Users/barlo/projects/drydock/uat/jq/runs/20260822.044627/build/jq/tests/test_io_002_diagnostics.py","kind":"update"}],"status":"in_progress"}}
{"type":"item.completed","item":{"id":"item_14","type":"file_change","changes":[{"path":"/mnt/c/Users/barlo/projects/drydock/uat/jq/runs/20260822.044627/build/jq/tests/test_io_002_diagnostics.py","kind":"update"}],"status":"completed"}}
{"type":"item.started","item":{"id":"item_15","type":"command_execution","command":"/bin/bash -lc 'pytest -q tests/test_io_002_diagnostics.py tests/test_architecture.py tests/test_core_003_errors.py && JQ=\"$PWD/jq\" python3 sources/run_conformance.py --select '\"'debug|stderr|halt_error' --json\"","aggregated_output":"","exit_code":null,"status":"in_progress"}}
{"type":"item.completed","item":{"id":"item_15","type":"command_execution","command":"/bin/bash -lc 'pytest -q tests/test_io_002_diagnostics.py tests/test_architecture.py tests/test_core_003_errors.py && JQ=\"$PWD/jq\" python3 sources/run_conformance.py --select '\"'debug|stderr|halt_error' --json\"","aggregated_output":".......................                                                  [100%]\n23 passed in 3.89s\n{\n  \"candidate\": [\n    \"/mnt/c/Users/barlo/projects/drydock/uat/jq/runs/20260822.044627/build/jq/jq\"\n  ],\n  \"corpus\": \"jq.test\",\n  \"summary\": {\n    \"pass\": 1,\n    \"fail\": 0,\n    \"error\": 0,\n    \"skip\": 0\n  },\n  \"cases\": []\n}\n","exit_code":0,"status":"completed"}}
{"type":"item.started","item":{"id":"item_16","type":"command_execution","command":"/bin/bash -lc 'pytest -q'","aggregated_output":"","exit_code":null,"status":"in_progress"}}
{"type":"item.completed","item":{"id":"item_17","type":"agent_message","text":"The diagnostics acceptance slice passes (1 pass, 0 fail, 0 error), and the focused regression tests pass. The broader project suite is substantially green but exceeded the first command’s 30-second wait window before printing its final summary, so I’m checking completion explicitly and reviewing the final file set for unintended changes."}}
{"type":"item.completed","item":{"id":"item_16","type":"command_execution","command":"/bin/bash -lc 'pytest -q'","aggregated_output":"........................................................................ [ 40%]\n........................................................................ [ 81%]\n.................................                                        [100%]\n177 passed in 34.84s\n","exit_code":0,"status":"completed"}}
{"type":"item.started","item":{"id":"item_18","type":"command_execution","command":"/bin/bash -lc 'pytest -q'","aggregated_output":"","exit_code":null,"status":"in_progress"}}
{"type":"item.completed","item":{"id":"item_18","type":"command_execution","command":"/bin/bash -lc 'pytest -q'","aggregated_output":"........................................................................ [ 40%]\n........................................................................ [ 81%]\n.................................                                        [100%]\n177 passed in 29.19s\n","exit_code":0,"status":"completed"}}
{"type":"item.started","item":{"id":"item_19","type":"command_execution","command":"/bin/bash -lc 'git status --short && git diff --stat && git diff --check && JQ=\"$PWD/jq\" python3 sources/run_conformance.py --select '\"'debug|stderr|halt_error' --json\"","aggregated_output":"","exit_code":null,"status":"in_progress"}}
{"type":"item.completed","item":{"id":"item_19","type":"command_execution","command":"/bin/bash -lc 'git status --short && git diff --stat && git diff --check && JQ=\"$PWD/jq\" python3 sources/run_conformance.py --select '\"'debug|stderr|halt_error' --json\"","aggregated_output":" M jq_interpreter/__init__.py\n M jq_interpreter/cli.py\n M jq_interpreter/errors.py\n M jq_interpreter/evaluator.py\n M jq_interpreter/interpreter.py\n M jq_interpreter/parser.py\n M tests/test_json_io.py\n M ../../evidence/commands/09-initial-ready.stdout.log\n D ../../evidence/commands/10-initial-build-1.llm.log\n M ../../evidence/commands/10-initial-build-1.stderr.log\n M ../../evidence/commands/10-initial-build-1.stdout.log\n D ../../evidence/commands/11-after-initial-build-build-status.stderr.log\n D ../../evidence/commands/11-after-initial-build-build-status.stdout.log\n D ../../evidence/commands/12-after-initial-build-target-status.stderr.log\n D ../../evidence/commands/12-after-initial-build-target-status.stdout.log\n D ../../evidence/commands/13-after-initial-build-workspace-status.stderr.log\n D ../../evidence/commands/13-after-initial-build-workspace-status.stdout.log\n D ../../workspace/targets/jq/ERRORS.md\n M ../../workspace/targets/jq/MANIFEST.md\n M ../../workspace/targets/jq/PROJECT_STATUS.jsonl\n M ../../workspace/targets/jq/QuarterDeck/commanders_chair.html\n D ../../workspace/targets/jq/STOP_NOW.md\n M ../../workspace/targets/jq/evidence/block-37.md\n M ../../workspace/targets/jq/evidence/prepassed-acceptance.json\n?? tests/test_io_002_diagnostics.py\n?? tests/test_service_date_time.py\n?? ../../evidence/commands/superseded/20260823.113801/\n?? ../../workspace/logs/20260823.113802.284Z_jq_status.log\n?? ../../workspace/logs/20260823.113803.929Z_jq_build_codex.log\n?? ../../workspace/logs/20260823.113822.128Z_jq_build_codex.llm.log\n?? ../../workspace/logs/20260823.113822.128Z_jq_build_codex.output.txt\n?? ../../workspace/logs/20260823.113822.128Z_jq_build_codex.prompt.md\n?? ../../workspace/logs/20260823.113822.128Z_jq_build_codex.raw.jsonl\n?? ../../workspace/logs/20260823.114405.252Z_jq_build_codex.llm.log\n?? ../../workspace/logs/20260823.114405.252Z_jq_build_codex.output.txt\n?? ../../workspace/logs/20260823.114405.252Z_jq_build_codex.prompt.md\n?? ../../workspace/logs/20260823.114405.252Z_jq_build_codex.raw.jsonl\n?? ../../workspace/logs/20260823.114405.252Z_jq_build_codex.stderr.log\n?? ../../workspace/logs/20260823.114910.696Z_jq_build_codex.prompt.md\n?? ../../workspace/logs/20260823.114910.696Z_jq_build_codex.raw.jsonl\n?? ../../workspace/logs/20260823.114910.696Z_jq_build_codex.stderr.log\n?? ../../workspace/targets/jq/evidence/block-38.md\n?? ../../workspace/targets/jq/evidence/block-39.md\n .../build/jq/jq_interpreter/__init__.py            |   4 +-\n .../20260822.044627/build/jq/jq_interpreter/cli.py |  13 +-\n .../build/jq/jq_interpreter/errors.py              |   9 +\n .../build/jq/jq_interpreter/evaluator.py           | 117 +++++-\n .../build/jq/jq_interpreter/interpreter.py         |  47 ++-\n .../build/jq/jq_interpreter/parser.py              |   2 +-\n .../20260822.044627/build/jq/tests/test_json_io.py |  21 ++\n .../evidence/commands/09-initial-ready.stdout.log  |   2 +-\n .../evidence/commands/10-initial-build-1.llm.log   | 229 -----------\n .../commands/10-initial-build-1.stderr.log         |   2 -\n .../commands/10-initial-build-1.stdout.log         | 418 +--------------------\n .../11-after-initial-build-build-status.stderr.log |   0\n .../11-after-initial-build-build-status.stdout.log | 141 -------\n ...12-after-initial-build-target-status.stderr.log |   0\n ...12-after-initial-build-target-status.stdout.log |  49 ---\n ...after-initial-build-workspace-status.stderr.log |   0\n ...after-initial-build-workspace-status.stdout.log |  16 -\n .../20260822.044627/workspace/targets/jq/ERRORS.md |  33 --\n .../workspace/targets/jq/MANIFEST.md               |  25 +-\n .../workspace/targets/jq/PROJECT_STATUS.jsonl      |   5 +-\n .../targets/jq/QuarterDeck/commanders_chair.html   |  13 +-\n .../workspace/targets/jq/STOP_NOW.md               |  13 -\n .../workspace/targets/jq/evidence/block-37.md      | 105 +-----\n .../targets/jq/evidence/prepassed-acceptance.json  |   2 +\n 24 files changed, 230 insertions(+), 1036 deletions(-)\n{\n  \"candidate\": [\n    \"/mnt/c/Users/barlo/projects/drydock/uat/jq/runs/20260822.044627/build/jq/jq\"\n  ],\n  \"corpus\": \"jq.test\",\n  \"summary\": {\n    \"pass\": 1,\n    \"fail\": 0,\n    \"error\": 0,\n    \"skip\": 0\n  },\n  \"cases\": []\n}\n","exit_code":0,"status":"completed"}}
{"type":"item.completed","item":{"id":"item_20","type":"agent_message","text":"RESULT: SUCCESS\n\nFILES CHANGED:\n- jq_interpreter/__init__.py\n- jq_interpreter/cli.py\n- jq_interpreter/errors.py\n- jq_interpreter/evaluator.py\n- jq_interpreter/parser.py\n- tests/test_io_002_diagnostics.py\n\nSUMMARY:\nImplemented `debug`, `stderr`, and `halt_error` with channel separation and exit semantics. All 177 tests pass; diagnostics conformance passes with 1 pass, 0 failures, 0 errors.\n\nBLOCKERS:\n- None"}}
{"type":"turn.completed","usage":{"input_tokens":1596645,"cached_input_tokens":1492736,"cache_write_input_tokens":0,"output_tokens":5849,"reasoning_output_tokens":1605}}