Build Receipt

jq

Run 20260822.044628.383Z · Target jq · codex/gpt-5.6-luna · 2026-08-22 00:46:28 EDT — 2026-08-23 10:27:37 EDT
AcceptedDrydock
jq: SCORE RELEASE
2026-08-23 08:33:02 EDT

Workflow

Every lifecycle state, in order. States not held in PROJECT_STATUS.jsonl are marked not established; they are not failures.

StateResultWhenCommandDetail
INITIALIZEDPASS2026-08-22 00:46:29 EDTdrydock init jq
IMPORTEDPASS2026-08-22 00:46:33 EDTdrydock import jq
ANALYZEDPASS2026-08-22 00:48:42 EDTdrydock analyze jq
PLAN CREATEDPASS2026-08-22 15:46:51 EDTdrydock plan jqattempt 5 of 5
PLAN REPAIREDNOT ESTABLISHED——This lifecycle gate has not run.
BUILDINGPASS2026-08-23 07:38:11 EDTdrydock build jqattempt 4 of 4
BUILTPASS2026-08-23 08:16:58 EDTdrydock build jq
SCORE ACFAIL2026-08-23 08:29:16 EDTdrydock score ac jq3 of 57 failed
SCORE BUILDFAIL2026-08-23 08:29:18 EDTdrydock score build jq1 block(s) unverified
SCORE RELEASEPASS2026-08-23 08:33:02 EDTdrydock score release jq

Scores

The last recorded run and output for every score command.

ScoreLast runResultOutput
spec—NOT RUNSPECIFICATION_SCORECARD.md
not written
ac2026-08-23 08:20FAILSOUNDINGS.md
2026-08-23 08:29 · 57 criteria: 18 passed, 36 prepassed, 3 failed
build2026-08-23 10:27PASS—
console report; writes no file
release2026-08-23 08:29PASSSCORECARD.md
2026-08-23 08:33
report—NOT RUNdrydock_receipt/index.html
not written
Verdict
PASSED
Target
jq
Run
20260822.044628.383Z
Drydock
0.2.0
Commands
51
Elapsed
39162.8s
LLM calls
187
Tokens
cached 140,953,088 · uncached 13,717,106 · output 813,760
Blocks
43 recorded
Criteria
18 passed / 3 failed / 0 unverified
Code
open code
Workspace
open workspace

RUN NOTES:

  • One run is evidence of one run. It is not a benchmark.
  • It is not a security certification of the delivered code.

Commands

Every command Drydock ran for this Target in this run, in order, with the model it drove and its captured transcript.

#WhenCommandResultElapsedTranscript
12026-08-22 00:46:28 EDTdrydock init jqOK2.1stranscript
22026-08-22 00:46:30 EDTdrydock import jq /mnt/c/Users/barlo/projects/drydock/uat/jq/runs/20260822.044627/sources --format markdownOK3.6stranscript
32026-08-22 00:46:34 EDTdrydock analyze jq codex/gpt-5.6-lunaOK129.5stranscript
42026-08-22 00:48:44 EDTdrydock plan jq --override codex/gpt-5.6-luna rerun 1 of 4OK1356.7stranscript
52026-08-22 01:11:21 EDTdrydock plan verify jq rerun 1 of 14FAIL
RE-RUN
1.8s—
62026-08-22 01:11:23 EDTdrydock plan repair jq codex/gpt-5.6-luna rerun 1 of 4FAIL
rc=1
303.1s—
72026-08-22 01:16:26 EDTdrydock plan verify jq rerun 2 of 14FAIL
RE-RUN
2.7s—
82026-08-22 01:16:29 EDTdrydock build status jq rerun 1 of 17OK1.0stranscript
92026-08-22 01:53:34 EDTdrydock plan verify jq rerun 3 of 14FAIL
RE-RUN
3.8s—
102026-08-22 01:53:39 EDTdrydock plan repair jq codex/gpt-5.6-luna rerun 2 of 4FAIL
rc=1
99.3s—
112026-08-22 01:55:18 EDTdrydock plan verify jq rerun 4 of 14FAIL
RE-RUN
1.3s—
122026-08-22 01:55:20 EDTdrydock build status jq rerun 2 of 17OK5.5stranscript
132026-08-22 01:57:10 EDTdrydock plan verify jq rerun 5 of 14FAIL
RE-RUN
2.2s—
142026-08-22 01:57:13 EDTdrydock plan repair jq codex/gpt-5.6-luna rerun 3 of 4FAIL
rc=1
68.4s—
152026-08-22 01:58:21 EDTdrydock plan verify jq rerun 6 of 14FAIL
RE-RUN
4.2s—
162026-08-22 01:58:26 EDTdrydock build status jq rerun 3 of 17OK0.4stranscript
172026-08-22 10:19:11 EDTdrydock plan verify jq rerun 7 of 14FAIL
RE-RUN
5.8s—
182026-08-22 10:19:18 EDTdrydock plan repair jq codex/gpt-5.6-luna rerun 4 of 4FAIL
rc=1
72.5s—
192026-08-22 10:20:31 EDTdrydock plan verify jq rerun 8 of 14FAIL
RE-RUN
1.3s—
202026-08-22 10:20:32 EDTdrydock build status jq rerun 4 of 17OK5.5stranscript
212026-08-22 11:31:44 EDTdrydock plan jq --override codex/gpt-5.6-luna rerun 2 of 4OK1206.9stranscript
222026-08-22 11:51:52 EDTdrydock plan verify jq rerun 9 of 14OK3.7s—
232026-08-22 11:51:56 EDTdrydock build status jq rerun 5 of 17OK0.5stranscript
242026-08-22 13:40:47 EDTdrydock plan verify jq rerun 10 of 14OK3.0s—
252026-08-22 13:40:50 EDTdrydock build status jq codex/gpt-5.6-luna rerun 6 of 17OK3.7stranscript
262026-08-22 13:41:13 EDTdrydock plan jq --override codex/gpt-5.6-luna rerun 3 of 4OK1505.9stranscript
272026-08-22 14:06:19 EDTdrydock plan verify jq rerun 11 of 14OK1.7s—
282026-08-22 14:06:21 EDTdrydock build status jq rerun 7 of 17OK0.5stranscript
292026-08-22 14:06:24 EDTdrydock build jq --override --repair-attempts 6 codex/gpt-5.6-luna rerun 1 of 3FAIL
RE-RUN
637.0stranscript
302026-08-22 14:17:02 EDTdrydock build status jq rerun 8 of 17OK1.1stranscript
312026-08-22 15:33:19 EDTdrydock plan jq --override codex/gpt-5.6-luna rerun 4 of 4OK818.3stranscript
322026-08-22 15:46:58 EDTdrydock plan verify jq rerun 12 of 14OK5.8s—
332026-08-22 15:47:04 EDTdrydock build status jq rerun 9 of 17OK1.1stranscript
342026-08-22 15:47:12 EDTdrydock build jq --override --repair-attempts 6 codex/gpt-5.6-luna rerun 2 of 3FAIL
RE-RUN
5392.9stranscript
352026-08-22 17:17:05 EDTdrydock build status jq rerun 10 of 17OK1.6stranscript
362026-08-22 18:03:28 EDTdrydock plan verify jq rerun 13 of 14OK1.7s—
372026-08-22 18:03:30 EDTdrydock build status jq rerun 11 of 17OK2.9stranscript
382026-08-22 18:03:35 EDTdrydock build jq --override --repair-attempts 6 codex/gpt-5.6-luna rerun 3 of 3FAIL
RE-RUN
4896.3stranscript
392026-08-22 19:25:12 EDTdrydock build status jq rerun 12 of 17OK1.0stranscript
402026-08-22 19:49:07 EDTdrydock plan verify jq rerun 14 of 14OK1.4s—
412026-08-22 19:49:09 EDTdrydock build status jq rerun 13 of 17OK3.8stranscript
422026-08-22 19:49:15 EDTdrydock build jq --override --repair-attempts 15 codex/gpt-5.6-luna rerun 1 of 2FAIL
RE-RUN
19526.0stranscript
432026-08-23 01:14:42 EDTdrydock build status jq rerun 14 of 17OK1.6stranscript
442026-08-23 07:38:03 EDTdrydock build jq --override --repair-attempts 15 codex/gpt-5.6-luna rerun 2 of 2OK2337.6stranscript
452026-08-23 08:17:04 EDTdrydock build status jq rerun 15 of 17OK1.3stranscript
462026-08-23 08:20:59 EDTdrydock score ac jqFAIL
rc=1
498.4stranscript
472026-08-23 08:29:18 EDTdrydock score build jq rerun 1 of 2FAIL
RE-RUN
1.8stranscript
482026-08-23 08:29:20 EDTdrydock score release jq codex/gpt-5.6-lunaOK223.5stranscript
492026-08-23 09:12:09 EDTdrydock build status jq rerun 16 of 17OK7.1stranscript
502026-08-23 09:34:29 EDTdrydock build status jq rerun 17 of 17OK2.2stranscript
512026-08-23 10:27:37 EDTdrydock score build jq rerun 2 of 2OK1.5stranscript

Recorded failure output

Command drydock score ac jq exited 1. The text below is quoted verbatim from its captured transcript.

Tail of logs/20260823.122059.517Z_jq_score.log.

e-foundation  ARCHITECTURE.md
               green before its block built
    PREPASSED  exec-entry-conformance  EXEC-001  FEATURE-EXEC-001.md
               green before its block built
    PREPASSED  exec-is-runnable  EXEC-001  FEATURE-EXEC-001.md
               green before its block built
    PREPASSED  compile-exit-code  EXEC-002  FEATURE-EXEC-002.md
               green before its block built
    PREPASSED  runtime-exit-code  EXEC-002  FEATURE-EXEC-002.md
               green before its block built
    PREPASSED  partial-runtime-output  EXEC-002  FEATURE-EXEC-002.md
               green before its block built
    PREPASSED  multiple-input-values  EXEC-003  FEATURE-EXEC-003.md
               green before its block built
    PREPASSED  compact-json-output  EXEC-003  FEATURE-EXEC-003.md
               green before its block built
    PREPASSED  conf-001-assets  CONF-001  FEATURE-CONF-001.md
               green before its block built
    PREPASSED  lexer-conformance  PARSE-001  FEATURE-PARSE-001.md
               green before its block built
    PREPASSED  lexer-rejects-invalid-source  PARSE-001  FEATURE-PARSE-001.md
               green before its block built
    PREPASSED  core-001-conformance  CORE-001  FEATURE-CORE-001.md
               green before its block built
    PREPASSED  core-002-conformance  CORE-002  FEATURE-CORE-002.md
               green before its block built
    PREPASSED  core-003-conformance  CORE-003  FEATURE-CORE-003.md
               green before its block built
    PREPASSED  core-004-conformance  CORE-004  FEATURE-CORE-004.md
               green before its block built
    PREPASSED  value-002-conformance  VALUE-002  FEATURE-VALUE-002.md
               green before its block built
    PREPASSED  value-003-conformance  VALUE-003  FEATURE-VALUE-003.md
               green before its block built
    PREPASSED  flow-001-conformance  FLOW-001  FEATURE-FLOW-001.md
               green before its block built
    PREPASSED  flow-003-conformance  FLOW-003  FEATURE-FLOW-003.md
               green before its block built
    PREPASSED  flow-004-conformance  FLOW-004  FEATURE-FLOW-004.md
               green before its block built
    PREPASSED  flow-006-conformance  FLOW-006  FEATURE-FLOW-006.md
               green before its block built
    PREPASSED  func-001-conformance  FUNC-001  FEATURE-FUNC-001.md
               green before its block built
    PREPASSED  func-002-conformance  FUNC-002  FEATURE-FUNC-002.md
               green before its block built
    PREPASSED  func-003-conformance  FUNC-003  FEATURE-FUNC-003.md
               green before its block built
    PREPASSED  func-004-conformance  FUNC-004  FEATURE-FUNC-004.md
               green before its block built
    PREPASSED  path-001-conformance  PATH-001  FEATURE-PATH-001.md
               green before its block built
    PREPASSED  path-002-conformance  PATH-002  FEATURE-PATH-002.md
               green before its block built
    PREPASSED  path-003-conformance  PATH-003  FEATURE-PATH-003.md
               green before its block built
    PREPASSED  path-004-conformance  PATH-004  FEATURE-PATH-004.md
               green before its block built
    PREPASSED  data-002-conformance  DATA-002  FEATURE-DATA-002.md
               green before its block built
    PREPASSED  text-002-scoped-conformance  TEXT-002  FEATURE-TEXT-002.md
               green before its block built
    PREPASSED  text-002-formats  TEXT-002  FEATURE-TEXT-002.md
               green before its block built
    PREPASSED  io-001-input-conformance  IO-001  FEATURE-IO-001.md
               green before its block built
    PREPASSED  io-001-streams  IO-001  FEATURE-IO-001.md
               green before its block built
    PREPASSED  conf-002-scoped-run  CONF-002  FEATURE-CONF-002.md
               green before its block built

Soundings: /mnt/c/Users/barlo/projects/drydock/uat/jq/runs/20260822.044627/workspace/targets/jq/SOUNDINGS.md
Target - committed project workspace git store

LLM executions

One row per model invocation, with its token accounting and the output it returned.

Calls
187
Usage
187 calls · cached 140,953,088 · uncached 13,717,106 · output 813,760
Model time
27672.3s
CommandModelResultWhenElapsedCachedUncachedOutputllm
analyzecodex/gpt-5.6-lunaOK2026-08-22 00:46:35 EDT126.7s5,88893,4656,813——
plancodex/gpt-5.6-lunaOK2026-08-22 00:48:45 EDT127.4s8,960112,7396,856——
plancodex/gpt-5.6-lunaOK2026-08-22 00:50:52 EDT75.1s8,960119,8353,948——
plancodex/gpt-5.6-lunaOK2026-08-22 00:52:08 EDT60.7s8,960119,8713,162——
plancodex/gpt-5.6-lunaOK2026-08-22 00:53:08 EDT47.8s8,960119,9112,424——
plancodex/gpt-5.6-lunaOK2026-08-22 00:53:56 EDT57.0s8,960119,9652,919——
plancodex/gpt-5.6-lunaOK2026-08-22 00:54:54 EDT57.9s8,960120,0092,978——
plancodex/gpt-5.6-lunaOK2026-08-22 00:55:52 EDT51.8s8,960120,0522,579——
plancodex/gpt-5.6-lunaOK2026-08-22 00:56:43 EDT51.9s8,960120,1002,659——
plancodex/gpt-5.6-lunaOK2026-08-22 00:57:35 EDT63.5s8,960120,1373,290——
plancodex/gpt-5.6-lunaOK2026-08-22 00:58:39 EDT49.4s8,960120,1632,523——
plancodex/gpt-5.6-lunaOK2026-08-22 00:59:41 EDT117.1s89,34434,6556,127——
plancodex/gpt-5.6-lunaOK2026-08-22 01:01:41 EDT83.2s018,7714,431——
plancodex/gpt-5.6-lunaOK2026-08-22 01:03:10 EDT91.5s8,96012,2564,915——
lineage_attributecodex/gpt-5.6-lunaOK2026-08-22 01:04:51 EDT39.8s8,9608,9362,022——
lineage_attributecodex/gpt-5.6-lunaOK2026-08-22 01:05:30 EDT67.7s8,9608,4073,557——
lineage_attributecodex/gpt-5.6-lunaOK2026-08-22 01:06:38 EDT24.6s8,9605,9931,178——
lineage_attributecodex/gpt-5.6-lunaOK2026-08-22 01:07:03 EDT21.6s8,9605,5081,017——
lineage_attributecodex/gpt-5.6-lunaOK2026-08-22 01:07:25 EDT53.3s8,96035,9412,781——
lineage_attributecodex/gpt-5.6-lunaOK2026-08-22 01:08:18 EDT39.2s8,96027,7041,933——
lineage_attributecodex/gpt-5.6-lunaOK2026-08-22 01:08:57 EDT48.7s8,9606,8592,473——
lineage_attributecodex/gpt-5.6-lunaOK2026-08-22 01:09:46 EDT57.4s8,96012,2233,003——
lineage_attributecodex/gpt-5.6-lunaOK2026-08-22 01:10:44 EDT32.8s8,9609,1471,618——
plan repaircodex/gpt-5.6-lunaOK2026-08-22 01:11:24 EDT17.3s8,9604,981781——
plan repaircodex/gpt-5.6-lunaOK2026-08-22 01:11:41 EDT15.8s8,9604,994694——
plan repaircodex/gpt-5.6-lunaOK2026-08-22 01:11:57 EDT15.9s8,9604,993696——
plan repaircodex/gpt-5.6-lunaOK2026-08-22 01:12:13 EDT15.9s8,9604,977670——
plan repaircodex/gpt-5.6-lunaOK2026-08-22 01:12:29 EDT16.1s5,8888,065688——
plan repaircodex/gpt-5.6-lunaOK2026-08-22 01:12:46 EDT14.4s8,9604,988601——
plan repaircodex/gpt-5.6-lunaOK2026-08-22 01:13:00 EDT17.1s8,9604,987695——
plan repaircodex/gpt-5.6-lunaOK2026-08-22 01:13:18 EDT8.7s8,9605,189284——
plan repaircodex/gpt-5.6-lunaOK2026-08-22 01:13:26 EDT11.3s8,9604,965436——
plan repaircodex/gpt-5.6-lunaOK2026-08-22 01:13:38 EDT17.0s013,942740——
plan repaircodex/gpt-5.6-lunaOK2026-08-22 01:13:55 EDT16.2s8,9604,981692——
plan repaircodex/gpt-5.6-lunaOK2026-08-22 01:14:11 EDT10.5s8,9604,988391——
plan repaircodex/gpt-5.6-lunaOK2026-08-22 01:14:22 EDT16.3s8,9604,975691——
plan repaircodex/gpt-5.6-lunaOK2026-08-22 01:14:39 EDT11.5s8,9604,876446——
plan repaircodex/gpt-5.6-lunaOK2026-08-22 01:14:50 EDT8.3s8,9604,966288——
plan repaircodex/gpt-5.6-lunaOK2026-08-22 01:14:59 EDT11.1s2,81611,111416——
plan repaircodex/gpt-5.6-lunaOK2026-08-22 01:15:10 EDT10.6s8,9604,956407——
plan repaircodex/gpt-5.6-lunaOK2026-08-22 01:15:21 EDT12.6s8,9604,987491——
plan repaircodex/gpt-5.6-lunaOK2026-08-22 01:15:34 EDT22.7s22,0166,581983——
plan repaircodex/gpt-5.6-lunaOK2026-08-22 01:15:56 EDT13.1s8,9604,994522——
plan repaircodex/gpt-5.6-lunaOK2026-08-22 01:16:10 EDT13.6s8,9604,971557——
plan repaircodex/gpt-5.6-lunaOK2026-08-22 01:53:40 EDT17.9s8,9606,085730——
plan repaircodex/gpt-5.6-lunaOK2026-08-22 01:53:58 EDT14.8s014,881612——
plan repaircodex/gpt-5.6-lunaOK2026-08-22 01:54:13 EDT14.5s8,9606,040624——
plan repaircodex/gpt-5.6-lunaOK2026-08-22 01:54:28 EDT16.5s8,9606,114712——
plan repaircodex/gpt-5.6-lunaOK2026-08-22 01:54:44 EDT15.7s5,8888,722694——
plan repaircodex/gpt-5.6-lunaOK2026-08-22 01:55:00 EDT16.3s8,9605,655695——
plan repaircodex/gpt-5.6-lunaOK2026-08-22 01:57:15 EDT15.8s8,9605,539665——
plan repaircodex/gpt-5.6-lunaOK2026-08-22 01:57:31 EDT15.5s5,8888,544660——
plan repaircodex/gpt-5.6-lunaOK2026-08-22 01:57:46 EDT15.7s8,9605,494625——
plan repaircodex/gpt-5.6-lunaOK2026-08-22 01:58:02 EDT16.4s8,9605,568702——
plan repaircodex/gpt-5.6-lunaOK2026-08-22 10:19:21 EDT19.6s8,9606,085671——
plan repaircodex/gpt-5.6-lunaOK2026-08-22 10:19:41 EDT15.6s8,9605,921610——
plan repaircodex/gpt-5.6-lunaOK2026-08-22 10:19:57 EDT16.1s8,9606,040634——
plan repaircodex/gpt-5.6-lunaOK2026-08-22 10:20:13 EDT16.7s8,9606,114702——
plancodex/gpt-5.6-lunaOK2026-08-22 11:31:50 EDT169.6s8,960112,9399,040——
plancodex/gpt-5.6-lunaOK2026-08-22 11:34:40 EDT78.0s8,960121,9174,033——
plancodex/gpt-5.6-lunaOK2026-08-22 11:35:58 EDT61.5s129,7921,0853,186——
plancodex/gpt-5.6-lunaOK2026-08-22 11:37:00 EDT69.5s8,960121,9173,525——
plancodex/gpt-5.6-lunaOK2026-08-22 11:38:10 EDT61.9s8,960121,9613,178——
plancodex/gpt-5.6-lunaOK2026-08-22 11:39:12 EDT69.1s8,960122,0103,558——
plancodex/gpt-5.6-lunaOK2026-08-22 11:40:21 EDT54.9s8,960122,0642,820——
plancodex/gpt-5.6-lunaOK2026-08-22 11:41:16 EDT56.6s8,960122,1122,866——
plancodex/gpt-5.6-lunaOK2026-08-22 11:42:13 EDT53.3s8,960122,1572,705——
plancodex/gpt-5.6-lunaOK2026-08-22 11:43:06 EDT47.9s8,960122,2072,417——
plancodex/gpt-5.6-lunaOK2026-08-22 11:43:54 EDT49.0s8,960122,2512,373——
plancodex/gpt-5.6-lunaOK2026-08-22 11:44:43 EDT62.7s8,960122,2863,242——
plancodex/gpt-5.6-lunaOK2026-08-22 11:45:46 EDT154.6s8,96012,0148,380——
plancodex/gpt-5.6-lunaOK2026-08-22 11:48:24 EDT59.0s018,2753,070——
plancodex/gpt-5.6-lunaOK2026-08-22 11:49:24 EDT67.8s8,9609,4103,565——
plancodex/gpt-5.6-lunaOK2026-08-22 11:50:32 EDT68.3s8,9609,4633,582——
buildcodex/gpt-5.6-lunaFAIL 1302026-08-22 13:41:01 EDT0.0s000——
plancodex/gpt-5.6-lunaOK2026-08-22 13:41:14 EDT153.1s0121,8028,251——
plancodex/gpt-5.6-lunaOK2026-08-22 13:43:47 EDT77.7s0130,3534,099——
plancodex/gpt-5.6-lunaOK2026-08-22 13:45:05 EDT61.8s8,960121,4313,171——
plancodex/gpt-5.6-lunaOK2026-08-22 13:46:07 EDT57.9s8,960121,4762,974——
plancodex/gpt-5.6-lunaOK2026-08-22 13:47:05 EDT56.0s8,960121,5262,825——
plancodex/gpt-5.6-lunaOK2026-08-22 13:48:01 EDT58.4s8,960121,5703,032——
plancodex/gpt-5.6-lunaOK2026-08-22 13:48:59 EDT42.9s129,7927782,182——
plancodex/gpt-5.6-lunaOK2026-08-22 13:49:42 EDT55.2s0130,6182,795——
plancodex/gpt-5.6-lunaOK2026-08-22 13:50:38 EDT57.2s8,960121,6942,941——
plancodex/gpt-5.6-lunaOK2026-08-22 13:51:35 EDT44.7s8,960121,7202,248——
plancodex/gpt-5.6-lunaOK2026-08-22 13:52:21 EDT52.3s8,9609,0972,672——
plancodex/gpt-5.6-lunaOK2026-08-22 13:53:15 EDT72.0s8,9609,4773,785——
plancodex/gpt-5.6-lunaOK2026-08-22 13:54:28 EDT67.2s8,9609,5563,549——
plancodex/gpt-5.6-lunaOK2026-08-22 13:55:36 EDT71.6s8,9609,6173,770——
plancodex/gpt-5.6-lunaOK2026-08-22 13:56:49 EDT56.4s8,9609,6402,914——
plancodex/gpt-5.6-lunaOK2026-08-22 13:57:47 EDT83.7s8,9609,9064,463——
plancodex/gpt-5.6-lunaOK2026-08-22 13:59:12 EDT96.6s27,13612,0615,131——
plancodex/gpt-5.6-lunaOK2026-08-22 14:00:50 EDT247.3s8,9609,9143,451——
plancodex/gpt-5.6-lunaOK2026-08-22 14:04:59 EDT66.8s8,9609,4513,483——
buildcodex/gpt-5.6-lunaOK2026-08-22 14:06:26 EDT103.6s208,89629,7604,580——
buildcodex/gpt-5.6-lunaOK2026-08-22 14:08:15 EDT195.0s541,44046,5498,042——
buildcodex/gpt-5.6-lunaOK2026-08-22 14:11:34 EDT165.3s1,106,17673,6576,653——
buildcodex/gpt-5.6-lunaOK2026-08-22 14:14:25 EDT61.0s480,76891,9272,534——
buildcodex/gpt-5.6-lunaOK2026-08-22 14:15:29 EDT42.3s286,72087,3141,853——
buildcodex/gpt-5.6-lunaOK2026-08-22 14:16:13 EDT44.6s380,67288,3801,982——
plancodex/gpt-5.6-lunaOK2026-08-22 15:33:26 EDT145.1s8,960113,2627,748——
plancodex/gpt-5.6-lunaOK2026-08-22 15:35:51 EDT70.7s8,960120,9783,664——
plancodex/gpt-5.6-lunaOK2026-08-22 15:37:02 EDT49.1s8,960121,0162,478——
plancodex/gpt-5.6-lunaOK2026-08-22 15:37:51 EDT69.2s8,960121,0533,575——
plancodex/gpt-5.6-lunaOK2026-08-22 15:39:01 EDT45.8s8,960121,0532,320——
plancodex/gpt-5.6-lunaOK2026-08-22 15:39:47 EDT46.7s0130,0532,331——
plancodex/gpt-5.6-lunaOK2026-08-22 15:40:33 EDT51.6s8,960121,1332,550——
plancodex/gpt-5.6-lunaOK2026-08-22 15:41:25 EDT50.2s8,960121,1732,542——
plancodex/gpt-5.6-lunaOK2026-08-22 15:42:15 EDT51.8s8,960121,2132,624——
plancodex/gpt-5.6-lunaOK2026-08-22 15:43:07 EDT63.0s8,960121,2533,296——
plancodex/gpt-5.6-lunaOK2026-08-22 15:44:10 EDT33.0s8,960121,2811,609——
plancodex/gpt-5.6-lunaOK2026-08-22 15:44:47 EDT55.0s8,9608,6382,622——
plancodex/gpt-5.6-lunaOK2026-08-22 15:45:45 EDT50.5s8,9608,6622,540——
buildcodex/gpt-5.6-lunaOK2026-08-22 15:47:17 EDT107.9s257,79233,9184,301——
buildcodex/gpt-5.6-lunaOK2026-08-22 15:49:09 EDT56.4s192,76830,4102,010——
buildcodex/gpt-5.6-lunaOK2026-08-22 15:50:11 EDT63.0s195,84033,8122,449——
buildcodex/gpt-5.6-lunaOK2026-08-22 15:51:22 EDT108.4s478,72054,2843,932——
buildcodex/gpt-5.6-lunaOK2026-08-22 15:53:19 EDT64.5s481,79290,6172,045——
buildcodex/gpt-5.6-lunaOK2026-08-22 15:54:37 EDT219.5s847,10467,9609,622——
buildcodex/gpt-5.6-lunaOK2026-08-22 15:58:33 EDT230.3s1,679,616103,7588,656——
buildcodex/gpt-5.6-lunaOK2026-08-22 16:06:21 EDT347.3s1,552,38482,13912,314——
buildcodex/gpt-5.6-lunaOK2026-08-22 16:15:48 EDT421.9s2,790,91296,15413,049——
buildcodex/gpt-5.6-lunaOK2026-08-22 16:25:56 EDT365.3s2,192,64048,7418,791——
buildcodex/gpt-5.6-lunaOK2026-08-22 16:35:59 EDT261.4s1,137,664102,4544,295——
buildcodex/gpt-5.6-lunaOK2026-08-22 16:42:17 EDT590.5s2,521,85697,8169,089——
buildcodex/gpt-5.6-lunaOK2026-08-22 16:53:52 EDT605.0s2,768,38499,78310,233——
buildcodex/gpt-5.6-lunaOK2026-08-22 17:05:33 EDT571.1s2,677,248104,4849,165——
buildcodex/gpt-5.6-lunaOK2026-08-22 18:07:46 EDT660.4s2,514,432103,64011,567——
buildcodex/gpt-5.6-lunaOK2026-08-22 18:21:40 EDT468.6s2,311,16898,31210,515——
buildcodex/gpt-5.6-lunaOK2026-08-22 18:31:47 EDT554.5s3,628,800106,60813,097——
buildcodex/gpt-5.6-lunaOK2026-08-22 18:43:30 EDT515.2s2,902,016112,87012,273——
buildcodex/gpt-5.6-lunaOK2026-08-22 18:54:04 EDT480.3s1,847,04091,6807,053——
buildcodex/gpt-5.6-lunaOK2026-08-22 19:03:53 EDT397.6s2,416,896102,8488,752——
buildcodex/gpt-5.6-lunaOK2026-08-22 19:12:36 EDT632.7s4,005,632120,81411,244——
buildcodex/gpt-5.6-lunaOK2026-08-22 19:53:39 EDT364.2s2,444,800116,2547,301——
buildcodex/gpt-5.6-lunaOK2026-08-22 20:01:43 EDT535.3s3,606,016116,95013,016——
buildcodex/gpt-5.6-lunaOK2026-08-22 20:12:32 EDT488.3s3,214,848110,13711,525——
buildcodex/gpt-5.6-lunaOK2026-08-22 20:22:04 EDT429.5s2,575,104106,1668,925——
buildcodex/gpt-5.6-lunaOK2026-08-22 20:30:38 EDT515.3s2,815,232108,4269,952——
buildcodex/gpt-5.6-lunaOK2026-08-22 20:40:37 EDT528.0s3,198,976111,84712,513——
buildcodex/gpt-5.6-lunaOK2026-08-22 20:50:49 EDT364.6s2,194,176102,8918,106——
buildcodex/gpt-5.6-lunaOK2026-08-22 20:59:03 EDT470.3s2,635,264105,2377,707——
buildcodex/gpt-5.6-lunaOK2026-08-22 21:08:41 EDT464.5s3,498,496117,88011,123——
buildcodex/gpt-5.6-lunaOK2026-08-22 21:18:08 EDT598.4s2,788,352103,7528,751——
buildcodex/gpt-5.6-lunaOK2026-08-22 21:30:10 EDT575.8s3,023,360110,10512,423——
buildcodex/gpt-5.6-lunaOK2026-08-22 21:41:28 EDT828.9s6,091,008152,84215,670——
buildcodex/gpt-5.6-lunaOK2026-08-22 21:56:53 EDT396.4s2,548,992108,1189,415——
buildcodex/gpt-5.6-lunaOK2026-08-22 22:05:04 EDT604.8s3,614,208112,08211,460——
buildcodex/gpt-5.6-lunaOK2026-08-22 22:16:51 EDT148.8s1,286,400104,7184,454——
buildcodex/gpt-5.6-lunaOK2026-08-22 22:20:52 EDT173.7s1,065,728109,1124,301——
buildcodex/gpt-5.6-lunaOK2026-08-22 22:25:10 EDT122.0s722,688107,6283,142——
buildcodex/gpt-5.6-lunaOK2026-08-22 22:28:43 EDT136.1s1,250,816112,7865,516——
buildcodex/gpt-5.6-lunaOK2026-08-22 22:32:37 EDT108.2s1,202,688109,1683,685——
buildcodex/gpt-5.6-lunaOK2026-08-22 22:36:29 EDT124.4s919,808111,3493,777——
buildcodex/gpt-5.6-lunaOK2026-08-22 22:40:36 EDT153.0s1,056,512101,5234,412——
buildcodex/gpt-5.6-lunaOK2026-08-22 22:45:38 EDT200.6s2,139,904129,7507,279——
buildcodex/gpt-5.6-lunaOK2026-08-22 22:51:44 EDT162.0s1,382,656114,3674,746——
buildcodex/gpt-5.6-lunaOK2026-08-22 22:57:26 EDT124.6s1,263,104118,3043,695——
buildcodex/gpt-5.6-lunaOK2026-08-22 23:02:33 EDT168.4s1,026,816211,3254,419——
buildcodex/gpt-5.6-lunaOK2026-08-22 23:08:40 EDT99.4s974,080100,7133,412——
buildcodex/gpt-5.6-lunaOK2026-08-22 23:14:07 EDT150.8s1,818,112133,1384,814——
buildcodex/gpt-5.6-lunaOK2026-08-22 23:20:28 EDT145.6s1,470,720124,5145,632——
buildcodex/gpt-5.6-lunaOK2026-08-22 23:26:16 EDT201.8s2,021,632134,6216,930——
buildcodex/gpt-5.6-lunaOK2026-08-22 23:33:02 EDT174.3s2,128,640135,7776,102——
buildcodex/gpt-5.6-lunaOK2026-08-22 23:39:26 EDT142.4s1,286,912133,4384,382——
buildcodex/gpt-5.6-lunaOK2026-08-22 23:45:34 EDT99.3s649,216105,9833,092——
buildcodex/gpt-5.6-lunaOK2026-08-22 23:51:01 EDT113.7s1,005,56896,0413,471——
buildcodex/gpt-5.6-lunaOK2026-08-22 23:56:49 EDT192.2s1,357,056116,2817,684——
buildcodex/gpt-5.6-lunaOK2026-08-23 00:03:44 EDT217.6s2,174,464115,3657,073——
buildcodex/gpt-5.6-lunaOK2026-08-23 00:11:12 EDT142.2s1,485,824114,0075,144——
buildcodex/gpt-5.6-lunaOK2026-08-23 00:17:50 EDT172.3s2,137,344121,5245,399——
buildcodex/gpt-5.6-lunaOK2026-08-23 00:24:55 EDT173.3s1,301,760113,7975,321——
buildcodex/gpt-5.6-lunaOK2026-08-23 00:31:47 EDT128.5s1,050,368100,8524,729——
buildcodex/gpt-5.6-lunaOK2026-08-23 00:38:10 EDT168.9s1,814,016130,6835,911——
buildcodex/gpt-5.6-lunaOK2026-08-23 00:45:17 EDT120.6s1,138,432112,2524,162——
buildcodex/gpt-5.6-lunaOK2026-08-23 00:51:49 EDT133.1s1,293,824117,9894,989——
buildcodex/gpt-5.6-lunaOK2026-08-23 00:58:29 EDT232.0s1,439,744110,7468,019——
buildcodex/gpt-5.6-lunaOK2026-08-23 01:06:43 EDT325.8s3,232,000137,12212,480——
buildcodex/gpt-5.6-lunaOK2026-08-23 01:12:11 EDT69.1s509,18490,4072,103——
buildcodex/gpt-5.6-lunaOK2026-08-23 01:13:22 EDT73.9s525,56889,9991,706——
buildcodex/gpt-5.6-lunaOK2026-08-23 07:38:22 EDT334.7s1,896,70498,6788,283——
buildcodex/gpt-5.6-lunaOK2026-08-23 07:44:05 EDT295.4s2,192,640117,62911,136——
buildcodex/gpt-5.6-lunaOK2026-08-23 07:49:10 EDT204.1s1,492,736103,9095,849——
buildcodex/gpt-5.6-lunaOK2026-08-23 07:52:46 EDT219.7s1,453,056110,5546,932——
buildcodex/gpt-5.6-lunaOK2026-08-23 07:56:39 EDT64.1s172,28824,9751,747——
buildcodex/gpt-5.6-lunaOK2026-08-23 08:00:26 EDT736.9s1,737,98477,0703,779——
score releasecodex/gpt-5.6-lunaOK2026-08-23 08:32:50 EDT7.9s8,9605,197184——
Receipt1 of 5 claims proven
ClaimVerdictRecorded outcomeProof
Acceptance criteria verifiedFAIL18 of 57 criteria passed; 3 failed, verified 2026-08-23T12:21:00+00:00.workspace/SOUNDINGS.md
Build blocks verifiedFAIL43 blocks recorded; 2 needed repair; unverified: block-37.workspace/evidence
Acceptance score passedFAILdrydock score ac exited 1.logs/20260823.142737.053Z_jq_score.log
Release score passedPASSdrydock score release exited 0.logs/20260823.142737.053Z_jq_score.log
Every recorded command exited cleanFAIL51 commands recorded; 5 exited nonzero with no later clean rerun, the last at 46-score.result.json

Output

The Target Drydock drove. 138 files, 1,049,385 bytes.

PathBytes
workspace/1,049,385
QuarterDeck/30,829
commanders_chair.html24,733
console.yaml5,909
planning-session.md187
blueprint/590,234
sources/255,348
INSTRUCTIONS.md14,992
builtin.jq9,631
exclusions.txt2,613
full_test.sh755
jq-manual.txt130,783
jq.test52,230
lexer.l4,548
parser.y22,382
run_conformance.py17,414
ARCHITECTURE.md4,311
ARCHITECTURE_compact.md616
FEATURE-CONF-001.md1,354
FEATURE-CONF-002.md1,259
FEATURE-CONF-003.md1,219
FEATURE-CORE-001.md1,523
FEATURE-CORE-002.md1,646
FEATURE-CORE-003.md1,274
FEATURE-CORE-004.md1,166
FEATURE-DATA-001.md1,744
FEATURE-DATA-002.md1,695
FEATURE-DATA-003.md1,786
FEATURE-DATA-004.md1,774
FEATURE-EXEC-001.md1,932
FEATURE-EXEC-002.md1,974
FEATURE-EXEC-003.md2,145
FEATURE-Executable-Entry-Point.md2,460
FEATURE-FLOW-001.md1,712
FEATURE-FLOW-002.md1,688
FEATURE-FLOW-003.md1,723
FEATURE-FLOW-004.md1,568
FEATURE-FLOW-005.md2,011
FEATURE-FLOW-006.md1,924
FEATURE-FUNC-001.md1,885
FEATURE-FUNC-002.md1,903
FEATURE-FUNC-003.md1,943
FEATURE-FUNC-004.md1,925
FEATURE-IO-001.md2,375
FEATURE-IO-002.md2,433
FEATURE-IO-003.md1,500
FEATURE-Json-IO.md2,819
FEATURE-PARSE-001.md2,460
FEATURE-PARSE-002.md1,761
FEATURE-PARSE-003.md1,793
FEATURE-PARSE-004.md1,934
FEATURE-PATH-001.md1,856
FEATURE-PATH-002.md1,932
FEATURE-PATH-003.md2,011
FEATURE-PATH-004.md2,066
FEATURE-Process-Contract.md3,074
FEATURE-TEXT-001.md1,893
FEATURE-TEXT-002.md2,593
FEATURE-TEXT-003.md2,486
FEATURE-TEXT-004.md2,481
FEATURE-VALUE-001.md1,401
FEATURE-VALUE-002.md1,385
FEATURE-VALUE-003.md1,399
FEATURE-VALUE-004.md1,804
builtin.jq9,631
builtin_compact.md317
exclusions.txt2,613
exclusions_compact.md316
full_test.sh755
full_test_compact.md327
jq-manual.txt130,783
jq-manual_compact.md312
jq.test52,230
jq_compact.md555
lexer.l4,548
lexer_compact.md293
parser.y22,382
parser_compact.md369
run_conformance.py17,414
run_conformance_compact.md425
evidence/240,570
block-1.md2,107
block-10.md1,883
block-11.md1,625
block-12.md1,525
block-13.md2,781
block-14.md4,042
block-15.md5,023
block-16.md4,318
block-17.md2,421
block-18.md8,678
block-19.md2,437
block-2.md2,473
block-20.md2,173
block-21.md3,340
block-22.md2,476
block-23.md4,007
block-24.md2,404
block-25.md3,997
block-26.md2,321
block-27.md2,379
block-28.md2,380
block-29.md2,352
block-3.md2,432
block-30.md2,215
block-31.md5,465
block-32.md2,238
block-33.md3,600
block-34.md3,934
block-35.md4,360
block-36.md3,415
block-37.md4,934
block-38.md5,618
block-39.md3,504
block-4.md2,914
block-40.md5,168
block-41.md3,451
block-42.md1,421
block-43.md2,593
block-5.md3,345
block-6.md3,539
block-7.md5,430
block-8.md93,455
block-9.md1,733
prepassed-acceptance.json1,213
score-release.json7,451
ACCEPTANCE.json57
ANALYSIS.md22,436
ANALYZE_COMPASS.md18
COMPASS.md13,680
DECISIONS.json523
EXCLUDE_FILES.md162
LINEAGE.json62,157
MANIFEST.md58,412
METADATA.md545
PLAN_COMPASS.md15
PROJECT_STATUS.jsonl1,415
README.md34
SCORECARD.md1,369
SEA_TRIALS.md522
SOUNDINGS.md15,272
STORY_GUIDANCE.json10,338
TECHNOLOGY_STACK.md797

MANIFEST.md

Every block the plan carries, grouped by feature, with the state this run left it in. Source: workspace/MANIFEST.md.

44
Blocks
0
Verified
44
Built
0
Failed
Blocks
43 recorded
Unverified blocks
1
Repaired blocks
2
Build Block 1 · Foundational
Define the standalone jq interpreter architecture and module boundaries. built
Build Block 2 · Foundational
Implement the executable jq entry point. built
Build Block 3 · Service
Implement jq process exit and diagnostic behavior. built
Build Block 4 · Service
Implement JSON input and compact output handling. built
Build Block 5 · Foundational
Stage and validate immutable conformance assets. built
Build Block 6 · Service
Implement jq lexical scanning. built
Build Block 7 · Service
Implement literals, strings, escapes, and interpolation. built
Build Block 8 · Service
Implement jq filter expression grammar. built
Implement declarations and control syntax parsing. built
Build Block 9 · Service
Implement the stream-valued filter evaluator. built
Build Block 10 · Service
Implement composition and Cartesian generator evaluation. built
Build Block 11 · Service
Implement empty, runtime errors, optional evaluation, and try. built
Build Block 12 · Service
Implement jq truthiness, equality, and ordering. built
Build Block 13 · Service
Implement the jq value and numeric model. built
Build Block 14 · Service
Implement field and index access. built
Build Block 15 · Service
Implement slices and collection iteration. built
Build Block 16 · Service
Implement type, length, numeric predicates, conversions, and math. built
Build Block 17 · Service
Implement arithmetic and structural operators. built
Build Block 18 · Service
Implement boolean and alternative operators. built
Build Block 19 · Service
Implement conditionals and exception flow. built
Build Block 20 · Service
Implement lexical labels and breaks. built
Build Block 21 · Service
Implement reductions and iteration controls. built
Build Block 22 · Service
Implement recursive generator primitives. built
Build Block 23 · Service
Implement lexical variable bindings. built
Build Block 24 · Service
Implement filter and value function parameters. built
Build Block 25 · Service
Implement function definitions, scope, and recursion. built
Build Block 26 · Service
Implement destructuring patterns and alternatives. built
Build Block 27 · Service
Implement path discovery and projection. built
Build Block 28 · Service
Implement path access and mutation primitives. built
Build Block 29 · Service
Implement deletion and assignment operators. built
Build Block 30 · Service
Implement complex assignment edge cases. built
Build Block 31 · Service
Implement collection transformation builtins. built
Build Block 32 · Service
Implement sorting and grouping builtins. built
Build Block 33 · Service
Implement object-entry and containment builtins. built
Build Block 34 · Service
Implement index and membership utilities. built
Build Block 35 · Service
Implement string manipulation builtins. built
Build Block 36 · Service
Implement JSON and output format filters. built
Build Block 37 · Service
Implement regular-expression filters. built
Build Block 38 · Service
Implement date and time filters. built
Build Block 39 · Service
Implement input stream controls. built
Build Block 40 · Service
Implement diagnostics and stderr output. built
Build Block 41 · Service
Implement streaming transformations. built
Build Block 42 · Service
Provide scoped conformance verification. built
Build Block 43 · Service
Run the complete jq conformance corpus. built

SCORECARD.md

The completion gate and every project acceptance criterion, as this run last scored them. Source: workspace/SCORECARD.md.

Criteria
57
Criteria passed
18
Criteria failed
3
PASSED
st-001 — The completed interpreter shall make sh sources/full_test.sh exit zero; that script's exit status is the sole acceptance verdict. ✓ MET

ANALYSIS.md

What the analysis pass read the Blueprint to ask for. Source: workspace/ANALYSIS.md.

Story Shape
Executable Interface3
Lexer and Parser4
Generator Evaluation Core4
Values and Accessors4
Operators and Control Flow6
Variables and Functions4
Paths and Assignment4
Collections and Data Transformation4
Strings, Formats, and Regular Expressions4
I/O and Streaming3
Conformance Delivery3

Blueprint Analysis: drydock jq Uat Kit

Commander Expectations

  • assert the supplied jq conformance corpus passes completely through an executable ./jq filter.
  • assert the implementation uses only Python standard-library facilities and does not wrap or depend on another jq implementation.
  • assert the supplied stdin/stdout interface and documented exit codes are honored.

Crew

CrewCharge
CommanderDefines intent and decides what done means.
Team LeadConfirms epic completeness and stakeholder expectations.
Planning CrewAuthors atomic specifications and the ordered Manifest.
Shipyard CrewBuilds the tickets without synchronous Commander access.

Story List

Feature: Executable Interface

IDStoryHigh-level AC
EXEC-001Implement executable jq entry point./jq -c '<program>' reads JSON stdin and emits compact JSON values line by line.
EXEC-002Implement process exit and diagnostic contractCompile failures exit 3, runtime failures exit 5, successful completion exits 0, and diagnostics use stderr.
EXEC-003Implement JSON input and output handlingMultiple input values, Unicode, special numeric values, and compact serialization are handled as required by the corpus.

Feature: Lexer and Parser

IDStoryHigh-level AC
PARSE-001Implement jq lexical scanningKeywords, identifiers, fields, bindings, literals, operators, comments, formats, and delimiters tokenize according to the supplied lexer specification.
PARSE-002Implement literals and string interpolationJSON escapes, Unicode, formatted strings, and \(expression) interpolation parse and evaluate correctly.
PARSE-003Implement filter expression grammarPipes, commas, precedence, indexing, slicing, arrays, objects, unary operators, and optional expressions compile correctly.
PARSE-004Implement declarations and control syntaxdef, imports/module grammar, conditionals, try/catch, reductions, foreach, labels, bindings, and destructuring syntax compile correctly, including required rejection cases.

Feature: Generator Evaluation Core

IDStoryHigh-level AC
CORE-001Implement stream-valued filter evaluationEvery filter evaluates as a generator with zero, one, or many outputs, preserving order and backtracking.
CORE-002Implement composition and cartesian evaluationPipes, commas, function arguments, array collection, object construction, and binary operators evaluate all required output combinations.
CORE-003Implement empty, errors, and optional evaluationempty, runtime errors, ?, try, and partial output before runtime failure follow jq semantics.
CORE-004Implement truthiness and comparison semanticsOnly false and null are falsey; equality and ordering follow jq's type ordering and numeric equivalence.

Feature: Values and Accessors

IDStoryHigh-level AC
VALUE-001Implement JSON value modelNull, booleans, numbers, strings, arrays, objects, NaN, and infinities are represented and processed as jq values.
VALUE-002Implement field and index accessObject fields, array indices, object values, optional access, negative indices, and missing values behave as specified.
VALUE-003Implement slices and iterationArray/string slices, iteration over arrays and objects, optional iteration, fractional bounds, and out-of-range behavior conform.
VALUE-004Implement type and numeric primitivestype, length, utf8bytelength, numeric predicates, conversion functions, arithmetic primitives, and math functions conform.

Feature: Operators and Control Flow

IDStoryHigh-level AC
FLOW-001Implement arithmetic and structural operators+, -, *, /, %, unary negation, recursive object merge, string repetition, and string splitting conform.
FLOW-002Implement boolean and alternative operatorsand, or, not, //, and //= preserve generator and short-circuit semantics.
FLOW-003Implement conditionals and exception flowif, elif, else, try, catch, and optional operators preserve branch streams and errors.
FLOW-004Implement labels and breaksLexically scoped label and break terminate the correct generator without leaking outputs.
FLOW-005Implement reductions and iteration controlreduce, foreach, range, limit, skip, first, last, and nth preserve state and backtracking.
FLOW-006Implement recursive generatorswhile, until, repeat, recurse, and recursive user functions operate correctly without incorrect termination.

Feature: Variables and Functions

IDStoryHigh-level AC
FUNC-001Implement lexical variable bindingsas bindings, nested scope, shadowing, keyword identifiers, and value lifetime conform.
FUNC-002Implement filter and value function parametersUser-defined functions support filter parameters, value parameters, multiple arities, closures, and cartesian arguments.
FUNC-003Implement function definitions and recursionDefinitions, redefinitions, lexical function scope, recursion, and forward/self references conform.
FUNC-004Implement destructuring patterns and alternativesArray/object patterns, missing bindings, ?//, and fallback binding behavior conform.

Feature: Paths and Assignment

IDStoryHigh-level AC
PATH-001Implement path discovery and projectionpath, paths, pick, and path expressions produce valid paths and projections.
PATH-002Implement path access and mutation primitivesgetpath, setpath, and delpaths create, update, read, and delete nested structures correctly.
PATH-003Implement deletion and assignment operatorsdel, =, `=`, arithmetic assignments, defined-or assignment, and multi-path behavior conform.
PATH-004Implement complex assignment edge casesIterated paths, empty updates, array expansion, invalid paths, negative indices, NaN indices, and depth limits conform.

Feature: Collections and Data Transformation

IDStoryHigh-level AC
DATA-001Implement collection transformation builtinsmap, map_values, select, add, flatten, transpose, combinations, and walk conform.
DATA-002Implement sorting and grouping builtinssort, sort_by, group_by, unique, unique_by, min, max, and keyed variants conform.
DATA-003Implement object-entry and containment builtinskeys, keys_unsorted, has, in, inside, contains, to_entries, from_entries, and with_entries conform.
DATA-004Implement index and membership utilitiesindices, index, rindex, bsearch, all, any, isempty, and SQL-style IN conform.

Feature: Strings, Formats, and Regular Expressions

IDStoryHigh-level AC
TEXT-001Implement string manipulation builtinsTrimming, prefix/suffix operations, case conversion, explode/implode, split, join, and interpolation conform.
TEXT-002Implement JSON and output format filterstostring, tojson, fromjson, @text, @json, @html, @uri, @urid, @csv, @tsv, @sh, @base64, and @base64d conform.
TEXT-003Implement regular-expression filterstest, match, capture, scan, split, splits, sub, and gsub support required flags, captures, offsets, and streams.
TEXT-004Implement date and time filtersISO dates, strptime, strftime, gmtime, localtime, and mktime conform for supplied cases.

Feature: I/O and Streaming

IDStoryHigh-level AC
IO-001Implement input stream controlsinput, inputs, input_filename, and input_line_number conform within the fixed interface.
IO-002Implement diagnostics and stderr outputdebug, stderr, and halt_error produce the specified output channels and exit behavior.
IO-003Implement streaming transformationstostream, fromstream, and truncate_stream conform for supplied streaming values.

Feature: Conformance Delivery

IDStoryHigh-level AC
CONF-001Stage immutable conformance assetsThe supplied manual, corpus, parser/lexer references, builtin reference, exclusions, runner, and full-test script are available at their required build paths without modification.
CONF-002Run scoped implementation verificationEach implementation slice can be exercised through run_conformance.py --select with JQ set to the candidate executable.
CONF-003Pass the complete conformance corpusOne terminal verification runs sh sources/full_test.sh unfiltered and exits zero with no failed or errored cases.

Story Guidance

Named stories planning must produce. Authoritative record: STORY_GUIDANCE.json.

Story IDProvenanceGateNote
EXEC-001plan`python3 sources/run_conformance.py --select ^(truefalsenull1)$`Build Instructions: interface contract
PARSE-001plan`python3 sources/run_conformance.py --select ^(truefalsenull1\.)$`lexer.l
PARSE-002plan`python3 sources/run_conformance.py --select interpolation@base64@uri`lexer.l and jq.test string/format cases
PARSE-003plan`python3 sources/run_conformance.py --select \.\[\{\+\-\*/%`parser.y expression grammar
PARSE-004plan`python3 sources/run_conformance.py --select %%FAILiftryreduceforeachdefaslabelmoduleinclude`parser.y declarations and control grammar
CORE-001plan`python3 sources/run_conformance.py --select \.,\[\.\]rangeempty`Build Instructions: generator core
CORE-002plan`python3 sources/run_conformance.py --select \,\[\{`jq-manual.txt generator semantics
CORE-003plan`python3 sources/run_conformance.py --select tryerror\?`jq-manual.txt error and optional semantics
CORE-004plan`python3 sources/run_conformance.py --select ==!=<=>=<>`jq-manual.txt comparison and truthiness
VALUE-001plan`python3 sources/run_conformance.py --select naninfinitetojsonfromjson`jq-manual.txt types and numeric values
VALUE-002plan`python3 sources/run_conformance.py --select \.[A-Za-z]\[[-0-9]`jq-manual.txt accessors
VALUE-003plan`python3 sources/run_conformance.py --select \[.*:\.\[\]`jq-manual.txt slices and iteration
VALUE-004plan`python3 sources/run_conformance.py --select lengthtypesqrtfloortonumber`jq-manual.txt types and numeric builtins
FLOW-001plan`python3 sources/run_conformance.py --select \+\-\*/%`jq-manual.txt builtin operators
FLOW-002plan`python3 sources/run_conformance.py --select andornot//`jq-manual.txt conditionals and comparisons
FLOW-003plan`python3 sources/run_conformance.py --select iftry\?`jq-manual.txt conditionals and try-catch
FLOW-004plan`python3 sources/run_conformance.py --select labelbreak`jq-manual.txt breaking out of control structures
FLOW-005plan`python3 sources/run_conformance.py --select reduceforeachlimitskipnthfirstlast`jq-manual.txt advanced generators
FLOW-006plan`python3 sources/run_conformance.py --select whileuntilrecurserepeat`jq-manual.txt recursive generators
FUNC-001plan`python3 sources/run_conformance.py --select as \$\$[A-Za-z]`jq-manual.txt variable binding
FUNC-002planpython3 sources/run_conformance.py --select def .*\(jq-manual.txt defining functions
FUNC-003planpython3 sources/run_conformance.py --select defjq-manual.txt function scoping and recursion
FUNC-004plan`python3 sources/run_conformance.py --select \?//as \{`jq-manual.txt destructuring alternatives
PATH-001plan`python3 sources/run_conformance.py --select path\(pathspick\(`jq-manual.txt paths
PATH-002plan`python3 sources/run_conformance.py --select getpathsetpathdelpaths`jq-manual.txt path primitives
PATH-003plan`python3 sources/run_conformance.py --select =\=\+=`jq-manual.txt assignment
PATH-004plan`python3 sources/run_conformance.py --select negativeNaNdepthempty`jq.test assignment edge cases
DATA-001plan`python3 sources/run_conformance.py --select mapflattentransposecombinationswalk`builtin.jq collection utilities
DATA-002plan`python3 sources/run_conformance.py --select sortgroup_byuniqueminmax`jq-manual.txt collection ordering
DATA-003plan`python3 sources/run_conformance.py --select keyshas\(containsinsideto_entriesfrom_entries`jq-manual.txt object and containment builtins
DATA-004plan`python3 sources/run_conformance.py --select indicesindex\(rindexbsearchanyallIN\(`builtin.jq generic iterator and membership utilities
TEXT-001plan`python3 sources/run_conformance.py --select splitjointrimascii_explodeimplodestartswithendswith`jq-manual.txt string builtins
TEXT-002plan`python3 sources/run_conformance.py --select @text@json@html@uri@csv@tsv@sh@base64`jq-manual.txt format strings and escaping
TEXT-003plan`python3 sources/run_conformance.py --select test\(match\(capture\(scan\(sub\(gsub\(`jq-manual.txt regular expressions
TEXT-004plan`python3 sources/run_conformance.py --select datestrftimestrptimegmtimemktime`jq-manual.txt dates
IO-001plan`python3 sources/run_conformance.py --select inputinputs`jq-manual.txt I/O
IO-002plan`python3 sources/run_conformance.py --select debugstderrhalt_error`jq-manual.txt diagnostics
IO-003plan`python3 sources/run_conformance.py --select tostreamfromstreamtruncate_stream`jq-manual.txt streaming
CONF-001planpython3 sources/run_conformance.py --listBuild Instructions: source roles and staged assets
CONF-002planpython3 sources/run_conformance.py --select reduceBuild Instructions: scoped verification
CONF-003plansh sources/full_test.shSea Trials and definition of done

Surfaced Acceptance Criteria

IDStory IDCriterion
AC-001EXEC-001The executable is named jq, is executable at the application root, and accepts only the exercised -c interface.
AC-002EXEC-003Output comparison preserves value order and emits one JSON value per output line.
AC-003PARSE-004Module syntax is parsed sufficiently to reject invalid module grammar without loading excluded module fixtures.
AC-004CONF-001Read-only scoring assets remain byte-for-byte unchanged and all staged runtime dependencies are present.
AC-005CONF-002Scoped checks use a selector matching the story's construct and never use the unscoped full corpus before the terminal story.

Source Inventory

PathContent kindDispositionReason
sources/INSTRUCTIONS.mdmarkdownanalyzedreadable UTF-8
sources/builtin.jqtextanalyzedreadable UTF-8
sources/exclusions.txttextanalyzedreadable UTF-8
sources/full_test.shcodeanalyzedreadable UTF-8
sources/jq-manual.txttextchunkedsplit into 11 bounded chunks
sources/jq.testtextchunkedsplit into 5 bounded chunks
sources/lexer.ltextanalyzedreadable UTF-8
sources/parser.ytextanalyzedreadable UTF-8
sources/run_conformance.pycodeanalyzedreadable UTF-8

Relationship Model

Source or groupRelationship typeRelated source or groupEvidenceDelivery implication
sources/lexer.lparser-to-normalizersources/parser.yLexer tokens and parser productions define the language front end.Build lexer behavior before parser execution.
sources/parser.yinstruction-to-testsources/jq.testGrammar and precedence are exercised by syntax and %%FAIL cases.Parser stories require focused corpus slices.
sources/jq-manual.txtreference-to-replacementimplementation storiesManual defines filter semantics and builtin behavior.Use as normative behavior reference.
sources/builtin.jqreference-to-replacementDATA, TEXT, FLOW, PATH, IO storiesReference definitions specify many builtin compositions.Implement the generator core before these builtins.
sources/jq.testtest-kit-to-implementationjqCorpus supplies program, input, and expected output cases.Stage unchanged and execute through the harness.
sources/run_conformance.pytest-kit-to-implementationjqRunner invokes JQ -c program and checks exit/output semantics.Preserve the executable interface and scoped verification.
sources/full_test.shtest-kit-to-implementationsources/run_conformance.pyFull script checks executable presence and delegates the complete run.Reserve for the terminal acceptance story and Sea Trial.
sources/exclusions.txttest-kit-to-implementationsources/jq.testExclusions identify module-loader cases by exact program text.Apply skips through the supplied harness only.
sources/INSTRUCTIONS.mdinstruction-to-testall implementation and conformance storiesBuild order, prohibitions, interface, and definition of done are explicit.Treat as author intent and project guardrails.

Source Roles

PathRolePlan dispositionBuild disposition
sources/INSTRUCTIONS.mdauthor intentcompassprompt-only
sources/jq-manual.txtnormative specificationcontextstage
sources/jq.testnormative specification and conformance test suitecontextstage
sources/parser.ynormative specificationcontextstage
sources/lexer.lnormative specificationcontextstage
sources/builtin.jqreference implementationcontextstage
sources/run_conformance.pyconformance harnesscontextstage
sources/full_test.shconformance harnesscontextstage
sources/exclusions.txtconformance harnesscontextstage

Planning Instructions

Delivery Shape

Deliver a standalone executable Python jq interpreter. It parses a jq filter, evaluates it over JSON input as an ordered stream of values, and writes compact JSON outputs. The execution flow is lexer/parser, AST or equivalent intermediate representation, generator evaluator, builtin/function runtime, and CLI serialization. The staged conformance runner drives one process per corpus case; excluded module-loader cases are skipped by the supplied exclusion list.

Story Realization Map

Story IDsDurable Blueprint scopeEvidenceRelated filesDelivery kind
EXEC-001–003executable CLI and JSON process boundarysources/INSTRUCTIONS.md, sources/run_conformance.pyjqcapability and acceptance contract
PARSE-001–004lexer, parser, syntax diagnosticssources/lexer.l, sources/parser.y, sources/jq.testjqcapability
CORE-001–004stream evaluator and runtime errorssources/INSTRUCTIONS.md, sources/jq-manual.txtjqcapability
VALUE-001–004value model, accessors, numeric behaviorsources/jq-manual.txt, sources/jq.testjqcapability
FLOW-001–006operators and control constructssources/builtin.jq, sources/parser.y, sources/jq.testjqcapability
FUNC-001–004bindings, functions, patternssources/parser.y, sources/jq.testjqcapability
PATH-001–004paths and immutable updatessources/jq-manual.txt, sources/jq.testjqcapability
DATA-001–004collection and relational builtinssources/builtin.jq, sources/jq-manual.txtjqcapability
TEXT-001–004strings, formats, regex, datessources/builtin.jq, sources/jq-manual.txtjqcapability
IO-001–003input, diagnostics, streamingsources/jq-manual.txt, sources/jq.testjqcapability
CONF-001–003staged assets, scoped runner use, terminal verificationsources/INSTRUCTIONS.md, sources/run_conformance.py, sources/full_test.shsources/*test harness and acceptance contract

Test and Acceptance Strategy

Implementation stories use focused sources/run_conformance.py --select slices matching their construct. Parser stories also exercise the supplied %%FAIL cases. No intermediate story runs full_test.sh or the unscoped runner. CONF-003 is the sole terminal full-suite story and declares Suite: full; it depends on all implementation stories and asserts only the full harness exit status. Sea Trial st-001 proves the same complete corpus requirement.

Sequencing and Dependencies

Build the executable boundary first, then lexer/parser, then generator evaluation and value semantics. Implement paths and assignment after accessors and generators. Add control flow and functions before higher-level builtins. Implement collection, text, regex, date, I/O, and streaming groups afterward. Stage all assets before acceptance execution. The terminal full-suite verification is last and depends on every implementation story. No external service or package dependency exists.

Source Conflicts and Gaps

No unresolved cross-source conflicts or blockers were found. The fixed Python standard-library runtime, executable contract, complete-corpus gate, excluded module-loader cases, and forbidden third-party implementations are consistent across the supplied instructions, harness, corpus, manual, lexer, parser, and builtin reference.

Analysis Notes

generated: 2026-08-22T00:00:00Z blueprint: /mnt/c/Users/barlo/projects/drydock/uat/jq/runs/20260822.044627/workspace/targets/jq/blueprint

Quality: Ready blockers: 0 questions: 0 features: 10 stories: 42 stack: Python standard library display_name: not proposed short_description: not proposed

The project type is cli. The source-defined story breakdown is broad but remains below the 100-story blocker threshold. The 42-story decomposition follows the supplied implementation order and major manual/conformance domains.

METADATA.md

The Target's identity and lifecycle state. Source: workspace/METADATA.md.

AUTHORITATIVE PROJECT METADATA — FIELDS SHOULD BE CURRENT

name: jq display_name: drydock jq Uat Kit short_description: Flagship drydock UAT kit. ~620 conformance test conditions from the upstream jq test suite (46 excluded, reasons in exclusions.txt). Provenance: byte-for-byte upstream files from github.com/jqlang/jq at tag jq-1.8.2, SHA-256 verified in PROVENANCE.md. last_analyzed: 2026-08-22 version: 0.19 updated: 2026-08-23T12:16:56+00:00 build_sub_state: complete build_state: built last_planned: 2026-08-22 last_built: 2026-08-23

COMPASS.md

The standing guidance every block was built under. Source: workspace/COMPASS.md.

COMPASS: jq

Compass

Build a standalone interpreter for the jq language as described in sources/jq-manual.txt. The product is an executable file named jq at the application root. It reads JSON from standard input, evaluates a jq filter as an ordered generator, and writes each value the filter produces to standard output as one compact JSON value per line.

Correctness is measured by the upstream jq conformance corpus sources/jq.test, taken verbatim from jq 1.8.2, minus the cases named in sources/exclusions.txt. The goal is every case passing, none failed and none errored.

Constraints

  • Implement in Python using only the standard library.
  • Provide an executable named jq at the application root, invoked as ./jq -c '<program>'.
  • -c is the only option exercised. No other command-line option is required.
  • Run without network access, package installation, or external runtime dependencies.
  • Exit 0 when the program compiled and ran to completion, 3 when it did not compile, and 5

when it compiled and raised at run time. The harness grades on this distinction.

  • Diagnostics go to standard error and are never compared.

Guardrails

  • Do not shell out to a system jq executable.
  • Do not use a third-party jq implementation or binding.
  • Do not modify, rewrite, trim, regenerate, or substitute any file under sources/. Those assets

are restored before grading and an edit is reported as tampering.

  • Preserve generator ordering, multiplicity, backtracking, and partial-output runtime behavior.
  • Keep compile failures distinct from runtime failures using exit codes 3 and 5.

Verification Protocol

This section is normative. It governs which story may invoke the supplied harness, and how.

Invoking the harness

sources/run_conformance.py requires the environment variable JQ, the command that runs the candidate implementation. Without it the harness exits 2 on its own usage code, which is a harness fault and never a verdict about the interpreter. Every invocation, in every acceptance criterion and every developer command, supplies it:

JQ="$PWD/jq" python3 sources/run_conformance.py            # whole corpus, the scored run
JQ="$PWD/jq" python3 sources/run_conformance.py --select 'reduce'   # run one construct for real

Those two commands are the only ways this build runs the harness. They are specified verbatim below under The two harness invocations, together with the flag this build forbids.

sources/ is read only. No story edits, patches, or regenerates sources/run_conformance.py, sources/jq.test, or sources/exclusions.txt; a harness defect is reported, not repaired in place. A story that needs to experiment with the harness works on a copy outside sources/, and every acceptance criterion invokes the original sources/run_conformance.py.

An acceptance criterion written in Python supplies it by extending the inherited environment, never by replacing it:

env={**os.environ, "JQ": str(build_dir / "jq")}

env={"JQ": ...} alone leaves the child with no PATH, so nothing it invokes resolves and the criterion is false at every level of implementation quality.

sources/full_test.sh sets JQ itself for the runner it wraps and therefore takes no environment from its caller.

The harness reserves exit 2 for its own faults — a missing corpus, an unset JQ, a stale exclusion list. Exit 2 never means the interpreter is wrong.

The summary line is:

jq conformance: NNN passed, N failed, N errored, N skipped (corpus jq.test @ jq-1.8.2)

The two harness invocations

An acceptance criterion that runs sources/run_conformance.py uses one of these two commands. No criterion in this build passes any other flag to the harness.

Story kindCommandExecutes cases?Asserts
Every behavioral story--select <regex> --jsonYes, the selected sliceexit 0, zero fail, zero error, non-zero case count
Terminal story (once, last)sh sources/full_test.shYes, all of themexit 0

The staging story does not appear in this table. It does not run the harness at all; see The staging story below.

--list is never run

sources/run_conformance.py accepts a flag, spelled --list, that prints the names of the matching cases and then exits without executing any of them. sources/INSTRUCTIONS.md, the file header, and --help all document it.

This build never runs it. Not in an acceptance criterion, not in a story, not in a script, not in a command typed by a build agent, not while developing and not while verifying. The string --list does not appear anywhere in this project's output. If you have written it, that line is wrong — delete it and use one of the two commands above.

A Drydock build is headless. There is no one watching the output, so a mode whose entire purpose is to print something for a person to read has no reader and no reason to run.

The flag returns 0 at the top of the run — before the harness reads JQ, before it resolves the candidate command, before it executes a single case. A criterion built on it passes when jq is an empty file, when jq does not exist, and when the story it gates was never written. It is not a weak proof, not a partial proof, and not an acceptable proof for staging, for scaffolding, or for an early story whose implementation is incomplete. It is not a proof. Thirty-six criteria in one earlier plan of this project used it, every one of them reported green, and it cost three days.

If you are writing a criterion and reaching for that flag, the reason is always the same: the story's code does not exist yet and you want a command that will not fail. That is the definition of a criterion that proves nothing. Write the --select ... --json form instead and let it be red until the story makes it green. A criterion is supposed to fail before its story is built.

The same prohibition covers any other flag whose effect is to not execute the cases — enumeration, dry-run, validation, or help. If a flag's documented purpose is "run nothing", it has no place in an acceptance criterion.

Behavioral criterion — copy this, changing only SELECT

import json
import os
import subprocess
import sys

SELECT = r"reduce"

result = subprocess.run(
    [sys.executable, "sources/run_conformance.py", "--select", SELECT, "--json"],
    capture_output=True,
    text=True,
    env={**os.environ, "JQ": f"{os.getcwd()}/jq"},
)
print(result.stdout)
print(result.stderr, file=sys.stderr)
report = json.loads(result.stdout)
tally = report["summary"]
assert sum(tally.values()) > 0, f"selector matched no case: {SELECT}"
assert tally["fail"] == 0 and tally["error"] == 0, tally
assert result.returncode == 0, result.returncode

Three assertions, and all three are required.

  1. The selector matched something. --select is a regular expression matched against the

program text of each case. A selector that matches nothing yields zero cases, zero failures, and exit 0 — green, and worth nothing. Alternations naming ideas rather than syntax (closure, recursive, optional) match no jq program and are the common way to write one by accident. Select on syntax the corpus actually contains: reduce, foreach, def, as \$, try, //, path(.

  1. No case failed or errored. Read off the parsed JSON tally, not off any printed line.
  2. The exit status is 0. The harness returns 0 only when fail and error are both zero,

and reserves 2 for its own faults — a missing corpus, an unset JQ, a stale exclusion list. Exit 2 is never a verdict about the interpreter.

--json writes the report and nothing else to stdout, so json.loads(result.stdout) is total. Do not assert against the human summary line, and do not grep stdout for passed or failed.

The terminal story

The terminal story is the last story in the build order: the one on which every other story is a transitive dependency, and after which no further story runs. It is a verification story. Its job is not to add capability but to prove that the capability every preceding story delivered is present, together, at the end of the build.

The terminal story of this project runs sh sources/full_test.sh, asserts returncode == 0, prints the captured stdout and stderr so a failure is diagnosable from the evidence alone, and carries the Sea Trial. It is the only story permitted to run the whole corpus.

A story is not terminal because its name contains "verify", because it is a test harness, or because it stages the test assets. Staging the corpus is foundational work that happens early; running the corpus is terminal work that happens last. Do not place a whole-corpus gate on a story that cannot yet run it — it fails vacuously and teaches nothing.

Scope of every other story

Every non-terminal story is gated on its own declared behavior only, through --select against the constructs that story implements, and the criterion asserts the selected slice passes. A non-terminal story never invokes sources/full_test.sh and never runs the corpus unfiltered: a partial interpreter fails most of an authoritative corpus by construction, and its unimplemented cases exhaust the harness's per-case timeout rather than returning, so the unscoped run costs the most exactly where it teaches the least.

Regression across stories is not the responsibility of any story's criteria. Drydock re-runs every previously proven criterion after each block and attributes a criterion that was green and is now red to the block that broke it, so a criterion proven at story 2 and broken at story 6 fails story

  1. Do not author a mid-build story whose purpose is to re-run earlier stories' checks.

The staging story

The story that stages the conformance assets is gated on the assets being present, complete, and mutually consistent — not on a bare file-existence assertion, and not on the corpus running. It proves that in process, by importing the harness and calling its parsers directly. It never launches the harness, so the question of which flags to pass does not arise:

import sys

sys.path.insert(0, "sources")
import run_conformance as harness

EXPECTED_CASES = 550
EXPECTED_EXCLUSIONS = 13

cases = harness.parse_corpus(harness.CORPUS.read_text(encoding="utf-8"))
excluded = harness.apply_exclusions(cases, harness.parse_exclusions(harness.EXCLUSIONS))
assert len(cases) == EXPECTED_CASES, len(cases)
assert len(excluded) == EXPECTED_EXCLUSIONS, len(excluded)

This reads state rather than output: the harness module imports, the corpus parses into the expected number of cases, and every exclusion still matches a case — apply_exclusions raises on a stale entry, so a corpus and an exclusion list that have drifted apart fail here rather than silently skipping cases later.

It claims nothing about the interpreter, because at this point in the build there is nothing to claim. Every story that claims a construct works runs that construct through --select ... --json.

The corpus

sources/jq.test documents its own format in its header. Cases are separated by blank lines; blank lines and # lines are ignored. A case is a program line, an input line, and then the expected output values, one per line. A case preceded by %%FAIL is a program that must be rejected at compile time; the following lines are upstream jq's diagnostic, which the harness records but never compares. Reproducing jq's exact error text is reverse-engineering a C implementation rather than conforming to a specification, so a %%FAIL case passes on exit 3 alone.

Values are compared structurally, not textually. 1 and 1.0 are the same jq value, and so are two objects whose keys print in a different order. Output formatting is therefore not under test, but the number and order of values is.

sources/exclusions.txt names the corpus cases this kit cannot run, with the reason. They are the module-loader cases, whose import and include resolve against a search path of fixture files a flat source import cannot carry. They are reported as skipped and are not part of the score.

The module grammar cases are not excluded and must pass. module (.+1); 0, module []; 0, include "a" (.+1); 0, include "a" []; 0, include "\ "; 0, include "\(a)"; 0, and %::wat are all %%FAIL cases: the front end parses the module syntax far enough to reject them, without ever touching the filesystem.

<!-- drydock:build-write-guardrail:start -->

Build Write Guardrail

  • Authorized build directory: /mnt/c/Users/barlo/projects/drydock/uat/jq/runs/20260822.044627/build/jq
  • Authorized Target directory: /mnt/c/Users/barlo/projects/drydock/uat/jq/runs/20260822.044627/workspace/targets/jq
  • Build agents have permission to create, modify, and remove files required by the active build block inside these authorized directories.
  • No path outside these authorized directories may be modified.
  • Protected Drydock artifacts:
    • /mnt/c/Users/barlo/projects/drydock/uat/jq/runs/20260822.044627/workspace/targets/jq/blueprint/
    • /mnt/c/Users/barlo/projects/drydock/uat/jq/runs/20260822.044627/workspace/targets/jq/MANIFEST.md
    • /mnt/c/Users/barlo/projects/drydock/uat/jq/runs/20260822.044627/workspace/targets/jq/COMPASS.md
    • /mnt/c/Users/barlo/projects/drydock/uat/jq/runs/20260822.044627/workspace/targets/jq/QuarterDeck/
    • /mnt/c/Users/barlo/projects/drydock/uat/jq/runs/20260822.044627/workspace/targets/jq/evidence/

<!-- drydock:build-write-guardrail:end -->

TECHNOLOGY_STACK.md

The technology the plan committed to. Source: workspace/TECHNOLOGY_STACK.md.

Technology Stack

Approved: 2026-08-14

Technology decisions of record for this Target. One row per technology, naming the Rigging best-practice file that governs building it.

A — in the Rigging column means no Rigging guidance exists for that technology; the builder applies general best practice instead. Adding a row never requires a matching Rigging file.

This file is owned by the UAT kit. It is seeded into the Target before analyze, which never overwrites it, and drydock plan reads it to assign per-story stack: guidance.

TechnologyRiggingNotes
Pythonpython.mdPython 3.11 or newer. Standard library only; the deliverable declares no third-party runtime dependency.
Shellcommon.mdPOSIX sh for the supplied scoring entry point.

SEA_TRIALS.md

The trials declared for this Target. Source: workspace/SEA_TRIALS.md.

Sea Trials: jq

Policy

ConsequenceOn FAILOn INCONCLUSIVE
blocksfailattest
scoresscorescore
attestsreportreport

st-001: The supplied scoring script passes

Type: technical
Required: yes
Criterion: The completed interpreter shall make sh sources/full_test.sh exit zero; that script's exit status is the sole acceptance verdict.
Testability: deterministic
Consequence: blocks
Verification: proof
Command: ["sh", "sources/full_test.sh"]
Pattern: ubiquitous

SOUNDINGS.md

What the run measured about itself. Source: workspace/SOUNDINGS.md.

Soundings

Per-assertion acceptance board, one row per Blueprint Programmatic Acceptance check. drydock plan projects every assertion as — UNVERIFIED; drydock score ac sets the Status column from deterministic proof results. A rerun of drydock plan resets Status to — UNVERIFIED; rescore to refresh.

StatusBlueprintAC IdTextEvidenceVerified At
~ PREPASSEDARCHITECTURE.mdarchitecture-runtimeThe declared runtime stack is available using only Python standard-library modules.green at this block's baseline too, before its code existed — confirm the criterion exercises the story's work2026-08-23T12:21:00+00:00
~ PREPASSEDARCHITECTURE.mdarchitecture-contractThe staged conformance runner exposes the process exit-code contract required by the architecture.green at this block's baseline too, before its code existed — confirm the criterion exercises the story's work2026-08-23T12:21:00+00:00
~ PREPASSEDFEATURE-EXEC-001.mdexec-entry-conformanceThe executable entry point passes the corpus slice containing the primitive interface programs.green at this block's baseline too, before its code existed — confirm the criterion exercises the story's work2026-08-23T12:21:00+00:00
~ PREPASSEDFEATURE-EXEC-001.mdexec-is-runnableThe deliverable is directly executable at the application root.green at this block's baseline too, before its code existed — confirm the criterion exercises the story's work2026-08-23T12:21:00+00:00
~ PREPASSEDFEATURE-EXEC-002.mdcompile-exit-codeA syntactically invalid jq program returns the compile-failure status.green at this block's baseline too, before its code existed — confirm the criterion exercises the story's work2026-08-23T12:21:00+00:00
~ PREPASSEDFEATURE-EXEC-002.mdruntime-exit-codeA compiled jq program that raises returns the runtime-failure status.green at this block's baseline too, before its code existed — confirm the criterion exercises the story's work2026-08-23T12:21:00+00:00
~ PREPASSEDFEATURE-EXEC-002.mdpartial-runtime-outputValues emitted before a runtime error remain available on stdout.green at this block's baseline too, before its code existed — confirm the criterion exercises the story's work2026-08-23T12:21:00+00:00
~ PREPASSEDFEATURE-EXEC-003.mdmultiple-input-valuesMultiple JSON input values are processed in order and emitted one per line.green at this block's baseline too, before its code existed — confirm the criterion exercises the story's work2026-08-23T12:21:00+00:00
✓ PASSFEATURE-EXEC-003.mdgenerator-line-outputMultiple outputs generated from one input preserve order and multiplicity.2026-08-23T12:21:00+00:00
~ PREPASSEDFEATURE-EXEC-003.mdcompact-json-outputGenerated objects are serialized as single-line JSON values.green at this block's baseline too, before its code existed — confirm the criterion exercises the story's work2026-08-23T12:21:00+00:00
~ PREPASSEDFEATURE-CONF-001.mdconf-001-assetsThe staged corpus parses into the authoritative case set and all declared exclusions match cases.green at this block's baseline too, before its code existed — confirm the criterion exercises the story's work2026-08-23T12:21:00+00:00
~ PREPASSEDFEATURE-PARSE-001.mdlexer-conformanceThe lexer and front end pass the corpus slice containing primitive literals and identity syntax.green at this block's baseline too, before its code existed — confirm the criterion exercises the story's work2026-08-23T12:21:00+00:00
~ PREPASSEDFEATURE-PARSE-001.mdlexer-rejects-invalid-sourceAn invalid lexical character is rejected with the compile-failure status.green at this block's baseline too, before its code existed — confirm the criterion exercises the story's work2026-08-23T12:21:00+00:00
✓ PASSFEATURE-PARSE-001.mdlexer-commentsComments do not alter evaluation of the surrounding jq program.2026-08-23T12:21:00+00:00
✓ PASSFEATURE-PARSE-002.mdparse-002-conformanceThe executable passes every selected corpus case covering interpolation, URI formatting, and Base64 formatting.2026-08-23T12:21:00+00:00
✓ PASSFEATURE-PARSE-003.mdparse-003-conformanceThe executable passes every selected corpus case exercising expression punctuation, accessors, collections, and operators.2026-08-23T12:21:00+00:00
✓ PASSFEATURE-PARSE-004.mdparse-004-conformanceThe executable passes every selected corpus case covering declarations, control syntax, bindings, reductions, labels, and required compile failures.2026-08-23T12:21:00+00:00
~ PREPASSEDFEATURE-CORE-001.mdcore-001-conformanceThe executable evaluates identity, empty, range, and generator ordering as ordered streams.green at this block's baseline too, before its code existed — confirm the criterion exercises the story's work2026-08-23T12:21:00+00:00
~ PREPASSEDFEATURE-CORE-002.mdcore-002-conformanceThe executable evaluates pipes, commas, arrays, objects, and composed operators.green at this block's baseline too, before its code existed — confirm the criterion exercises the story's work2026-08-23T12:21:00+00:00
~ PREPASSEDFEATURE-CORE-003.mdcore-003-conformanceThe executable evaluates optional errors and try/catch while preserving runtime failure distinction.green at this block's baseline too, before its code existed — confirm the criterion exercises the story's work2026-08-23T12:21:00+00:00
~ PREPASSEDFEATURE-CORE-004.mdcore-004-conformanceThe executable evaluates jq truthiness, equality, inequality, and ordering semantics.green at this block's baseline too, before its code existed — confirm the criterion exercises the story's work2026-08-23T12:21:00+00:00
✓ PASSFEATURE-VALUE-001.mdvalue-001-conformanceThe authoritative corpus cases exercising jq values and special numeric behavior execute successfully.2026-08-23T12:21:00+00:00
~ PREPASSEDFEATURE-VALUE-002.mdvalue-002-conformanceThe authoritative corpus cases exercising field and index access execute successfully.green at this block's baseline too, before its code existed — confirm the criterion exercises the story's work2026-08-23T12:21:00+00:00
~ PREPASSEDFEATURE-VALUE-003.mdvalue-003-conformanceThe authoritative corpus cases exercising slices and collection iteration execute successfully.green at this block's baseline too, before its code existed — confirm the criterion exercises the story's work2026-08-23T12:21:00+00:00
✓ PASSFEATURE-VALUE-004.mdvalue-004-conformanceThe implementation passes the authoritative corpus slice covering type, length, numeric predicates, conversions, and math functions.2026-08-23T12:21:00+00:00
~ PREPASSEDFEATURE-FLOW-001.mdflow-001-conformanceThe implementation passes the authoritative corpus slice covering arithmetic and structural operators.green at this block's baseline too, before its code existed — confirm the criterion exercises the story's work2026-08-23T12:21:00+00:00
✓ PASSFEATURE-FLOW-002.mdflow-002-conformanceThe implementation passes the authoritative corpus slice covering Boolean and alternative operators.2026-08-23T12:21:00+00:00
~ PREPASSEDFEATURE-FLOW-003.mdflow-003-conformanceThe implementation passes the authoritative corpus slice covering conditionals, try/catch, and optional evaluation.green at this block's baseline too, before its code existed — confirm the criterion exercises the story's work2026-08-23T12:21:00+00:00
~ PREPASSEDFEATURE-FLOW-004.mdflow-004-conformanceThe implementation passes the authoritative corpus slice covering labels and breaks.green at this block's baseline too, before its code existed — confirm the criterion exercises the story's work2026-08-23T12:21:00+00:00
✓ PASSFEATURE-FLOW-005.mdflow-005-conformanceThe executable passes the authoritative conformance cases exercising reductions and iteration controls.2026-08-23T12:21:00+00:00
~ PREPASSEDFEATURE-FLOW-006.mdflow-006-conformanceThe executable passes the authoritative conformance cases exercising recursive generators and recursive descent.green at this block's baseline too, before its code existed — confirm the criterion exercises the story's work2026-08-23T12:21:00+00:00
~ PREPASSEDFEATURE-FUNC-001.mdfunc-001-conformanceThe executable passes the authoritative conformance cases exercising lexical bindings and variable lookup.green at this block's baseline too, before its code existed — confirm the criterion exercises the story's work2026-08-23T12:21:00+00:00
~ PREPASSEDFEATURE-FUNC-002.mdfunc-002-conformanceThe executable passes the authoritative conformance cases exercising filter and value function parameters.green at this block's baseline too, before its code existed — confirm the criterion exercises the story's work2026-08-23T12:21:00+00:00
~ PREPASSEDFEATURE-FUNC-003.mdfunc-003-conformanceThe executable passes the authoritative conformance cases exercising function definitions, scope, redefinition, and recursion.green at this block's baseline too, before its code existed — confirm the criterion exercises the story's work2026-08-23T12:21:00+00:00
~ PREPASSEDFEATURE-FUNC-004.mdfunc-004-conformanceThe authoritative corpus slice covering destructuring patterns and alternative bindings executes and passes.green at this block's baseline too, before its code existed — confirm the criterion exercises the story's work2026-08-23T12:21:00+00:00
~ PREPASSEDFEATURE-PATH-001.mdpath-001-conformanceThe authoritative corpus slice covering path discovery and projection executes and passes.green at this block's baseline too, before its code existed — confirm the criterion exercises the story's work2026-08-23T12:21:00+00:00
~ PREPASSEDFEATURE-PATH-002.mdpath-002-conformanceThe authoritative corpus slice covering getpath, setpath, and delpaths executes and passes.green at this block's baseline too, before its code existed — confirm the criterion exercises the story's work2026-08-23T12:21:00+00:00
~ PREPASSEDFEATURE-PATH-003.mdpath-003-conformanceThe authoritative corpus slice covering deletion and assignment operators executes and passes.green at this block's baseline too, before its code existed — confirm the criterion exercises the story's work2026-08-23T12:21:00+00:00
~ PREPASSEDFEATURE-PATH-004.mdpath-004-conformanceThe authoritative corpus slice covering complex assignment edge cases executes and passes.green at this block's baseline too, before its code existed — confirm the criterion exercises the story's work2026-08-23T12:21:00+00:00
✓ PASSFEATURE-DATA-001.mddata-001-conformanceThe collection transformation slice executes matching corpus cases and passes all selected cases.2026-08-23T12:21:00+00:00
~ PREPASSEDFEATURE-DATA-002.mddata-002-conformanceThe sorting, grouping, uniqueness, and extrema slice executes matching corpus cases and passes all selected cases.green at this block's baseline too, before its code existed — confirm the criterion exercises the story's work2026-08-23T12:21:00+00:00
✓ PASSFEATURE-DATA-003.mddata-003-conformanceThe object-entry, key, membership, and containment slice executes matching corpus cases and passes all selected cases.2026-08-23T12:21:00+00:00
✓ PASSFEATURE-DATA-004.mddata-004-conformanceThe index, membership, quantifier, and emptiness slice executes matching corpus cases and passes all selected cases.2026-08-23T12:21:00+00:00
✓ PASSFEATURE-TEXT-001.mdtext-001-conformanceThe string manipulation slice executes matching corpus cases and passes all selected cases.2026-08-23T12:21:00+00:00
~ PREPASSEDFEATURE-TEXT-002.mdtext-002-scoped-conformanceThe authoritative corpus cases covering JSON conversion and output formats execute and pass.green at this block's baseline too, before its code existed — confirm the criterion exercises the story's work2026-08-23T12:21:00+00:00
~ PREPASSEDFEATURE-TEXT-002.mdtext-002-formatsThe corpus exercises the declared format families rather than an empty selector.green at this block's baseline too, before its code existed — confirm the criterion exercises the story's work2026-08-23T12:21:00+00:00
✗ FAILFEATURE-TEXT-003.mdtext-003-regex-conformanceThe authoritative corpus cases covering regular-expression filters execute and pass.assert sum(summary.values()) > 0 → AssertionError2026-08-23T12:21:00+00:00
✗ FAILFEATURE-TEXT-003.mdtext-003-capturesThe selected corpus includes matching, named capture, and replacement behavior.assert sum(summary.values()) > 0 → AssertionError2026-08-23T12:21:00+00:00
✓ PASSFEATURE-TEXT-004.mdtext-004-date-conformanceThe authoritative corpus cases covering date and time filters execute and pass.2026-08-23T12:21:00+00:00
✓ PASSFEATURE-TEXT-004.mdtext-004-utcThe selected corpus exercises both ISO convenience filters and low-level UTC conversions.2026-08-23T12:21:00+00:00
~ PREPASSEDFEATURE-IO-001.mdio-001-input-conformanceThe authoritative corpus cases covering input stream controls execute and pass.green at this block's baseline too, before its code existed — confirm the criterion exercises the story's work2026-08-23T12:21:00+00:00
~ PREPASSEDFEATURE-IO-001.mdio-001-streamsThe selected corpus includes both single-next-input and remaining-input stream behavior.green at this block's baseline too, before its code existed — confirm the criterion exercises the story's work2026-08-23T12:21:00+00:00
✓ PASSFEATURE-IO-002.mdio-002-diagnostics-conformanceThe authoritative corpus cases covering debug, stderr, and halt_error execute and pass.2026-08-23T12:21:00+00:00
✓ PASSFEATURE-IO-002.mdio-002-channelsThe selected corpus exercises diagnostic filters while the conformance runner observes the declared process contract.2026-08-23T12:21:00+00:00
✗ FAILFEATURE-IO-003.mdio-003-conformanceThe streaming transformation cases selected from the authoritative corpus execute and pass.assert sum(summary.values()) > 0 → AssertionError2026-08-23T12:21:00+00:00
~ PREPASSEDFEATURE-CONF-002.mdconf-002-scoped-runThe scoped verification assets expose the candidate binding and machine-readable selector contracts.green at this block's baseline too, before its code existed — confirm the criterion exercises the story's work2026-08-23T12:21:00+00:00
✓ PASSFEATURE-CONF-003.mdconf-003-full-suiteThe supplied complete conformance suite passes with a successful exit status.2026-08-23T12:21:00+00:00