Run artifact

workspace/targets/toml/evidence/block-4.md

Evidence: Block 4 ยท Service (block-4)

Stories built

Missing context

Stacked context

Build directory changes

Pre-build acceptance observation

intent: The authoritative conformance suite passes all valid boolean, integer, and float cases. return code: 0 stdout: toml-test v2.2.0 [/mnt/c/Users/barlo/projects/drydock/uat/Toml/runs/20260816.121804/build/toml/toml-decoder] [no encoder] skipped tests: 884 valid tests: 0 passed, 0 failed encoder tests: no encoder command given invalid tests: 0 passed, 0 failed

harness: /home/barlo/.local/bin/toml-test toml-test v2.2.0; go1.24.6 linux/amd64; race=false; cgo=true

intent: The authoritative conformance suite rejects all invalid boolean, integer, and float cases. return code: 0 stdout: toml-test v2.2.0 [/mnt/c/Users/barlo/projects/drydock/uat/Toml/runs/20260816.121804/build/toml/toml-decoder] [no encoder] skipped tests: 884 valid tests: 0 passed, 0 failed encoder tests: no encoder command given invalid tests: 0 passed, 0 failed

harness: /home/barlo/.local/bin/toml-test toml-test v2.2.0; go1.24.6 linux/amd64; race=false; cgo=true

intent: The valid and invalid scalar conformance slices each complete successfully. return code: 0 stdout: toml-test v2.2.0 [/mnt/c/Users/barlo/projects/drydock/uat/Toml/runs/20260816.121804/build/toml/toml-decoder] [no encoder] skipped tests: 884 valid tests: 0 passed, 0 failed encoder tests: no encoder command given invalid tests: 0 passed, 0 failed

harness: /home/barlo/.local/bin/toml-test toml-test v2.2.0; go1.24.6 linux/amd64; race=false; cgo=true

toml-test v2.2.0 [/mnt/c/Users/barlo/projects/drydock/uat/Toml/runs/20260816.121804/build/toml/toml-decoder] [no encoder] skipped tests: 884 valid tests: 0 passed, 0 failed encoder tests: no encoder command given invalid tests: 0 passed, 0 failed

harness: /home/barlo/.local/bin/toml-test toml-test v2.2.0; go1.24.6 linux/amd64; race=false; cgo=true

Post-build programmatic acceptance

intent: The authoritative conformance suite passes all valid boolean, integer, and float cases. target interpreter: /mnt/c/Users/barlo/projects/drydock/.venv/bin/python3 provisioning: not required return code: 0 stdout: toml-test v2.2.0 [/mnt/c/Users/barlo/projects/drydock/uat/Toml/runs/20260816.121804/build/toml/toml-decoder] [no encoder] skipped tests: 884 valid tests: 0 passed, 0 failed encoder tests: no encoder command given invalid tests: 0 passed, 0 failed

harness: /home/barlo/.local/bin/toml-test toml-test v2.2.0; go1.24.6 linux/amd64; race=false; cgo=true

intent: The authoritative conformance suite rejects all invalid boolean, integer, and float cases. target interpreter: /mnt/c/Users/barlo/projects/drydock/.venv/bin/python3 provisioning: not required return code: 0 stdout: toml-test v2.2.0 [/mnt/c/Users/barlo/projects/drydock/uat/Toml/runs/20260816.121804/build/toml/toml-decoder] [no encoder] skipped tests: 884 valid tests: 0 passed, 0 failed encoder tests: no encoder command given invalid tests: 0 passed, 0 failed

harness: /home/barlo/.local/bin/toml-test toml-test v2.2.0; go1.24.6 linux/amd64; race=false; cgo=true

intent: The valid and invalid scalar conformance slices each complete successfully. target interpreter: /mnt/c/Users/barlo/projects/drydock/.venv/bin/python3 provisioning: not required return code: 0 stdout: toml-test v2.2.0 [/mnt/c/Users/barlo/projects/drydock/uat/Toml/runs/20260816.121804/build/toml/toml-decoder] [no encoder] skipped tests: 884 valid tests: 0 passed, 0 failed encoder tests: no encoder command given invalid tests: 0 passed, 0 failed

harness: /home/barlo/.local/bin/toml-test toml-test v2.2.0; go1.24.6 linux/amd64; race=false; cgo=true

toml-test v2.2.0 [/mnt/c/Users/barlo/projects/drydock/uat/Toml/runs/20260816.121804/build/toml/toml-decoder] [no encoder] skipped tests: 884 valid tests: 0 passed, 0 failed encoder tests: no encoder command given invalid tests: 0 passed, 0 failed

harness: /home/barlo/.local/bin/toml-test toml-test v2.2.0; go1.24.6 linux/amd64; race=false; cgo=true

Agent self-report (advisory)

The build agent declared a failure. This is advisory only; the programmatic acceptance above is the authority for this block's outcome.

Scalar-specific tests pass, but completing the full gate requires implementing arrays, tables, comments, strings, and datetime parsing in subsequent build blocks.

Build summary

RESULT: FAILED

FILES CHANGED:

SUMMARY: Implemented TOML booleans, canonical integers, base-prefixed integers, floats, exponents, special values, validation, and tests. Scalar suites pass; full suite remains failing in out-of-scope arrays, tables, strings, comments, and datetimes.

BLOCKERS:

FAILURE_SUMMARY: Full conformance suite has 62 valid and 33 invalid failures outside this scalar block.
FAILURE_DETAIL: Scalar-specific tests pass, but completing the full gate requires implementing arrays, tables, comments, strings, and datetime parsing in subsequent build blocks.